Semantic SDMX vocabulary
type: Ontology
version info: 3.0.0
comment: This vocabulary extends the data cube vocabulary to support publication of statistical data in RDF, using an information model based on SDMX 3.0
created: 2025-07-18
title: Vocabulary for publishing SDMX 3.0 statistical data in RDF
source: sdmx.org
references: standards-2
contributor: SemanticGroup
has part: concept
has part: code
has part: agency

Data Flow Definition
type: Class
subclass of: DataSet
comment: Abstract concept (i.e. the structure without any data) of a flow of data that providers will provide for different reference periods.

described by
type: Property
range: Resource
comment: Associates a Dataflow and thereby a Data Structure Definition to the data set.

DataStructureDefinition
type: Class
subclass of: DataStructureDefinition

SDMX Concept Scheme
type: Class
subclass of: ConceptScheme

SDMX Concept
type: Class
subclass of: Concept

SDMX CodeList
type: Class
subclass of: CodeList

SDMX Agency
type: Class
subclass of: PublicOrganisation

agency ID
type: Property
range: SDMX Agency

Has agency-specific label
type: Property
comment: Relates a code to agency-specific labels defined by specific agencies.
range: Literal

SDMX Glossary Concept Type
type: Class

Cross-domain concept
type: SDMX Glossary Concept Type

Concept type
type: Property
type: ObjectProperty
domain: Concept
range: SDMX Glossary Concept Type
comment: Used to explicitly denote Concepts which are cross-domain.

SDMX Recommended Representation Datatype
type: Class
subclass of: Datatype
comment: A controlled vocabulary of datatypes used in SDMX Recommended Representation.

AlphaNumeric
type: Datatype
type: SDMX Recommended Representation Datatype

Basic Time Period
type: Datatype
type: SDMX Recommended Representation Datatype

Codelist
type: Datatype
type: SDMX Recommended Representation Datatype

Codelist (Partial)
type: Datatype
type: SDMX Recommended Representation Datatype

Concept Scheme
type: Datatype
type: SDMX Recommended Representation Datatype

DateTime
type: Datatype
type: SDMX Recommended Representation Datatype
subclass of: dateTime

Decimal
type: Datatype
type: SDMX Recommended Representation Datatype
subclass of: decimal

Integer
type: Datatype
type: SDMX Recommended Representation Datatype
subclass of: integer

Observational Time Period
type: Datatype
type: SDMX Recommended Representation Datatype

String
type: Datatype
type: SDMX Recommended Representation Datatype
subclass of: string

Time Range
type: Datatype
type: SDMX Recommended Representation Datatype

Recommended representation
type: Property
type: ObjectProperty
domain: Concept
range: SDMX Recommended Representation Datatype
comment: Recommended type of value for the Concept term.

Codelist ID
type: Property
type: DatatypeProperty
comment: Unique identifier for the Codelist associated with the Concept.
domain: Concept