Semantic SDMX vocabulary
type: Ontology
version info: 3.0.0
comment: This vocabulary extends the data cube vocabulary to support publication of statistical data in RDF, using an information model based on SDMX 3.0
created: 2025-07-18
title: Vocabulary for publishing SDMX 3.0 statistical data in RDF
source: sdmx.org
references: standards-2
contributor: SemanticPro R&D Group
has part: concept
has part: code
has part: agency

SemanticPro R&D Group
type: Organization
type: Agent

Data Flow Definition
type: Class
subclass of: DataSet
comment: Abstract concept (i.e. the structure without any data) of a flow of data that providers will provide for different reference periods.

described by
type: Property
range: Resource
comment: Associates a Dataflow and thereby a Data Structure Definition to the data set.

DataStructureDefinition
type: Class
subclass of: DataStructureDefinition

SDMX Concept Scheme
type: Class
subclass of: ConceptScheme

SDMX Concept
type: Class
subclass of: Concept

SDMX CodeList
type: Class
subclass of: CodeList

SDMX Agency
type: Class
subclass of: PublicOrganisation

agency ID
type: Property
range: SDMX Agency

Has agency-specific label
type: Property
comment: Relates a code to agency-specific labels defined by specific agencies.
range: Literal