See also

Defined by

Definition

Concept6676209356265816761
type: Class
subclass of: Concept
in scheme: Commodity code list
top concept of: Commodity code list

Commodity code list
type: ConceptScheme
subclass of: ConceptScheme
version info: 1.1
definition: A reference commodity codelist based on UNSD:CL_COMMODITY(1.0)
has top concept: Concept6676209356265816761

SubClass of