Manufacture of footwear
type: Concept
Additional Content Note: This class also includes: - manufacture of rubber, wooden or plastic parts of footwear
CoreContentNote: This class includes: - manufacture of footwear for all purposes, of any material, by any process, including moulding - manufacture of leather parts of footwear (e.g. manufacture of uppers and parts of uppers, outer and inner soles, heels) - manufacture of gaiters, chaps and similar articles
Exclusion Note: This class excludes: - manufacture of knitted or crocheted footwear without applied soles, see 14.10 - manufacture of footwear of textile material without applied soles, except knitted or crocheted, see 14.29 - manufacture of ski boots, see 32.30 - manufacture of prescription orthopaedic shoes, see 32.50
broader: Manufacture of footwear
in scheme: Statistical Classification of Economic Activities in the European Community, Rev. 2.1 (NACE Rev. 2.1)
Notation: 15.20
top concept of: Statistical Classification of Economic Activities in the European Community, Rev. 2.1 (NACE Rev. 2.1)

ConceptNoneRandom0.5832384261841402
type: ConceptAssociation
description: NACE Rev. 2.1 class 25.21 is mapped to NACE Rev. 2 classes 25.21, 25.30
Type: 8:9
Source Concept: Manufacture of central heating radiators, steam generators and boilers
Target Concept: http://data.europa.eu/ux2/nace2/2530
Target Concept: http://data.europa.eu/ux2/nace2/2521
in scheme: Statistical Classification of Economic Activities in the European Community, Rev. 2.1 (NACE Rev. 2.1)
scope note: 25.21: - manufacture of radiators for central heating, non-electrically heated - manufacture of nuclear reactors, except isotope separators - manufacture of marine or power boilers 25.30: - manufacture of steam or other vapour generating boilers - manufacture of auxiliary plant for use with steam or other vapour generating boilers, e.g. economisers, super heaters, steam collectors and accumulators - manufacture of condensers for steam or other vapour power units
top concept of: Statistical Classification of Economic Activities in the European Community, Rev. 2.1 (NACE Rev. 2.1)
Mapping Cardinality: n m

ConceptNoneRandom0.408508542933557
type: ConceptAssociation
description: NACE Rev. 2.1 class 46.15 is mapped to NACE Rev. 2 classes 46.15, 82.99
Type: 78:65
Source Concept: Activities of agents involved in the wholesale of furniture, household goods, hardware and ironmongery
Target Concept: http://data.europa.eu/ux2/nace2/4615
Target Concept: http://data.europa.eu/ux2/nace2/8299
in scheme: Statistical Classification of Economic Activities in the European Community, Rev. 2.1 (NACE Rev. 2.1)
scope note: 46.15: - activities of agents involved in the wholesale of furniture, household goods, hardware and ironmongery 82.99: - activities of independent auctioneers
top concept of: Statistical Classification of Economic Activities in the European Community, Rev. 2.1 (NACE Rev. 2.1)
Mapping Cardinality: n m

Landfilling or permanent storage
type: Concept
Additional Content Note: This class also includes: - permanent underground storage of waste in a deep geological cavity (e.g. in salt or potassium mines) - storage of captured carbon dioxide
CoreContentNote: This class includes the disposal and treatment prior to disposal of non-hazardous or hazardous waste, whether the waste is solid or not, onto or into land (i.e. underground), or in permanent waste storage facilities or sites. This class includes: - operation of landfills for the disposal of waste - treatment of organic waste for landfilling or permanent storage - disposal of by-products of animal origin in landfills
Exclusion Note: This class excludes: - operation of facilities where waste is unloaded for further transport, see 38.1 - operation of facilities where recoverable materials are sorted, see 38.21 - decontamination, cleaning up land, water and toxic material abatement, see 39.00
broader: Waste disposal without recovery
in scheme: Statistical Classification of Economic Activities in the European Community, Rev. 2.1 (NACE Rev. 2.1)
Notation: 38.32
top concept of: Statistical Classification of Economic Activities in the European Community, Rev. 2.1 (NACE Rev. 2.1)

ConceptNoneRandom0.6593574982681666
type: ConceptAssociation
description: NACE Rev. 2.1 group 87.2 is mapped to NACE Rev. 2 group 87.2
Type: 1:1
Source Concept: Residential care activities for persons living with or having a diagnosis of a mental illness or substance abuse
Target Concept: http://data.europa.eu/ux2/nace2/872
in scheme: Statistical Classification of Economic Activities in the European Community, Rev. 2.1 (NACE Rev. 2.1)
top concept of: Statistical Classification of Economic Activities in the European Community, Rev. 2.1 (NACE Rev. 2.1)
Mapping Cardinality: 1 1

ConceptNoneRandom0.9383993829266267
type: ConceptAssociation
description: NACE Rev. 2.1 group 30.3 is mapped to NACE Rev. 2 group 30.3
Type: 1:1
Source Concept: Manufacture of air and spacecraft and related machinery
Target Concept: http://data.europa.eu/ux2/nace2/303
in scheme: Statistical Classification of Economic Activities in the European Community, Rev. 2.1 (NACE Rev. 2.1)
top concept of: Statistical Classification of Economic Activities in the European Community, Rev. 2.1 (NACE Rev. 2.1)
Mapping Cardinality: 1 1

Defence activities
type: Concept
CoreContentNote: This class includes: - administration, supervision and operation of military defence affairs and land, sea, air and space defence forces, e.g.: • combat forces of army, navy and air force • engineering, transport, communication, intelligence, materiel, personnel and other non-combat forces and commands • reserve and auxiliary defence forces • military logistics (provision of equipment, structures, supplies, etc.) • health activities for military personnel in the field - administration, operation and support of civil defence forces - support for the elaboration of contingency plans and the carrying out of exercises in which civilian institutions and populations are involved - administration of defence-related research and development policies and related funds
Exclusion Note: This class excludes: - research and experimental development activities, see division 72 - provision of military aid to foreign countries, see 84.21 - activities of military tribunals, see 84.23 - provision of supplies for domestic emergency use in case of peacetime disasters, see 84.24 - educational activities of military schools, colleges and academies, see 85.40 - activities of military hospitals, see 86.10
broader: Provision of services to the community as a whole
in scheme: Statistical Classification of Economic Activities in the European Community, Rev. 2.1 (NACE Rev. 2.1)
Notation: 84.22
top concept of: Statistical Classification of Economic Activities in the European Community, Rev. 2.1 (NACE Rev. 2.1)

ConceptNoneRandom0.7117100645333494
type: ConceptAssociation
description: NACE Rev. 2.1 division 71 is mapped to NACE Rev. 2 division 71
Type: 1:1
Source Concept: Architectural and engineering activities; technical testing and analysis
Target Concept: http://data.europa.eu/ux2/nace2/71
in scheme: Statistical Classification of Economic Activities in the European Community, Rev. 2.1 (NACE Rev. 2.1)
top concept of: Statistical Classification of Economic Activities in the European Community, Rev. 2.1 (NACE Rev. 2.1)
Mapping Cardinality: 1 1

ConceptNoneRandom0.8278420058266468
type: ConceptAssociation
description: NACE Rev. 2.1 group 52.1 is mapped to NACE Rev. 2 group 52.1
Type: 42:34
Source Concept: Warehousing and storage
Target Concept: http://data.europa.eu/ux2/nace2/521
in scheme: Statistical Classification of Economic Activities in the European Community, Rev. 2.1 (NACE Rev. 2.1)
top concept of: Statistical Classification of Economic Activities in the European Community, Rev. 2.1 (NACE Rev. 2.1)
Mapping Cardinality: n m

Manufacture of rubber products
type: Concept
CoreContentNote: This group includes the manufacture of rubber products.
broader: Manufacture of rubber and plastic products
in scheme: Statistical Classification of Economic Activities in the European Community, Rev. 2.1 (NACE Rev. 2.1)
Notation: 22.1
top concept of: Statistical Classification of Economic Activities in the European Community, Rev. 2.1 (NACE Rev. 2.1)

ConceptNoneRandom0.164907077601395
type: ConceptAssociation
description: NACE Rev. 2.1 group 43.6 is mapped to NACE Rev. 2 group 82.9
Type: 42:34
Source Concept: Intermediation service activities for specialised construction services
Target Concept: http://data.europa.eu/ux2/nace2/829
in scheme: Statistical Classification of Economic Activities in the European Community, Rev. 2.1 (NACE Rev. 2.1)
top concept of: Statistical Classification of Economic Activities in the European Community, Rev. 2.1 (NACE Rev. 2.1)
Mapping Cardinality: n m

ConceptNoneRandom0.04468651872263807
type: ConceptAssociation
description: NACE Rev. 2.1 class 11.05 is mapped to NACE Rev. 2 class 11.05
Type: 1:1
Source Concept: Manufacture of beer
Target Concept: http://data.europa.eu/ux2/nace2/1105
in scheme: Statistical Classification of Economic Activities in the European Community, Rev. 2.1 (NACE Rev. 2.1)
scope note: the content of the NACE Rev 2.1 class is fully covered in the corresponding NACE Rev 2 class
top concept of: Statistical Classification of Economic Activities in the European Community, Rev. 2.1 (NACE Rev. 2.1)
Mapping Cardinality: 1 1

Wired, wireless, and satellite telecommunication activities
type: Concept
CoreContentNote: This class includes: - operating, maintaining or providing access to facilities for the transmission of voice, data, text, sound and video using wired, wireless or satellite telecommunication infrastructure, including: • operating and maintaining switching and transmission facilities to provide point-to-point communication via landlines, microwave or a combination of landlines and satellite link-ups • operating of cable distribution systems (e.g. for distribution of data and television signals) with or without providing customers with third-party video-on-demand services • provision of internet access by the operator of the infrastructure • maintaining and operating cellular and other wireless telecommunication networks (including paging systems) • delivery of visual, aural or textual programming received from cable networks, local television stations or radio networks to consumers via direct-to-home satellite systems or via internet protocol television (the units classified here generally do not produce programming material) • voice over internet protocol (VoIP) provision by the operator of the infrastructure The transmission facilities that carry out these activities, may be based on a single technology or a combination of technologies.
Exclusion Note: This class excludes: - installation of telecommunication, computer network and cable television wiring in buildings, including fibre-optic wiring without operating facilities for the transmission of data, see 43.21 - publishing of instant messaging or satellite geolocation applications, see 58.29 - telecommunication reselling activities and intermediation service activities for telecommunication, see 61.20 - provision of telephone and internet access in facilities open to the public (e.g. internet cafés), see 61.20 - voice over internet protocol (VoIP) provision, without operating facilities for the transmission of data, see 61.90
broader: Wired, wireless, and satellite telecommunication activities
in scheme: Statistical Classification of Economic Activities in the European Community, Rev. 2.1 (NACE Rev. 2.1)
Notation: 61.10
top concept of: Statistical Classification of Economic Activities in the European Community, Rev. 2.1 (NACE Rev. 2.1)

Motion picture, video and television programme production, sound recording and music publishing activities
type: Concept
Additional Content Note: This division also includes sound recording activities, in other words: the production of original (sound) master recordings, releasing, promoting and distributing them; the publishing of music, associated with its distribution directly to the public via streaming and downloads; sound recording service activities in a studio or elsewhere.
CoreContentNote: This division includes production of theatrical and non-theatrical motion pictures, videos or audiovisual works whether for direct projection in theatres, for broadcasting or streaming; supporting post-production activities (for example film editing, cutting, dubbing or conversion to video streaming formats); distribution of motion pictures and other audiovisual productions to other industries; as well as the projection of motion pictures or other audiovisual productions. Further included is the buying and selling of distribution rights for motion pictures or other audiovisual productions.
Exclusion Note: This division excludes the provision of streaming distribution services and downloads not associated with publishing of the content (see division 60), activities of independent musicians and actors, directors, stage designers and support activities to the performing arts (see section S), wholesale and retail sale of audio and video recordings on physical media (see section G), and video rental (see section O).
broader: PUBLISHING, BROADCASTING, AND CONTENT PRODUCTION AND DISTRIBUTION ACTIVITIES
in scheme: Statistical Classification of Economic Activities in the European Community, Rev. 2.1 (NACE Rev. 2.1)
Notation: 59
top concept of: Statistical Classification of Economic Activities in the European Community, Rev. 2.1 (NACE Rev. 2.1)

Activities of brokers and agents for electric power and natural gas
type: Concept
broader: Electricity, gas, steam and air conditioning supply
in scheme: Statistical Classification of Economic Activities in the European Community, Rev. 2.1 (NACE Rev. 2.1)
Notation: 35.4
top concept of: Statistical Classification of Economic Activities in the European Community, Rev. 2.1 (NACE Rev. 2.1)

ConceptNoneRandom0.02260577568165334
type: ConceptAssociation
description: NACE Rev. 2.1 class 71.11 is mapped to NACE Rev. 2 class 71.11
Type: 1:1
Source Concept: Architectural activities
Target Concept: http://data.europa.eu/ux2/nace2/7111
in scheme: Statistical Classification of Economic Activities in the European Community, Rev. 2.1 (NACE Rev. 2.1)
scope note: the content of the NACE Rev 2.1 class is fully covered in the corresponding NACE Rev 2 class
top concept of: Statistical Classification of Economic Activities in the European Community, Rev. 2.1 (NACE Rev. 2.1)
Mapping Cardinality: 1 1

Marine aquaculture
type: Concept
Additional Content Note: This class also includes: - aquaculture activities in brackish waters - land-based aquaculture activities in salt water filled tanks and reservoirs - operation of marine fish hatcheries and marine worm farms - marine microalgae cultivation
CoreContentNote: This class includes: - fish farming in sea water, including farming of marine ornamental fish - production of bivalve spat (e.g. oyster mussel, etc.), lobsterlings, shrimp post-larvae, fish fry and fingerlings - growing of seaweed and algae - culture of crustaceans, bivalves, other molluscs and other aquatic animals in sea water
Exclusion Note: This class excludes: - frog farming, see 03.22 - operation of sport fishing preserves, see 93.19
broader: Aquaculture
in scheme: Statistical Classification of Economic Activities in the European Community, Rev. 2.1 (NACE Rev. 2.1)
Notation: 03.21
top concept of: Statistical Classification of Economic Activities in the European Community, Rev. 2.1 (NACE Rev. 2.1)

Publishing activities
type: Concept
CoreContentNote: This division includes the publishing of books, brochures, leaflets, dictionaries, encyclopaedias, atlases, maps and charts; the publishing of newspapers, journals and periodicals; the publishing of directories and mailing lists, and other publishing (including software publishing). Publishing includes the acquisition of copyrights to content (information products) and making this content available to the general public by engaging in (or arranging for) the reproduction and distribution of this content in various forms. Publishers may license rights to others to distribute their content, or they may publish and distribute content they create or own. All the feasible forms of publishing (in print, digital, analogue, or any other form) and self-publishing activities are included in this division, except publishing of motion pictures and music. This division covers the streaming of content (for example, software and books), by content publishers.
Exclusion Note: This division excludes the production of motion pictures, videos and movies, the publishing of music and the production of original (sound) master recordings, see division 59. Also excluded are obtaining rights from publishers to broadcast and distribute content (see division 60), computer programming activities (see division 62), printing (see group 18.1) and the mass reproduction of recorded media (see class 18.20).
broader: PUBLISHING, BROADCASTING, AND CONTENT PRODUCTION AND DISTRIBUTION ACTIVITIES
in scheme: Statistical Classification of Economic Activities in the European Community, Rev. 2.1 (NACE Rev. 2.1)
Notation: 58
top concept of: Statistical Classification of Economic Activities in the European Community, Rev. 2.1 (NACE Rev. 2.1)

PUBLIC ADMINISTRATION AND DEFENCE; COMPULSORY SOCIAL SECURITY
type: Concept
Additional Content Note: This section also includes compulsory social security activities.
CoreContentNote: This section includes activities of a governmental nature, normally carried out by the public administration. This includes the enactment and judicial interpretation of laws and their pursuant regulation, as well as the administration of programmes based on them, legislative activities, taxation, national defence, public order and safety, immigration services, foreign affairs and the administration of government programmes. The legal or institutional status is not, in itself, the determining factor for an activity to belong in this section, rather than the activity being of a nature specified in the previous paragraph. This means that activities classified elsewhere in NACE do not fall under this section, even if carried out by public entities (for example, the administration of the school system – in other words, regulations, checks, curricula – falls under this section, but teaching itself does not (see section Q), while a prison or military hospital is classified to health (see section R)). Similarly, some activities described in this section may be carried out by non-government units.
in scheme: Statistical Classification of Economic Activities in the European Community, Rev. 2.1 (NACE Rev. 2.1)
Notation: P
top concept of: Statistical Classification of Economic Activities in the European Community, Rev. 2.1 (NACE Rev. 2.1)

Manufacture of food products
type: Concept
Additional Content Note: This division also includes the manufacture of liquids considered food or that use similar manufacturing processes (for example, milk and fruit juice/ concentrate).
CoreContentNote: This division includes the processing of products of agriculture, forestry and fishing into food for humans or animals, and includes the production of various intermediate products that are not directly food products. The activity often generates associated products of greater or lesser value (for example, hides from slaughtering, or oilcake from oil production). This division is organised by activities dealing with different kinds of products: meat, fish, fruits and vegetables, fats and oils, milk products, grain mill products, animal feed and other food products. Production can be carried out for own account, as well as for third parties, as in custom slaughtering. Some activities are considered manufacturing even though there is retail sale of the products in the producers’ own shop (for example, those activities performed in bakeries, pastry shops and prepared meat shops which sell their own production). However, where the processing is minimal and does not lead to a real transformation, the unit is classified to section G.
Exclusion Note: This division excludes the preparation of meals for immediate consumption, see division 56.
broader: MANUFACTURING
in scheme: Statistical Classification of Economic Activities in the European Community, Rev. 2.1 (NACE Rev. 2.1)
Notation: 10
top concept of: Statistical Classification of Economic Activities in the European Community, Rev. 2.1 (NACE Rev. 2.1)

Incineration without energy recovery
type: Concept
CoreContentNote: This class includes the disposal and treatment prior to disposal of waste by combustion or thermal treatment without energy recovery.
Exclusion Note: This class excludes: - thermal treatment with the resulting production of energy, see 38.22
broader: Waste disposal without recovery
in scheme: Statistical Classification of Economic Activities in the European Community, Rev. 2.1 (NACE Rev. 2.1)
Notation: 38.31
top concept of: Statistical Classification of Economic Activities in the European Community, Rev. 2.1 (NACE Rev. 2.1)

ConceptNoneRandom0.5322982347501154
type: ConceptAssociation
description: NACE Rev. 2.1 class 01.25 is mapped to NACE Rev. 2 class 01.25
Type: 1:1
Source Concept: Growing of other tree and bush fruits and nuts
Target Concept: http://data.europa.eu/ux2/nace2/0125
in scheme: Statistical Classification of Economic Activities in the European Community, Rev. 2.1 (NACE Rev. 2.1)
scope note: the content of the NACE Rev 2.1 class is fully covered in the corresponding NACE Rev 2 class
top concept of: Statistical Classification of Economic Activities in the European Community, Rev. 2.1 (NACE Rev. 2.1)
Mapping Cardinality: 1 1

ConceptNoneRandom0.7462938483168031
type: ConceptAssociation
description: NACE Rev. 2.1 class 25.22 is mapped to NACE Rev. 2 class 25.29
Type: 1:1
Source Concept: Manufacture of other tanks, reservoirs and containers of metal
Target Concept: http://data.europa.eu/ux2/nace2/2529
in scheme: Statistical Classification of Economic Activities in the European Community, Rev. 2.1 (NACE Rev. 2.1)
scope note: the content of the NACE Rev 2.1 class is fully covered in the corresponding NACE Rev 2 class
top concept of: Statistical Classification of Economic Activities in the European Community, Rev. 2.1 (NACE Rev. 2.1)
Mapping Cardinality: 1 1

ConceptNoneRandom0.3395638377441048
type: ConceptAssociation
description: NACE Rev. 2.1 class 71.12 is mapped to NACE Rev. 2 class 71.12
Type: 1:1
Source Concept: Engineering activities and related technical consultancy
Target Concept: http://data.europa.eu/ux2/nace2/7112
in scheme: Statistical Classification of Economic Activities in the European Community, Rev. 2.1 (NACE Rev. 2.1)
scope note: the content of the NACE Rev 2.1 class is fully covered in the corresponding NACE Rev 2 class
top concept of: Statistical Classification of Economic Activities in the European Community, Rev. 2.1 (NACE Rev. 2.1)
Mapping Cardinality: 1 1

ConceptNoneRandom0.523425368583103
type: ConceptAssociation
description: NACE Rev. 2.1 class 01.23 is mapped to NACE Rev. 2 class 01.23
Type: 1:1
Source Concept: Growing of citrus fruits
Target Concept: http://data.europa.eu/ux2/nace2/0123
in scheme: Statistical Classification of Economic Activities in the European Community, Rev. 2.1 (NACE Rev. 2.1)
scope note: the content of the NACE Rev 2.1 class is fully covered in the corresponding NACE Rev 2 class
top concept of: Statistical Classification of Economic Activities in the European Community, Rev. 2.1 (NACE Rev. 2.1)
Mapping Cardinality: 1 1

ConceptNoneRandom0.42366199714143404
type: ConceptAssociation
description: NACE Rev. 2.1 class 27.40 is mapped to NACE Rev. 2 class 27.40
Type: 1:1
Source Concept: Manufacture of lighting equipment
Target Concept: http://data.europa.eu/ux2/nace2/2740
in scheme: Statistical Classification of Economic Activities in the European Community, Rev. 2.1 (NACE Rev. 2.1)
scope note: the content of the NACE Rev 2.1 class is fully covered in the corresponding NACE Rev 2 class
top concept of: Statistical Classification of Economic Activities in the European Community, Rev. 2.1 (NACE Rev. 2.1)
Mapping Cardinality: 1 1

ConceptNoneRandom0.7948352172072674
type: ConceptAssociation
description: NACE Rev. 2.1 group 52.2 is mapped to NACE Rev. 2 groups 49.4, 52.2
Type: 42:34
Source Concept: Support activities for transportation
Target Concept: http://data.europa.eu/ux2/nace2/522
Target Concept: http://data.europa.eu/ux2/nace2/494
in scheme: Statistical Classification of Economic Activities in the European Community, Rev. 2.1 (NACE Rev. 2.1)
top concept of: Statistical Classification of Economic Activities in the European Community, Rev. 2.1 (NACE Rev. 2.1)
Mapping Cardinality: n m

Justice and judicial activities
type: Concept
CoreContentNote: This class includes: - administration and operation of administrative, civil and criminal law courts, military tribunals, and the judicial system - rendering of judgements and interpretations of the law - activities of public prosecutors - arbitration of civil actions - prison administration and the provision of prison services, including rehabilitation services
Exclusion Note: This class excludes: - legal advice and representation in civil, criminal and other cases, see 69.10 - activities of prison schools, see division 85 - activities of prison hospitals, see 86.10
broader: Provision of services to the community as a whole
in scheme: Statistical Classification of Economic Activities in the European Community, Rev. 2.1 (NACE Rev. 2.1)
Notation: 84.23
top concept of: Statistical Classification of Economic Activities in the European Community, Rev. 2.1 (NACE Rev. 2.1)

ConceptNoneRandom0.2933619334587799
type: ConceptAssociation
description: NACE Rev. 2.1 class 46.16 is mapped to NACE Rev. 2 classes 46.16, 82.99
Type: 78:65
Source Concept: Activities of agents involved in the wholesale of textiles, clothing, fur, footwear and leather goods
Target Concept: http://data.europa.eu/ux2/nace2/4616
Target Concept: http://data.europa.eu/ux2/nace2/8299
in scheme: Statistical Classification of Economic Activities in the European Community, Rev. 2.1 (NACE Rev. 2.1)
scope note: 46.16: -activities of agents involved in the wholesale of textiles, clothing, fur, footwear and leather goods 82.99: - activities of independent auctioneers
top concept of: Statistical Classification of Economic Activities in the European Community, Rev. 2.1 (NACE Rev. 2.1)
Mapping Cardinality: n m

ConceptNoneRandom0.7826106466106114
type: ConceptAssociation
description: NACE Rev. 2.1 group 87.3 is mapped to NACE Rev. 2 group 87.3
Type: 1:1
Source Concept: Residential care activities for older persons or persons with physical disabilities
Target Concept: http://data.europa.eu/ux2/nace2/873
in scheme: Statistical Classification of Economic Activities in the European Community, Rev. 2.1 (NACE Rev. 2.1)
top concept of: Statistical Classification of Economic Activities in the European Community, Rev. 2.1 (NACE Rev. 2.1)
Mapping Cardinality: 1 1

ConceptNoneRandom0.1671501937003399
type: ConceptAssociation
description: NACE Rev. 2.1 division 70 is mapped to NACE Rev. 2 division 70
Type: 2:2
Source Concept: Activities of head offices and management consultancy
Target Concept: http://data.europa.eu/ux2/nace2/70
in scheme: Statistical Classification of Economic Activities in the European Community, Rev. 2.1 (NACE Rev. 2.1)
top concept of: Statistical Classification of Economic Activities in the European Community, Rev. 2.1 (NACE Rev. 2.1)
Mapping Cardinality: n m

Travel agency and tour operator activities
type: Concept
Additional Content Note: This group also includes the activities of tour operators.
CoreContentNote: This group includes the activities of agencies, primarily engaged in the sale of pre-packaged or custom-packaged travel packages, comprising transport, accommodation, tour guide and other services to the general public and commercial clients and the activities of arranging and assembling tours that are sold through travel agencies or directly by agents (for example, tour operators).
broader: Travel agency, tour operator and other reservation service and related activities
in scheme: Statistical Classification of Economic Activities in the European Community, Rev. 2.1 (NACE Rev. 2.1)
Notation: 79.1
top concept of: Statistical Classification of Economic Activities in the European Community, Rev. 2.1 (NACE Rev. 2.1)

ConceptNoneRandom0.646442817019237
type: ConceptAssociation
description: NACE Rev. 2.1 group 30.4 is mapped to NACE Rev. 2 group 30.4
Type: 26:18
Source Concept: Manufacture of military fighting vehicles
Target Concept: http://data.europa.eu/ux2/nace2/304
in scheme: Statistical Classification of Economic Activities in the European Community, Rev. 2.1 (NACE Rev. 2.1)
top concept of: Statistical Classification of Economic Activities in the European Community, Rev. 2.1 (NACE Rev. 2.1)
Mapping Cardinality: n m

ConceptNoneRandom0.7623959989680076
type: ConceptAssociation
description: NACE Rev. 2.1 class 96.40 is mapped to NACE Rev. 2 class 82.99
Type: 78:65
Source Concept: Intermediation service activities for personal services
Target Concept: http://data.europa.eu/ux2/nace2/8299
in scheme: Statistical Classification of Economic Activities in the European Community, Rev. 2.1 (NACE Rev. 2.1)
scope note: the content of the NACE Rev 2.1 class is fully covered in the corresponding NACE Rev 2 class
top concept of: Statistical Classification of Economic Activities in the European Community, Rev. 2.1 (NACE Rev. 2.1)
Mapping Cardinality: n m

ConceptNoneRandom0.9814461328268329
type: ConceptAssociation
description: NACE Rev. 2.1 class 73.30 is mapped to NACE Rev. 2 class 70.21
Type: 1:1
Source Concept: Public relations and communication activities
Target Concept: http://data.europa.eu/ux2/nace2/7021
in scheme: Statistical Classification of Economic Activities in the European Community, Rev. 2.1 (NACE Rev. 2.1)
scope note: the content of the NACE Rev 2.1 class is fully covered in the corresponding NACE Rev 2 class
top concept of: Statistical Classification of Economic Activities in the European Community, Rev. 2.1 (NACE Rev. 2.1)
Mapping Cardinality: 1 1

Manufacture of plastic products
type: Concept
CoreContentNote: This group comprises processing new or spent (in other words, recycled) plastic resins into intermediate or final products, using processes such as compression moulding; extrusion moulding; injection moulding; blow moulding; casting. For most of these, the production process is such that a wide variety of products can be made.
Exclusion Note: This group excludes: - production of plastic parts or accessories which are suitable for use solely or principally for motor vehicles, see 29.3
broader: Manufacture of rubber and plastic products
in scheme: Statistical Classification of Economic Activities in the European Community, Rev. 2.1 (NACE Rev. 2.1)
Notation: 22.2
top concept of: Statistical Classification of Economic Activities in the European Community, Rev. 2.1 (NACE Rev. 2.1)

ConceptNoneRandom0.1595831686319944
type: ConceptAssociation
description: NACE Rev. 2.1 class 11.04 is mapped to NACE Rev. 2 class 11.04
Type: 1:1
Source Concept: Manufacture of other non-distilled fermented beverages
Target Concept: http://data.europa.eu/ux2/nace2/1104
in scheme: Statistical Classification of Economic Activities in the European Community, Rev. 2.1 (NACE Rev. 2.1)
scope note: the content of the NACE Rev 2.1 class is fully covered in the corresponding NACE Rev 2 class
top concept of: Statistical Classification of Economic Activities in the European Community, Rev. 2.1 (NACE Rev. 2.1)
Mapping Cardinality: 1 1

Mining of chemical and fertiliser minerals
type: Concept
Additional Content Note: This class also includes: - guano mining - mining of medicinal mud - extraction processes to produce lithium from brine
CoreContentNote: This class includes: - mining of natural phosphates and natural potassium salts - mining of native sulphur - extraction and preparation of pyrites and pyrrhotite, except roasting - mining of natural barium sulphate and carbonate (barytes and witherite), natural borates, natural magnesium sulphates (kieserite) - mining of earth colours, fluorspar and other minerals valued chiefly as a source of chemicals
Exclusion Note: This class excludes: - extraction of salt, see 08.93 - roasting of iron pyrites, see 20.13 - manufacture of synthetic fertilisers and nitrogen compounds, see 20.15
broader: Mining and quarrying n.e.c.
in scheme: Statistical Classification of Economic Activities in the European Community, Rev. 2.1 (NACE Rev. 2.1)
Notation: 08.91
top concept of: Statistical Classification of Economic Activities in the European Community, Rev. 2.1 (NACE Rev. 2.1)

ConceptNoneRandom0.010357390645876818
type: ConceptAssociation
description: NACE Rev. 2.1 class 58.13 is mapped to NACE Rev. 2 class 58.14
Type: 1:1
Source Concept: Publishing of journals and periodicals
Target Concept: http://data.europa.eu/ux2/nace2/5814
in scheme: Statistical Classification of Economic Activities in the European Community, Rev. 2.1 (NACE Rev. 2.1)
scope note: the content of the NACE Rev 2.1 class is fully covered in the corresponding NACE Rev 2 class
top concept of: Statistical Classification of Economic Activities in the European Community, Rev. 2.1 (NACE Rev. 2.1)
Mapping Cardinality: 1 1

Freshwater aquaculture
type: Concept
Additional Content Note: This class also includes: - freshwater microalgae cultivation
CoreContentNote: This class includes: - fish farming in freshwater, including farming of freshwater ornamental fish - culture of freshwater crustaceans, bivalves, other molluscs and other aquatic animals - operation of fish hatcheries (freshwater) - farming of frogs - growing of seaweed and algae (edible or not)
Exclusion Note: This class excludes: - aquaculture activities in salt water filled tanks and reservoirs, see 03.21 - operation of sport fishing preserves, see 93.19
broader: Aquaculture
in scheme: Statistical Classification of Economic Activities in the European Community, Rev. 2.1 (NACE Rev. 2.1)
Notation: 03.22
top concept of: Statistical Classification of Economic Activities in the European Community, Rev. 2.1 (NACE Rev. 2.1)

Manufacture of beverages
type: Concept
CoreContentNote: This division includes the manufacture of beverages (for example, non-alcoholic beverages and mineral waters, the manufacture of alcoholic beverages mainly through fermentation, beer and wine, and the manufacture of distilled alcoholic beverages).
Exclusion Note: This division excludes: - manufacture of fruit and vegetable juices, see 10.32 - manufacture of milk-based drinks, see 10.51 - manufacture of coffee, tea and maté products, see 10.83
broader: MANUFACTURING
in scheme: Statistical Classification of Economic Activities in the European Community, Rev. 2.1 (NACE Rev. 2.1)
Notation: 11
top concept of: Statistical Classification of Economic Activities in the European Community, Rev. 2.1 (NACE Rev. 2.1)

Manufacture of other special-purpose machinery n.e.c.
type: Concept
CoreContentNote: This class includes: - manufacture of dryers for wood, paper pulp, paper or paperboard and other materials (except for agricultural products and textiles) - manufacture of printing and bookbinding machines, and machines for activities supporting printing on a variety of materials - manufacture of machinery for producing tiles, bricks, shaped ceramic pastes, pipes, graphite electrodes, blackboard chalk, etc. - manufacture of semiconductor manufacturing machinery - manufacture of machines for forming foundry moulds - manufacture of industrial robots performing multiple tasks for special purposes - manufacture of diverse special-purpose machinery and equipment, e.g.: • machines to assemble electric or electronic lamps, tubes (valves) or bulbs • machines for the production or hot working of glass or glassware, glass fibres or yarn • machinery or apparatus for isotopic separation - manufacture of tyre alignment and balancing equipment; balancing equipment (except wheel balancing) - manufacture of central greasing systems - manufacture of aircraft launching gear, aircraft carrier catapults and related equipment - manufacture of automatic bowling alley equipment (e.g. pin-setter) - manufacture of roundabouts, swings, shooting galleries and other fairground amusements - manufacture of waste compressing machines - manufacture of plastering machines - manufacture of turnstiles - manufacture of furling systems, used for winding or releasing the running rigging
Exclusion Note: This class excludes: - manufacture of household appliances, see 27.5 - manufacture of photocopy machines, etc., see 28.23 - manufacture of machinery or equipment to work hard rubber, hard plastics or cold glass, see 28.42 - manufacture of ingot moulds, see 28.91 - manufacture of machines for additive manufacturing, see 28.97
broader: Manufacture of other special-purpose machinery
in scheme: Statistical Classification of Economic Activities in the European Community, Rev. 2.1 (NACE Rev. 2.1)
Notation: 28.99
top concept of: Statistical Classification of Economic Activities in the European Community, Rev. 2.1 (NACE Rev. 2.1)

EDUCATION
type: Concept
Additional Content Note: This section is also based on the distinction between formal and non-formal educational programmes provided by the European classification of learning activities (CLA). Thus, it also includes non-formal instruction primarily concerned with sports, arts and recreation education, and education support activities in groups 85.5 and 85.6. This section also includes education activities run by self-employed / own account / individual / independent lecturers (tutors, academics, instructors); such activities should be classified in group 85.5. This section also includes activities relating to administration, inspection, operation or support of schools and other institutions providing education as well as coordination of sports programmes.
CoreContentNote: This section includes education at any level or for any profession. The instructions may be oral or written and may be provided by radio, television, the internet or via correspondence. Education activities are those having an educational programme, a time frame and some evaluation of the knowledge achieved. This section includes formal initial education at its various levels provided by institutions in the regular school system designed for students as a continuous educational pathway before their first entrance into the labour market, as well as formal education outside the regular school system with programme content and qualifications that are equivalent to those of such initial education (adult education, literacy programmes, and so on). Also included are activities provided at their respective levels by military schools and academies, prison schools, and so on. This section includes compulsory and non-compulsory schooling, as well as public and private education. For each level of education, special education for physically or mentally disabled persons is included. Groups 85.1 to 85.4 take into account the formal education activities provided under the international classification of educational programmes (ISCED-P 2011 classification). The breakdown of the categories in this section is based on the level of education offered as defined by the levels of ISCED-P 2011*. The activities of educational institutions providing courses at ISCED-P 2011 Level 0 are classified in class 85.10, at ISCED-P 2011 Level 1 in class 85.20, at ISCED-P 2011 Level 2 category 24 and Level 3 category 34 in class 85.31, at ISCED-P 2011 2011 Level 2 category 25 and Level 3 category 35 in class 85.32, at ISCED-P 2011 Level 4 in class 85.33 and at ISCED-P 2011 Levels 5 to 8 in group 85.4. Educational institutions classified in groups 85.2 to 85.4 are authorised to certify successful completion of an educational programme, usually in the form of a document officially recognised by the rel…
Exclusion Note: This section excludes: - child day-care activities, see 88.91
in scheme: Statistical Classification of Economic Activities in the European Community, Rev. 2.1 (NACE Rev. 2.1)
Notation: Q
top concept of: Statistical Classification of Economic Activities in the European Community, Rev. 2.1 (NACE Rev. 2.1)

Hairdressing and barber activities
type: Concept
CoreContentNote: This class includes: - hair washing, trimming and cutting, setting, dyeing, tinting, waving, straightening and similar activities - hairstyling - shaving and beard trimming
Exclusion Note: This class excludes: - manufacture of wigs, see 32.99
broader: Hairdressing, beauty treatment, day spa and similar activities
in scheme: Statistical Classification of Economic Activities in the European Community, Rev. 2.1 (NACE Rev. 2.1)
Notation: 96.21
top concept of: Statistical Classification of Economic Activities in the European Community, Rev. 2.1 (NACE Rev. 2.1)

ConceptNoneRandom0.36069656635656633
type: ConceptAssociation
description: NACE Rev. 2.1 class 01.24 is mapped to NACE Rev. 2 class 01.24
Type: 1:1
Source Concept: Growing of pome fruits and stone fruits
Target Concept: http://data.europa.eu/ux2/nace2/0124
in scheme: Statistical Classification of Economic Activities in the European Community, Rev. 2.1 (NACE Rev. 2.1)
scope note: the content of the NACE Rev 2.1 class is fully covered in the corresponding NACE Rev 2 class
top concept of: Statistical Classification of Economic Activities in the European Community, Rev. 2.1 (NACE Rev. 2.1)
Mapping Cardinality: 1 1

ConceptNoneRandom0.7947813304969903
type: ConceptAssociation
description: NACE Rev. 2.1 class 46.13 is mapped to NACE Rev. 2 classes 46.13, 82.99
Type: 78:65
Source Concept: Activities of agents involved in the wholesale of timber and building materials
Target Concept: http://data.europa.eu/ux2/nace2/8299
Target Concept: http://data.europa.eu/ux2/nace2/4613
in scheme: Statistical Classification of Economic Activities in the European Community, Rev. 2.1 (NACE Rev. 2.1)
scope note: 46.13: - activities of agents involved in the wholesale of sanitary equipment - activities of agents involved in the wholesale of: • prefabricated buildings and building equipment • pallets and wooden containers and their parts 82.99: - activities of independent auctioneers
top concept of: Statistical Classification of Economic Activities in the European Community, Rev. 2.1 (NACE Rev. 2.1)
Mapping Cardinality: n m

CoreContentNote

ConceptNoneRandom0.46503484364943726
type: ConceptAssociation
description: NACE Rev. 2.1 class 95.10 is mapped to NACE Rev. 2 classes 95.11, 95.12
Type: 1:2
Source Concept: Repair and maintenance of computers and communication equipment
Target Concept: http://data.europa.eu/ux2/nace2/9512
Target Concept: http://data.europa.eu/ux2/nace2/9511
in scheme: Statistical Classification of Economic Activities in the European Community, Rev. 2.1 (NACE Rev. 2.1)
scope note: 95.11: - repair and maintenance of electronic equipment, e.g. computers and computing machinery, peripheral and communication equipment. - repair and maintenance of: • desktop computers • laptop computers • magnetic disc drives and flash drives • optical disc drives • renovation of discs • printers • monitors • keyboards • webcams • headsets, including in-ear wireless headsets • mice, joysticks and trackball accessories • internal and external computer modems • dedicated computer terminals • computer servers • scanners, including bar code scanners • smart card readers • virtual reality helmets • computer projectors • smart telephones and tablets - repair and maintenance of computer terminals like automatic teller machines (ATMs) and point-of-sale (POS) terminals, not mechanically operated - repair and maintenance of hand-held computers (PDAs) 95.12: - repair and maintenance of communications equipment, e.g.: • cordless telephones • mobile telephones • carrier equipment modems • telefax machines • communications transmission equipment (e.g. routers, bridges, modems) • two-way radios • commercial TV and video cameras
top concept of: Statistical Classification of Economic Activities in the European Community, Rev. 2.1 (NACE Rev. 2.1)
Mapping Cardinality: 1 m

ConceptNoneRandom0.9138462749058965
type: ConceptAssociation
description: NACE Rev. 2.1 class 26.52 is mapped to NACE Rev. 2 class 26.52
Type: 1:1
Source Concept: Manufacture of watches and clocks
Target Concept: http://data.europa.eu/ux2/nace2/2652
in scheme: Statistical Classification of Economic Activities in the European Community, Rev. 2.1 (NACE Rev. 2.1)
scope note: the content of the NACE Rev 2.1 class is fully covered in the corresponding NACE Rev 2 class
top concept of: Statistical Classification of Economic Activities in the European Community, Rev. 2.1 (NACE Rev. 2.1)
Mapping Cardinality: 1 1

ConceptNoneRandom0.04007362231905287
type: ConceptAssociation
description: NACE Rev. 2.1 group 43.4 is mapped to NACE Rev. 2 group 43.9
Type: 26:18
Source Concept: Specialised construction activities in construction of buildings
Target Concept: http://data.europa.eu/ux2/nace2/439
in scheme: Statistical Classification of Economic Activities in the European Community, Rev. 2.1 (NACE Rev. 2.1)
top concept of: Statistical Classification of Economic Activities in the European Community, Rev. 2.1 (NACE Rev. 2.1)
Mapping Cardinality: n m

ConceptNoneRandom0.9153294268185227
type: ConceptAssociation
description: NACE Rev. 2.1 group 65.2 is mapped to NACE Rev. 2 group 65.2
Type: 1:1
Source Concept: Reinsurance
Target Concept: http://data.europa.eu/ux2/nace2/652
in scheme: Statistical Classification of Economic Activities in the European Community, Rev. 2.1 (NACE Rev. 2.1)
top concept of: Statistical Classification of Economic Activities in the European Community, Rev. 2.1 (NACE Rev. 2.1)
Mapping Cardinality: 1 1

ConceptNoneRandom0.6314155420208467
type: ConceptAssociation
description: NACE Rev. 2.1 group 30.1 is mapped to NACE Rev. 2 group 30.1
Type: 1:1
Source Concept: Building of ships and boats
Target Concept: http://data.europa.eu/ux2/nace2/301
in scheme: Statistical Classification of Economic Activities in the European Community, Rev. 2.1 (NACE Rev. 2.1)
top concept of: Statistical Classification of Economic Activities in the European Community, Rev. 2.1 (NACE Rev. 2.1)
Mapping Cardinality: 1 1

ConceptNoneRandom0.3385874753919539
type: ConceptAssociation
description: NACE Rev. 2.1 division 73 is mapped to NACE Rev. 2 divisions 70, 73
Type: 2:2
Source Concept: Activities of advertising, market research and public relations
Target Concept: http://data.europa.eu/ux2/nace2/70
Target Concept: http://data.europa.eu/ux2/nace2/73
in scheme: Statistical Classification of Economic Activities in the European Community, Rev. 2.1 (NACE Rev. 2.1)
top concept of: Statistical Classification of Economic Activities in the European Community, Rev. 2.1 (NACE Rev. 2.1)
Mapping Cardinality: n m

ConceptNoneRandom0.7528261557018736
type: ConceptAssociation
description: NACE Rev. 2.1 class 11.07 is mapped to NACE Rev. 2 classes 10.89, 11.07
Type: 2:2
Source Concept: Manufacture of soft drinks and bottled waters
Target Concept: http://data.europa.eu/ux2/nace2/1107
Target Concept: http://data.europa.eu/ux2/nace2/1089
in scheme: Statistical Classification of Economic Activities in the European Community, Rev. 2.1 (NACE Rev. 2.1)
scope note: 10.89: - production of plant-based milk substitutes (e.g. coconut, rice, almond, soya-based beverages) 11.07: - production of natural mineral waters and other bottled waters - manufacture of soft drinks: • non-alcoholic flavoured and/or sweetened waters: lemonade, orangeade, cola, fruit drinks, tonic waters etc. - manufacture of other non-alcoholic beverages - manufacture of beverages produced with fruit nectars
top concept of: Statistical Classification of Economic Activities in the European Community, Rev. 2.1 (NACE Rev. 2.1)
Mapping Cardinality: n m

Driving school activities
type: Concept
Additional Content Note: This class also includes: - education activities of flying, sailing and shipping schools not issuing commercial certificates and permits
Exclusion Note: This class excludes: - education activities of driving or flying schools for occupational drivers and for professional pilots, see 85.32
broader: Other education
in scheme: Statistical Classification of Economic Activities in the European Community, Rev. 2.1 (NACE Rev. 2.1)
Notation: 85.53
top concept of: Statistical Classification of Economic Activities in the European Community, Rev. 2.1 (NACE Rev. 2.1)

Manufacture of gas, and distribution of gaseous fuels through mains
type: Concept
CoreContentNote: This group includes the manufacture of gas, the storage and the distribution of natural or synthetic gas to the user through a system of mains.
Exclusion Note: This group excludes: - extraction of crude natural gas, see 06.20 - activities of brokers or agents that arrange the sale of gaseous fuels over gas distribution systems operated by others, see 35.4 - transport, usually over long distances, of gas through pipelines, see 49.50 - separate operation of gas pipelines, typically done over long distances, connecting producers with distributors of gas, or between urban centres, see 49.50
broader: Electricity, gas, steam and air conditioning supply
in scheme: Statistical Classification of Economic Activities in the European Community, Rev. 2.1 (NACE Rev. 2.1)
Notation: 35.2
top concept of: Statistical Classification of Economic Activities in the European Community, Rev. 2.1 (NACE Rev. 2.1)

Manufacture of optical instruments, magnetic and optical media and photographic equipment
type: Concept
broader: Manufacture of computer, electronic and optical products
in scheme: Statistical Classification of Economic Activities in the European Community, Rev. 2.1 (NACE Rev. 2.1)
Notation: 26.7
top concept of: Statistical Classification of Economic Activities in the European Community, Rev. 2.1 (NACE Rev. 2.1)

Manufacture of tobacco products
type: Concept
CoreContentNote: This division includes the processing of an agricultural product, tobacco, into a form suitable for final consumption.
broader: MANUFACTURING
in scheme: Statistical Classification of Economic Activities in the European Community, Rev. 2.1 (NACE Rev. 2.1)
Notation: 12
top concept of: Statistical Classification of Economic Activities in the European Community, Rev. 2.1 (NACE Rev. 2.1)

HUMAN HEALTH AND SOCIAL WORK ACTIVITIES
type: Concept
CoreContentNote: This section includes the provision of a wide range of health and social work activities. These activities can be exercised by private or public service providers.
in scheme: Statistical Classification of Economic Activities in the European Community, Rev. 2.1 (NACE Rev. 2.1)
Notation: R
top concept of: Statistical Classification of Economic Activities in the European Community, Rev. 2.1 (NACE Rev. 2.1)

ConceptNoneRandom0.7900448416920656
type: ConceptAssociation
description: NACE Rev. 2.1 class 58.12 is mapped to NACE Rev. 2 class 58.13
Type: 1:1
Source Concept: Publishing of newspapers
Target Concept: http://data.europa.eu/ux2/nace2/5813
in scheme: Statistical Classification of Economic Activities in the European Community, Rev. 2.1 (NACE Rev. 2.1)
scope note: the content of the NACE Rev 2.1 class is fully covered in the corresponding NACE Rev 2 class
top concept of: Statistical Classification of Economic Activities in the European Community, Rev. 2.1 (NACE Rev. 2.1)
Mapping Cardinality: 1 1

ConceptNoneRandom0.05024760281881657
type: ConceptAssociation
description: NACE Rev. 2.1 class 01.27 is mapped to NACE Rev. 2 class 01.27
Type: 1:1
Source Concept: Growing of beverage crops
Target Concept: http://data.europa.eu/ux2/nace2/0127
in scheme: Statistical Classification of Economic Activities in the European Community, Rev. 2.1 (NACE Rev. 2.1)
scope note: the content of the NACE Rev 2.1 class is fully covered in the corresponding NACE Rev 2 class
top concept of: Statistical Classification of Economic Activities in the European Community, Rev. 2.1 (NACE Rev. 2.1)
Mapping Cardinality: 1 1

ConceptNoneRandom0.9502296257799997
type: ConceptAssociation
description: NACE Rev. 2.1 class 02.10 is mapped to NACE Rev. 2 class 02.10
Type: 1:1
Source Concept: Silviculture and other forestry activities
Target Concept: http://data.europa.eu/ux2/nace2/0210
in scheme: Statistical Classification of Economic Activities in the European Community, Rev. 2.1 (NACE Rev. 2.1)
scope note: the content of the NACE Rev 2.1 class is fully covered in the corresponding NACE Rev 2 class
top concept of: Statistical Classification of Economic Activities in the European Community, Rev. 2.1 (NACE Rev. 2.1)
Mapping Cardinality: 1 1

ConceptNoneRandom0.6791943948021146
type: ConceptAssociation
description: NACE Rev. 2.1 class 46.14 is mapped to NACE Rev. 2 classes 46.14, 82.99
Type: 78:65
Source Concept: Activities of agents involved in the wholesale of machinery, industrial equipment, ships and aircraft
Target Concept: http://data.europa.eu/ux2/nace2/4614
Target Concept: http://data.europa.eu/ux2/nace2/8299
in scheme: Statistical Classification of Economic Activities in the European Community, Rev. 2.1 (NACE Rev. 2.1)
scope note: 46.14: - activities of agents involved in the wholesale of: • machinery, including office machinery and computers, industrial equipment, ships and aircraft • telephone and communication equipment, including mobile telephones, modems etc. - activities of agents involved in the wholesale of agricultural equipment including tractors - activities of agents involved in the wholesale of yachts and recreational boats 82.99: - activities of independent auctioneers
top concept of: Statistical Classification of Economic Activities in the European Community, Rev. 2.1 (NACE Rev. 2.1)
Mapping Cardinality: n m

ConceptNoneRandom0.3377620782730004
type: ConceptAssociation
description: NACE Rev. 2.1 group 87.1 is mapped to NACE Rev. 2 group 87.1
Type: 1:1
Source Concept: Residential nursing care activities
Target Concept: http://data.europa.eu/ux2/nace2/871
in scheme: Statistical Classification of Economic Activities in the European Community, Rev. 2.1 (NACE Rev. 2.1)
top concept of: Statistical Classification of Economic Activities in the European Community, Rev. 2.1 (NACE Rev. 2.1)
Mapping Cardinality: 1 1

ConceptNoneRandom0.3600857621905519
type: ConceptAssociation
description: NACE Rev. 2.1 group 65.3 is mapped to NACE Rev. 2 group 65.3
Type: 1:1
Source Concept: Pension funding
Target Concept: http://data.europa.eu/ux2/nace2/653
in scheme: Statistical Classification of Economic Activities in the European Community, Rev. 2.1 (NACE Rev. 2.1)
top concept of: Statistical Classification of Economic Activities in the European Community, Rev. 2.1 (NACE Rev. 2.1)
Mapping Cardinality: 1 1

ConceptNoneRandom0.7901988384132904
type: ConceptAssociation
description: NACE Rev. 2.1 group 30.2 is mapped to NACE Rev. 2 group 30.2
Type: 1:1
Source Concept: Manufacture of railway locomotives and rolling stock
Target Concept: http://data.europa.eu/ux2/nace2/302
in scheme: Statistical Classification of Economic Activities in the European Community, Rev. 2.1 (NACE Rev. 2.1)
top concept of: Statistical Classification of Economic Activities in the European Community, Rev. 2.1 (NACE Rev. 2.1)
Mapping Cardinality: 1 1

ConceptNoneRandom0.9769777239818842
type: ConceptAssociation
description: NACE Rev. 2.1 group 43.5 is mapped to NACE Rev. 2 groups 42.1, 43.9
Type: 26:18
Source Concept: Specialised construction activities in civil engineering
Target Concept: http://data.europa.eu/ux2/nace2/439
Target Concept: http://data.europa.eu/ux2/nace2/421
in scheme: Statistical Classification of Economic Activities in the European Community, Rev. 2.1 (NACE Rev. 2.1)
top concept of: Statistical Classification of Economic Activities in the European Community, Rev. 2.1 (NACE Rev. 2.1)
Mapping Cardinality: n m

ConceptNoneRandom0.9446181245162845
type: ConceptAssociation
description: NACE Rev. 2.1 division 72 is mapped to NACE Rev. 2 division 72
Type: 1:1
Source Concept: Scientific research and development
Target Concept: http://data.europa.eu/ux2/nace2/72
in scheme: Statistical Classification of Economic Activities in the European Community, Rev. 2.1 (NACE Rev. 2.1)
top concept of: Statistical Classification of Economic Activities in the European Community, Rev. 2.1 (NACE Rev. 2.1)
Mapping Cardinality: 1 1

Foreign affairs
type: Concept
CoreContentNote: This class includes: - administration and operation of the ministry of foreign affairs and diplomatic and consular missions stationed abroad or at offices of international organisations - administration, operation and support for information and cultural services intended for distribution beyond national boundaries - aid to foreign countries, whether or not routed through international organisations - provision of military aid to foreign countries - management of foreign trade, international financial and foreign technical affairs
Exclusion Note: This class excludes: - international disaster or conflict refugee services, see 88.99 - activities of extraterritorial organisations and bodies, see 99.00
broader: Provision of services to the community as a whole
in scheme: Statistical Classification of Economic Activities in the European Community, Rev. 2.1 (NACE Rev. 2.1)
Notation: 84.21
top concept of: Statistical Classification of Economic Activities in the European Community, Rev. 2.1 (NACE Rev. 2.1)

Steam and air conditioning supply
type: Concept
broader: Electricity, gas, steam and air conditioning supply
in scheme: Statistical Classification of Economic Activities in the European Community, Rev. 2.1 (NACE Rev. 2.1)
Notation: 35.3
top concept of: Statistical Classification of Economic Activities in the European Community, Rev. 2.1 (NACE Rev. 2.1)

Manufacture of communication equipment
type: Concept
Additional Content Note: This class also includes: - manufacture of smartwatches
CoreContentNote: This class includes the manufacture of telephone and data communication equipment used to move signals electronically through wired or wireless networks (for example, radio and television broadcasts, wireless communication equipment). This class includes: - manufacture of central office switching equipment - manufacture of cordless telephones - manufacture of private branch exchange (PBX) equipment - manufacture of telephone and facsimile equipment, including telephone answering machines - manufacture of data communication equipment (e.g. bridges, routers, gateways) - manufacture of transmitting and receiving antenna - manufacture of cable television equipment - manufacture of pagers - manufacture of mobile telephones - manufacture of mobile communication equipment - manufacture of radio and television studio and broadcasting equipment, including television cameras - manufacture of modems, carrier equipment - manufacture of radio and television transmitters - manufacture of communication devices using infra-red signals (e.g. remote controls)
Exclusion Note: This class excludes: - manufacture of electronic components and sub-assemblies used in communication equipment, including computer modems, see 26.12 - manufacture of printed circuit boards loaded with passive elements, see 26.12 - manufacture of computers and computer peripheral equipment, see 26.20 - manufacture of consumer audio and video equipment, see 26.40 - manufacture of burglar- and fire-alarm systems, sending signals to a control station, see 26.51 - manufacture of global positioning system (GPS) devices, see 26.51 - manufacture of electronic scoreboards, see 27.90 - manufacture of traffic lights, see 27.90
broader: Manufacture of communication equipment
in scheme: Statistical Classification of Economic Activities in the European Community, Rev. 2.1 (NACE Rev. 2.1)
Notation: 26.30
top concept of: Statistical Classification of Economic Activities in the European Community, Rev. 2.1 (NACE Rev. 2.1)

ConceptNoneRandom0.9340488953217433
type: ConceptAssociation
description: NACE Rev. 2.1 class 11.06 is mapped to NACE Rev. 2 class 11.06
Type: 1:1
Source Concept: Manufacture of malt
Target Concept: http://data.europa.eu/ux2/nace2/1106
in scheme: Statistical Classification of Economic Activities in the European Community, Rev. 2.1 (NACE Rev. 2.1)
scope note: the content of the NACE Rev 2.1 class is fully covered in the corresponding NACE Rev 2 class
top concept of: Statistical Classification of Economic Activities in the European Community, Rev. 2.1 (NACE Rev. 2.1)
Mapping Cardinality: 1 1

Manufacture of plastics and rubber machinery
type: Concept
CoreContentNote: This class includes: - manufacture of machinery for working soft rubber or plastics or for the manufacture of products of these materials: • extruders, moulders, pneumatic tyre making or retreading machines and other machines for making a specific rubber or plastic product
Exclusion Note: This class excludes: - manufacture of machines for additive manufacturing, see 28.97
broader: Manufacture of other special-purpose machinery
in scheme: Statistical Classification of Economic Activities in the European Community, Rev. 2.1 (NACE Rev. 2.1)
Notation: 28.96
top concept of: Statistical Classification of Economic Activities in the European Community, Rev. 2.1 (NACE Rev. 2.1)

Manufacture of additive manufacturing machinery
type: Concept
CoreContentNote: This class includes: - manufacture of machines for additive manufacturing by metal, plastics, rubber, plaster, cement, ceramic deposits, etc.
broader: Manufacture of other special-purpose machinery
in scheme: Statistical Classification of Economic Activities in the European Community, Rev. 2.1 (NACE Rev. 2.1)
Notation: 28.97
top concept of: Statistical Classification of Economic Activities in the European Community, Rev. 2.1 (NACE Rev. 2.1)

ConceptNoneRandom0.42871778597341326
type: ConceptAssociation
description: NACE Rev. 2.1 class 58.11 is mapped to NACE Rev. 2 class 58.11
Type: 1:1
Source Concept: Publishing of books
Target Concept: http://data.europa.eu/ux2/nace2/5811
in scheme: Statistical Classification of Economic Activities in the European Community, Rev. 2.1 (NACE Rev. 2.1)
scope note: the content of the NACE Rev 2.1 class is fully covered in the corresponding NACE Rev 2 class
top concept of: Statistical Classification of Economic Activities in the European Community, Rev. 2.1 (NACE Rev. 2.1)
Mapping Cardinality: 1 1

ConceptNoneRandom0.1369307792947012
type: ConceptAssociation
description: NACE Rev. 2.1 class 80.09 is mapped to NACE Rev. 2 classes 74.90, 80.20
Type: 3:2
Source Concept: Security activities n.e.c.
Target Concept: http://data.europa.eu/ux2/nace2/7490
Target Concept: http://data.europa.eu/ux2/nace2/8020
in scheme: Statistical Classification of Economic Activities in the European Community, Rev. 2.1 (NACE Rev. 2.1)
scope note: 74.90: - security consulting activities 80.20: - provision of one or more of the following services: • security system services as part of security service centres or alarm receiving centres (ARC); • remote monitoring and video surveillance systems services, • installation, repair and maintenance of electronic security systems; only if provided in connection with later monitoring and remote monitoring services - security consultants activities - activities in an emergency call and service centre or alarm receiving centre (ARC) - monitoring and remote monitoring of electronic security systems such as burglar alarms, video surveillance systems and fire alarms - monitoring and remote monitoring of mechanical or electronic locking devices, safes and vaults
top concept of: Statistical Classification of Economic Activities in the European Community, Rev. 2.1 (NACE Rev. 2.1)
Mapping Cardinality: n m

Manufacture of textiles
type: Concept
CoreContentNote: This division includes preparation and spinning of textile fibres as well as textile weaving, finishing of textiles and wearing apparel, manufacture of technical textiles, manufacture of made-up textile articles, except apparel (for example, household linen, blankets, rugs, cordage).
Exclusion Note: This division excludes: - growing of natural fibres, see division 01 - manufacture of wearing apparel, see division 14 - manufacture of synthetic and artificial fibres, see 20.60
broader: MANUFACTURING
in scheme: Statistical Classification of Economic Activities in the European Community, Rev. 2.1 (NACE Rev. 2.1)
Notation: 13
top concept of: Statistical Classification of Economic Activities in the European Community, Rev. 2.1 (NACE Rev. 2.1)

ARTS, SPORTS AND RECREATION
type: Concept
Additional Content Note: This section also includes services that facilitate entertainment events and live performances.
CoreContentNote: This section includes a wide range of activities to meet varied cultural, sports and recreational interests of their customers, including live performances, entertainment, the operation of cultural and natural heritage sites, and gambling.
in scheme: Statistical Classification of Economic Activities in the European Community, Rev. 2.1 (NACE Rev. 2.1)
Notation: S
top concept of: Statistical Classification of Economic Activities in the European Community, Rev. 2.1 (NACE Rev. 2.1)

ConceptNoneRandom0.4199887990199217
type: ConceptAssociation
description: NACE Rev. 2.1 class 01.26 is mapped to NACE Rev. 2 class 01.26
Type: 1:1
Source Concept: Growing of oleaginous fruits
Target Concept: http://data.europa.eu/ux2/nace2/0126
in scheme: Statistical Classification of Economic Activities in the European Community, Rev. 2.1 (NACE Rev. 2.1)
scope note: the content of the NACE Rev 2.1 class is fully covered in the corresponding NACE Rev 2 class
top concept of: Statistical Classification of Economic Activities in the European Community, Rev. 2.1 (NACE Rev. 2.1)
Mapping Cardinality: 1 1

ConceptNoneRandom0.9778697306896518
type: ConceptAssociation
description: NACE Rev. 2.1 class 55.90 is mapped to NACE Rev. 2 classes 55.90, 68.20
Type: 2:2
Source Concept: Other accommodation
Target Concept: http://data.europa.eu/ux2/nace2/6820
Target Concept: http://data.europa.eu/ux2/nace2/5590
in scheme: Statistical Classification of Economic Activities in the European Community, Rev. 2.1 (NACE Rev. 2.1)
scope note: 55.90: - accommodation in: • homes and furnished or unfurnished flats or apartments for a period shorter than a year • worker dormitories • boarding houses • student accommodation provided for less than one year at time • railway sleeping cars when not operated by railway companies 68.20: - provision of homes and furnished or unfurnished flats or apartments for a period shorter than a year
top concept of: Statistical Classification of Economic Activities in the European Community, Rev. 2.1 (NACE Rev. 2.1)
Mapping Cardinality: n m

Other education n.e.c.
type: Concept
Additional Content Note: This class also includes: - lifeguard training - survival training - public speaking training - speed-reading instruction - activities of professional instructors and teachers in subjects other than sports, arts and driving
CoreContentNote: This class includes: - education that is not definable by level - academic tutoring - remedial courses - professional examination review courses - language instruction and conversational skills instruction - computer training (e.g. general computer use, programming courses, use of computer applications) - relaxation courses (e.g. meditation courses, breathing techniques, courses of awareness through movement, courses on stress and anxiety relief techniques) - sewing courses - oenology courses - family life courses (e.g. parent–child courses) - training on plant protection products
Exclusion Note: This class excludes: - formal adult literacy programmes, see 85.20 - general secondary education, see 85.31 - technical and vocational secondary education and training, see 85.32 - entertainment activities in retirement homes, see 93.29
broader: Other education
in scheme: Statistical Classification of Economic Activities in the European Community, Rev. 2.1 (NACE Rev. 2.1)
Notation: 85.59
top concept of: Statistical Classification of Economic Activities in the European Community, Rev. 2.1 (NACE Rev. 2.1)

ConceptNoneRandom0.008761653955709159
type: ConceptAssociation
description: NACE Rev. 2.1 group 96.1 is mapped to NACE Rev. 2 group 96.0
Type: 26:18
Source Concept: Washing and cleaning of textile and fur products
Target Concept: http://data.europa.eu/ux2/nace2/960
in scheme: Statistical Classification of Economic Activities in the European Community, Rev. 2.1 (NACE Rev. 2.1)
top concept of: Statistical Classification of Economic Activities in the European Community, Rev. 2.1 (NACE Rev. 2.1)
Mapping Cardinality: n m

ConceptNoneRandom0.31016904256365485
type: ConceptAssociation
description: NACE Rev. 2.1 group 74.3 is mapped to NACE Rev. 2 group 74.3
Type: 1:1
Source Concept: Translation and interpretation activities
Target Concept: http://data.europa.eu/ux2/nace2/743
in scheme: Statistical Classification of Economic Activities in the European Community, Rev. 2.1 (NACE Rev. 2.1)
top concept of: Statistical Classification of Economic Activities in the European Community, Rev. 2.1 (NACE Rev. 2.1)
Mapping Cardinality: 1 1

ConceptNoneRandom0.009325961310799102
type: ConceptAssociation
description: NACE Rev. 2.1 class 46.19 is mapped to NACE Rev. 2 classes 46.19, 82.99
Type: 78:65
Source Concept: Activities of agents involved in non-specialised wholesale
Target Concept: http://data.europa.eu/ux2/nace2/4619
Target Concept: http://data.europa.eu/ux2/nace2/8299
in scheme: Statistical Classification of Economic Activities in the European Community, Rev. 2.1 (NACE Rev. 2.1)
scope note: 46.19: - activities of agents involved in non-specialised wholesale 82.99: - activities of independent auctioneers
top concept of: Statistical Classification of Economic Activities in the European Community, Rev. 2.1 (NACE Rev. 2.1)
Mapping Cardinality: n m

FINANCIAL AND INSURANCE ACTIVITIES
type: Concept
Additional Content Note: This section also includes activities of holding assets, such as the activities of holding companies and financing conduits and the activities of trusts, funds and similar financial entities (division 64), as well as the activities of reinsurance and pension funds (division 65).
CoreContentNote: This section includes financial service activities, insurance activities and financial auxiliary activities, regardless of the technologies used to conduct these activities or support services. Three principal types of activities are classified in this section: raising, obtaining and providing funding (division 64); pooling of risk by underwriting insurance and annuities (division 65); and providing specialised services facilitating or supporting financial or insurance service activities (division 66).
Exclusion Note: This section excludes support activities to financial services that are not financial in nature (for example, IT services supporting banking activities).
in scheme: Statistical Classification of Economic Activities in the European Community, Rev. 2.1 (NACE Rev. 2.1)
Notation: L
top concept of: Statistical Classification of Economic Activities in the European Community, Rev. 2.1 (NACE Rev. 2.1)

Weaving of textiles
type: Concept
broader: Manufacture of textiles
in scheme: Statistical Classification of Economic Activities in the European Community, Rev. 2.1 (NACE Rev. 2.1)
Notation: 13.2
top concept of: Statistical Classification of Economic Activities in the European Community, Rev. 2.1 (NACE Rev. 2.1)

Manufacture of measuring testing instruments, clocks and watches
type: Concept
CoreContentNote: This group includes the manufacture of sensing, measuring, testing and navigating equipment for various industrial and non-industrial purposes, including time-based measuring devices (for example, watches and clocks) and related devices.
broader: Manufacture of computer, electronic and optical products
in scheme: Statistical Classification of Economic Activities in the European Community, Rev. 2.1 (NACE Rev. 2.1)
Notation: 26.5
top concept of: Statistical Classification of Economic Activities in the European Community, Rev. 2.1 (NACE Rev. 2.1)

Manufacture of machinery for paper and paperboard production
type: Concept
CoreContentNote: This class includes: - manufacture of machinery for making paper pulp - manufacture of paper and paperboard making or finishing machinery - manufacture of machinery for making up paper pulp, paper or paperboard articles, including cutting machines for paper of all kinds
broader: Manufacture of other special-purpose machinery
in scheme: Statistical Classification of Economic Activities in the European Community, Rev. 2.1 (NACE Rev. 2.1)
Notation: 28.95
top concept of: Statistical Classification of Economic Activities in the European Community, Rev. 2.1 (NACE Rev. 2.1)

Raising of other animals
type: Concept
CoreContentNote: This class includes: - raising and breeding of semi-domesticated or other live animals, e.g.: • birds (except poultry and ostriches) • insects • rabbits and other fur animals • reindeer - production of bird skins from ranching operations or skins from farming reptiles (e.g. snakes and turtles) - raising and breeding of reptiles, except crocodiles - operation of land worm farms, land mollusc farms, land snail farms, etc. - raising of silkworms, production of silkworm cocoons - beekeeping; production of bees’ byproducts (e.g. honey, beeswax, propolis, bee venom or honeycomb); bee propagation for sale - raising and breeding of pets (except fish), e.g.: • cats and dogs • birds (e.g. parakeets) • hamsters
Exclusion Note: This class excludes: - production of hides and skins originating from hunting and trapping, see 01.70 - raising of live ornamental fish, see 03.2 - operation of frog farms, crocodile farms, marine worm farms, see 03.21, 03.22 - operation of fish farms, see 03.21, 03.22 - boarding and training of pets, see 96.99 - operation of shelters for abandoned pets, see 96.99
broader: Animal production
in scheme: Statistical Classification of Economic Activities in the European Community, Rev. 2.1 (NACE Rev. 2.1)
Notation: 01.48
top concept of: Statistical Classification of Economic Activities in the European Community, Rev. 2.1 (NACE Rev. 2.1)

Media representation
type: Concept
Additional Content Note: This class also includes: - sale of advertising space by intermediaries
CoreContentNote: This class includes: - media representation, i.e. sale or resale of time and space for various media soliciting advertising
Exclusion Note: This class excludes: - public relations and communication activities, see 73.30 - sale of advertising time or space directly by owners of the time or space (publishers, etc.), see the corresponding activity class
broader: Advertising
in scheme: Statistical Classification of Economic Activities in the European Community, Rev. 2.1 (NACE Rev. 2.1)
Notation: 73.12
top concept of: Statistical Classification of Economic Activities in the European Community, Rev. 2.1 (NACE Rev. 2.1)

ConceptNoneRandom0.3730150426021306
type: ConceptAssociation
description: NACE Rev. 2.1 class 43.91 is mapped to NACE Rev. 2 class 43.99
Type: 23:16
Source Concept: Masonry and bricklaying activities
Target Concept: http://data.europa.eu/ux2/nace2/4399
in scheme: Statistical Classification of Economic Activities in the European Community, Rev. 2.1 (NACE Rev. 2.1)
scope note: the content of the NACE Rev 2.1 class is fully covered in the corresponding NACE Rev 2 class
top concept of: Statistical Classification of Economic Activities in the European Community, Rev. 2.1 (NACE Rev. 2.1)
Mapping Cardinality: n m

ConceptNoneRandom0.5409188902073334
type: ConceptAssociation
description: NACE Rev. 2.1 class 01.29 is mapped to NACE Rev. 2 class 01.29
Type: 1:1
Source Concept: Growing of other perennial crops
Target Concept: http://data.europa.eu/ux2/nace2/0129
in scheme: Statistical Classification of Economic Activities in the European Community, Rev. 2.1 (NACE Rev. 2.1)
scope note: the content of the NACE Rev 2.1 class is fully covered in the corresponding NACE Rev 2 class
top concept of: Statistical Classification of Economic Activities in the European Community, Rev. 2.1 (NACE Rev. 2.1)
Mapping Cardinality: 1 1

ConceptNoneRandom0.7923161747013336
type: ConceptAssociation
description: NACE Rev. 2.1 class 82.20 is mapped to NACE Rev. 2 class 82.20
Type: 1:1
Source Concept: Activities of call centres
Target Concept: http://data.europa.eu/ux2/nace2/8220
in scheme: Statistical Classification of Economic Activities in the European Community, Rev. 2.1 (NACE Rev. 2.1)
scope note: the content of the NACE Rev 2.1 class is fully covered in the corresponding NACE Rev 2 class
top concept of: Statistical Classification of Economic Activities in the European Community, Rev. 2.1 (NACE Rev. 2.1)
Mapping Cardinality: 1 1

ConceptNoneRandom0.8860949081455177
type: ConceptAssociation
description: NACE Rev. 2.1 class 26.11 is mapped to NACE Rev. 2 class 26.11
Type: 1:1
Source Concept: Manufacture of electronic components
Target Concept: http://data.europa.eu/ux2/nace2/2611
in scheme: Statistical Classification of Economic Activities in the European Community, Rev. 2.1 (NACE Rev. 2.1)
scope note: the content of the NACE Rev 2.1 class is fully covered in the corresponding NACE Rev 2 class
top concept of: Statistical Classification of Economic Activities in the European Community, Rev. 2.1 (NACE Rev. 2.1)
Mapping Cardinality: 1 1

ConceptNoneRandom0.009699555588559172
type: ConceptAssociation
description: NACE Rev. 2.1 class 50.20 is mapped to NACE Rev. 2 class 50.20
Type: 1:1
Source Concept: Sea and coastal freight water transport
Target Concept: http://data.europa.eu/ux2/nace2/5020
in scheme: Statistical Classification of Economic Activities in the European Community, Rev. 2.1 (NACE Rev. 2.1)
scope note: the content of the NACE Rev 2.1 class is fully covered in the corresponding NACE Rev 2 class
top concept of: Statistical Classification of Economic Activities in the European Community, Rev. 2.1 (NACE Rev. 2.1)
Mapping Cardinality: 1 1

Storage of gas as part of network supply services
type: Concept
CoreContentNote: This class includes: - storage of gaseous fuels - storage of hydrogen gas
Exclusion Note: This class excludes: - gas liquefaction for mine site transport, see 09.10 - storage of gaseous fuels, not part of network energy supply services, see 52.10
broader: Manufacture of gas, and distribution of gaseous fuels through mains
in scheme: Statistical Classification of Economic Activities in the European Community, Rev. 2.1 (NACE Rev. 2.1)
Notation: 35.24
top concept of: Statistical Classification of Economic Activities in the European Community, Rev. 2.1 (NACE Rev. 2.1)

Residential care activities for older persons or persons with physical disabilities
type: Concept
CoreContentNote: This class includes the provision of residential and personal care services for older persons or persons with physical disabilities who are unable to fully care for themselves and/or who choose not to live independently. The care typically includes room, board, supervision and assistance in daily living (for example, housekeeping activities). Nursing care is sometimes provided for residents in separate on-site facilities. This class includes activities of: - assisted living facilities - continuing care retirement communities - homes for older persons with minimal nursing care - rest homes without nursing care
Exclusion Note: This class excludes: - residential nursing care activities for older persons, see 87.10 - provision of residential nursing and rehabilitative services for older persons or persons living with or having a diagnosis of a mental illness, see 87.20 - social work activities with accommodation, see 87.99
broader: Residential care activities for older persons or persons with physical disabilities
in scheme: Statistical Classification of Economic Activities in the European Community, Rev. 2.1 (NACE Rev. 2.1)
Notation: 87.30
top concept of: Statistical Classification of Economic Activities in the European Community, Rev. 2.1 (NACE Rev. 2.1)

ConceptNoneRandom0.42836405321962767
type: ConceptAssociation
description: NACE Rev. 2.1 group 61.1 is mapped to NACE Rev. 2 groups 61.1, 61.2, 61.3
Type: 42:34
Source Concept: Wired, wireless, and satellite telecommunication activities
Target Concept: http://data.europa.eu/ux2/nace2/613
Target Concept: http://data.europa.eu/ux2/nace2/611
Target Concept: http://data.europa.eu/ux2/nace2/612
in scheme: Statistical Classification of Economic Activities in the European Community, Rev. 2.1 (NACE Rev. 2.1)
top concept of: Statistical Classification of Economic Activities in the European Community, Rev. 2.1 (NACE Rev. 2.1)
Mapping Cardinality: n m

ConceptNoneRandom0.5773841628299021
type: ConceptAssociation
description: NACE Rev. 2.1 group 96.2 is mapped to NACE Rev. 2 group 96.0
Type: 26:18
Source Concept: Hairdressing, beauty treatment, day spa and similar activities
Target Concept: http://data.europa.eu/ux2/nace2/960
in scheme: Statistical Classification of Economic Activities in the European Community, Rev. 2.1 (NACE Rev. 2.1)
top concept of: Statistical Classification of Economic Activities in the European Community, Rev. 2.1 (NACE Rev. 2.1)
Mapping Cardinality: n m

Electric power generation, transmission and distribution
type: Concept
CoreContentNote: This group includes the generation of electric power, transmission from generating facilities to distribution centres and distribution to end users. Trade and storage of electric power are also included.
Exclusion Note: This group excludes: - separate production and distribution of steam and heat, see 35.3 - activities of electric power brokers or agents that arrange the sale of electricity via power distribution systems operated by others, see 35.4
broader: Electricity, gas, steam and air conditioning supply
in scheme: Statistical Classification of Economic Activities in the European Community, Rev. 2.1 (NACE Rev. 2.1)
Notation: 35.1
top concept of: Statistical Classification of Economic Activities in the European Community, Rev. 2.1 (NACE Rev. 2.1)

Finishing of textiles
type: Concept
broader: Manufacture of textiles
in scheme: Statistical Classification of Economic Activities in the European Community, Rev. 2.1 (NACE Rev. 2.1)
Notation: 13.3
top concept of: Statistical Classification of Economic Activities in the European Community, Rev. 2.1 (NACE Rev. 2.1)

REAL ESTATE ACTIVITIES
type: Concept
Additional Content Note: This section also includes the development of construction projects for self-owned buildings or civil engineering works for later sale or rental.
CoreContentNote: This section includes the activities of owning, renting out, buying, selling, developing or refurbishing (redeveloping) property. It includes various types of real estate investors (for example, real estate investment companies, real estate investment trust (REITs), real estate asset management firms, real estate funds, real estate development companies or real estate traders, housing cooperatives). Furthermore, it includes agents and/or brokers in one or more of the following: selling or buying real estate, renting out of real estate, providing other real estate services (for example, appraising real estate or acting as a real estate escrow agent). Activities in this section may be carried out on self-owned or leased property and may be carried out on a fee or contract basis.
Exclusion Note: This section excludes: - general construction and specialised construction activities for buildings and civil engineering works, see section F
in scheme: Statistical Classification of Economic Activities in the European Community, Rev. 2.1 (NACE Rev. 2.1)
Notation: M
top concept of: Statistical Classification of Economic Activities in the European Community, Rev. 2.1 (NACE Rev. 2.1)

ConceptNoneRandom0.4654604186863185
type: ConceptAssociation
description: NACE Rev. 2.1 class 92.00 is mapped to NACE Rev. 2 class 92.00
Type: 1:1
Source Concept: Gambling and betting activities
Target Concept: http://data.europa.eu/ux2/nace2/9200
in scheme: Statistical Classification of Economic Activities in the European Community, Rev. 2.1 (NACE Rev. 2.1)
scope note: the content of the NACE Rev 2.1 class is fully covered in the corresponding NACE Rev 2 class
top concept of: Statistical Classification of Economic Activities in the European Community, Rev. 2.1 (NACE Rev. 2.1)
Mapping Cardinality: 1 1

Manufacture of machinery for textile, apparel and leather production
type: Concept
CoreContentNote: This class includes: - manufacture of textile machinery, e.g.: • machines for preparing, producing, extruding, drawing, texturing or cutting man-made textile fibres, materials or yarns • machines for preparing textile fibres (e.g. cotton gins, bale breakers, garnetters, cotton spreaders, wool scourers, wool carbonisers, combs, carders, roving frames) • spinning machines • machines for preparing textile yarns (e.g. reelers, warpers and related machines) • weaving machines (looms), including handlooms • knitting machines • machines for making knotted net, tulle, lace, braid, etc. - manufacture of auxiliary machines or equipment for textile machinery: • dobbies, jacquards, automatic stop motions, shuttle changing mechanisms, spindles and spindle flyers, etc. - manufacture of textile printing machinery - manufacture of machinery for fabric processing: • machinery for washing, bleaching, dyeing, dressing, finishing, coating or impregnating textile fabrics • machines for reeling, unreeling, folding, cutting or pinking textile fabrics - manufacture of laundry machinery: • ironing machines, including fusing presses • commercial washing and drying machines • dry-cleaning machines - manufacture of sewing machines, sewing machine heads and sewing machine needles (whether or not for household use) - manufacture of machines for producing or finishing felt or non-wovens - manufacture of leather machines: • machinery for preparing, tanning or working hides, skins or leather • machinery for making or repairing footwear or other articles of hides, skins, leather or fur skins
Exclusion Note: This class excludes: - manufacture of paper or paperboard cards for use on jacquard machines, see 17.25 - manufacture of domestic washing and drying machines, see 27.51 - manufacture of calendering machines, see 28.29 - manufacture of machines used in bookbinding, see 28.99
broader: Manufacture of other special-purpose machinery
in scheme: Statistical Classification of Economic Activities in the European Community, Rev. 2.1 (NACE Rev. 2.1)
Notation: 28.94
top concept of: Statistical Classification of Economic Activities in the European Community, Rev. 2.1 (NACE Rev. 2.1)

Manufacture of irradiation, electromedical and electrotherapeutic equipment
type: Concept
broader: Manufacture of computer, electronic and optical products
in scheme: Statistical Classification of Economic Activities in the European Community, Rev. 2.1 (NACE Rev. 2.1)
Notation: 26.6
top concept of: Statistical Classification of Economic Activities in the European Community, Rev. 2.1 (NACE Rev. 2.1)

Manufacture of basic iron and steel and of ferro-alloys
type: Concept
Additional Content Note: This class also includes: - manufacture of coated or uncoated flat-rolled steel products in coils or in straight lengths of a width of 600 mm or more by cold re-rolling of hot-rolled flat products or of steel rods
CoreContentNote: This class includes activities such as the direct reduction of iron ore, production of pig iron in molten or solid form, conversion of pig iron into steel, manufacture of ferro-alloys and manufacture of steel products. This class includes: - operation of blast furnaces, steel converters, rolling and finishing mills - production of pig iron and spiegeleisen in pigs, blocks or other primary forms - production of ferro-alloys - production of ferrous products by direct reduction of iron and other spongy ferrous products - production of iron of exceptional purity by electrolysis or other chemical processes - remelting of scrap ingots of iron or steel - production of granular iron and iron powder - production of iron and steel in ingots or other primary forms - production of semi-finished products of iron or steel - manufacture of hot-rolled and cold-rolled flat-rolled products of iron or steel - manufacture of hot-rolled bars and rods of iron or steel - manufacture of hot-rolled open sections of iron or steel - manufacture of sheet piling of steel and welded open sections of iron or steel - manufacture of railway track materials (unassembled rails) of iron or steel - production of blast furnace gas
Exclusion Note: This class excludes: - cold drawing of bars, see 24.31
broader: Manufacture of basic iron and steel and of ferro-alloys
in scheme: Statistical Classification of Economic Activities in the European Community, Rev. 2.1 (NACE Rev. 2.1)
Notation: 24.10
top concept of: Statistical Classification of Economic Activities in the European Community, Rev. 2.1 (NACE Rev. 2.1)

Accommodation
type: Concept
Additional Content Note: Also included is the provision of short-term accommodation (for example, for students, workers).
CoreContentNote: This division includes the provision of short-term accommodation for visitors and other travellers. The accommodation may include meals, recreational facilities and other services.
Exclusion Note: This division excludes activities related to the provision of residences in facilities (for example, flats or apartments), typically leased on annual basis, see division 68.
broader: ACCOMMODATION AND FOOD SERVICE ACTIVITIES
in scheme: Statistical Classification of Economic Activities in the European Community, Rev. 2.1 (NACE Rev. 2.1)
Notation: 55
top concept of: Statistical Classification of Economic Activities in the European Community, Rev. 2.1 (NACE Rev. 2.1)

ConceptNoneRandom0.916527679426264
type: ConceptAssociation
description: NACE Rev. 2.1 class 14.10 is mapped to NACE Rev. 2 classes 14.13, 14.14, 14.19, 14.31, 14.39
Type: 4:5
Source Concept: Manufacture of knitted and crocheted apparel
Target Concept: http://data.europa.eu/ux2/nace2/1414
Target Concept: http://data.europa.eu/ux2/nace2/1439
Target Concept: http://data.europa.eu/ux2/nace2/1419
Target Concept: http://data.europa.eu/ux2/nace2/1431
Target Concept: http://data.europa.eu/ux2/nace2/1413
in scheme: Statistical Classification of Economic Activities in the European Community, Rev. 2.1 (NACE Rev. 2.1)
scope note: 14.13: - manufacture of knitted or crocheted outerwear, e.g. coats, suits, ensembles, jackets, trousers, and skirts 14.14: - manufacture of knitted or crocheted wearing apparel, e.g. shirts, T-shirts, blouses, nightwear, underwear 14.19: - manufacture of knitted and crocheted babies’ wear - manufacture of knitted and crocheted sportswear and swimwear 14.31: - manufacture of hosiery, including socks, tights and pantyhose, knitted and crocheted - manufacture of medical stockings and hosiery 14.39: - manufacture of knitted or crocheted wearing apparel, e.g. pullovers, cardigans, jerseys, waistcoats
top concept of: Statistical Classification of Economic Activities in the European Community, Rev. 2.1 (NACE Rev. 2.1)
Mapping Cardinality: n m

Activities of advertising agencies
type: Concept
CoreContentNote: This class includes: - provision of a full range of advertising services (i.e. through in-house capabilities or subcontracting), including advice, creative services, production of advertising material - planning and organising advertising and marketing campaigns - placing advertisements in the media - conceptual work on advertising messages - managing the course of advertising campaigns - creation and realisation of advertising campaigns: • creating and placing advertising, planning social media marketing campaigns in newspapers, periodicals, radio, television, over the internet and other media • creating and placing of outdoor advertising (e.g. billboards, panels, bulletins and frames, window dressing, showroom design, car and bus carding) • aerial advertising • distribution or delivery of advertising material or samples • design of stands and other display structures and sites - conducting marketing campaigns and other advertising services • promotion of products • merchandising • point-of-sale marketing • direct mail advertising • marketing consulting • influencer marketing
Exclusion Note: This class excludes: - manufacturing of advertising material, see section C depending on the type of material - manufacturing of stands for fairs and exhibitions and of product displays, see section C depending on the type of material - installation of stands for fairs and exhibitions, see 43.32 - publishing of advertising material, see 58.19 - production of commercial messages for television and film, see 59.11 - production of commercial product videos (including production of videos for social networks), see 59.11 - publishing of contents that include video (e.g. by influencers, bloggers and vloggers), see 59.11 - production of commercial messages for radio, see 59.20 - content distribution (sharing) platforms, including blogs and wiki sites, social network sites, and operation of online gaming / video game sites, independent of publishing the games, see 60.39 - market research and public opinion polling, see 73.20 - advertising photography, see 74.20 - postal and mailing activities, see 82.10 - convention and trade show organisers, see 82.30 - advertising services used to fund predominant activities of the business which may be provided free of charge, see predominant activity
broader: Advertising
in scheme: Statistical Classification of Economic Activities in the European Community, Rev. 2.1 (NACE Rev. 2.1)
Notation: 73.11
top concept of: Statistical Classification of Economic Activities in the European Community, Rev. 2.1 (NACE Rev. 2.1)

ConceptNoneRandom0.27757143419912544
type: ConceptAssociation
description: NACE Rev. 2.1 class 01.28 is mapped to NACE Rev. 2 class 01.28
Type: 3:3
Source Concept: Growing of spices, aromatic, drug and pharmaceutical crops
Target Concept: http://data.europa.eu/ux2/nace2/0128
in scheme: Statistical Classification of Economic Activities in the European Community, Rev. 2.1 (NACE Rev. 2.1)
scope note: the content of the NACE Rev 2.1 class is fully covered in the corresponding NACE Rev 2 class
top concept of: Statistical Classification of Economic Activities in the European Community, Rev. 2.1 (NACE Rev. 2.1)
Mapping Cardinality: n m

ConceptNoneRandom0.4204354651858102
type: ConceptAssociation
description: NACE Rev. 2.1 class 26.12 is mapped to NACE Rev. 2 class 26.12
Type: 1:1
Source Concept: Manufacture of loaded electronic boards
Target Concept: http://data.europa.eu/ux2/nace2/2612
in scheme: Statistical Classification of Economic Activities in the European Community, Rev. 2.1 (NACE Rev. 2.1)
scope note: the content of the NACE Rev 2.1 class is fully covered in the corresponding NACE Rev 2 class
top concept of: Statistical Classification of Economic Activities in the European Community, Rev. 2.1 (NACE Rev. 2.1)
Mapping Cardinality: 1 1

Trade of gas through mains
type: Concept
CoreContentNote: This class includes: - sale of gaseous fuels through mains on own account
Exclusion Note: This class excludes: - sale of gaseous fuels through mains on the account of others, see 35.40 - wholesale of bottled gaseous fuels, see 46.81 - retail sale of gaseous fuel for motor vehicles and motorcycles, see 47.30 - retail sale of household fuel oil and bottled gas, see 47.78
broader: Manufacture of gas, and distribution of gaseous fuels through mains
in scheme: Statistical Classification of Economic Activities in the European Community, Rev. 2.1 (NACE Rev. 2.1)
Notation: 35.23
top concept of: Statistical Classification of Economic Activities in the European Community, Rev. 2.1 (NACE Rev. 2.1)

ConceptNoneRandom0.7939270823080263
type: ConceptAssociation
description: NACE Rev. 2.1 class 28.30 is mapped to NACE Rev. 2 classes 28.30, 28.92
Type: 2:2
Source Concept: Manufacture of agricultural and forestry machinery
Target Concept: http://data.europa.eu/ux2/nace2/2892
Target Concept: http://data.europa.eu/ux2/nace2/2830
in scheme: Statistical Classification of Economic Activities in the European Community, Rev. 2.1 (NACE Rev. 2.1)
scope note: 28.30: - manufacture of agricultural and forestry tractors - manufacture of single-axe (pedestrian-controlled) tractors - manufacture of mowers, including lawnmowers - manufacture of self-loading or self-unloading trailers or semi-trailers for agricultural purposes - manufacture of agricultural machinery for soil preparation or cultivation, e.g.: • ploughs, harrows, manure spreaders, seeders, fertiliser distributors, etc. - manufacture of harvesting or threshing machinery, e.g.: • harvesters, threshers, sorters etc. - manufacture of milking machines - manufacture of agricultural or horticultural spraying appliances - manufacture of diverse agricultural machinery, e.g.: • poultry-keeping machinery, bee-keeping machinery, equipment for preparing fodder etc. • machines for cleaning, sorting or grading eggs, fruit etc. - manufacture of machinery for vertical farming 28.92: - manufacture of track laying tractors
top concept of: Statistical Classification of Economic Activities in the European Community, Rev. 2.1 (NACE Rev. 2.1)
Mapping Cardinality: n m

ConceptNoneRandom0.7679037143425305
type: ConceptAssociation
description: NACE Rev. 2.1 group 08.1 is mapped to NACE Rev. 2 group 08.1
Type: 1:1
Source Concept: Quarrying of stone, sand and clay
Target Concept: http://data.europa.eu/ux2/nace2/081
in scheme: Statistical Classification of Economic Activities in the European Community, Rev. 2.1 (NACE Rev. 2.1)
top concept of: Statistical Classification of Economic Activities in the European Community, Rev. 2.1 (NACE Rev. 2.1)
Mapping Cardinality: 1 1

ConceptNoneRandom0.11651822478011531
type: ConceptAssociation
description: NACE Rev. 2.1 class 49.20 is mapped to NACE Rev. 2 class 49.20
Type: 1:1
Source Concept: Freight rail transport
Target Concept: http://data.europa.eu/ux2/nace2/4920
in scheme: Statistical Classification of Economic Activities in the European Community, Rev. 2.1 (NACE Rev. 2.1)
scope note: the content of the NACE Rev 2.1 class is fully covered in the corresponding NACE Rev 2 class
top concept of: Statistical Classification of Economic Activities in the European Community, Rev. 2.1 (NACE Rev. 2.1)
Mapping Cardinality: 1 1

ConceptNoneRandom0.9131017010056138
type: ConceptAssociation
description: NACE Rev. 2.1 group 74.1 is mapped to NACE Rev. 2 group 74.1
Type: 1:1
Source Concept: Specialised design activities
Target Concept: http://data.europa.eu/ux2/nace2/741
in scheme: Statistical Classification of Economic Activities in the European Community, Rev. 2.1 (NACE Rev. 2.1)
top concept of: Statistical Classification of Economic Activities in the European Community, Rev. 2.1 (NACE Rev. 2.1)
Mapping Cardinality: 1 1

ConceptNoneRandom0.7675678723673316
type: ConceptAssociation
description: NACE Rev. 2.1 class 46.17 is mapped to NACE Rev. 2 classes 46.17, 82.99
Type: 78:65
Source Concept: Activities of agents involved in the wholesale of food, beverages and tobacco
Target Concept: http://data.europa.eu/ux2/nace2/4617
Target Concept: http://data.europa.eu/ux2/nace2/8299
in scheme: Statistical Classification of Economic Activities in the European Community, Rev. 2.1 (NACE Rev. 2.1)
scope note: 46.17: - activities of agents involved in the wholesale of food supplement for human consumption - activities of agents involved in the wholesale of food for pets - activities of agents involved in the wholesale of food supplement for animal consumption 82.99: - activities of independent auctioneers
top concept of: Statistical Classification of Economic Activities in the European Community, Rev. 2.1 (NACE Rev. 2.1)
Mapping Cardinality: n m

ConceptNoneRandom0.8412670868135941
type: ConceptAssociation
description: NACE Rev. 2.1 group 52.3 is mapped to NACE Rev. 2 groups 49.3, 52.2, 79.1, 79.9
Type: 42:34
Source Concept: Intermediation service activities for transportation
Target Concept: http://data.europa.eu/ux2/nace2/799
Target Concept: http://data.europa.eu/ux2/nace2/522
Target Concept: http://data.europa.eu/ux2/nace2/493
Target Concept: http://data.europa.eu/ux2/nace2/791
in scheme: Statistical Classification of Economic Activities in the European Community, Rev. 2.1 (NACE Rev. 2.1)
top concept of: Statistical Classification of Economic Activities in the European Community, Rev. 2.1 (NACE Rev. 2.1)
Mapping Cardinality: n m

Public order and safety activities
type: Concept
Additional Content Note: This class also includes: - activities of voluntary associations that ensure the protection of public safety
CoreContentNote: This class includes: - administration and operation of regular and auxiliary police forces supported by public authorities and of port, border, coastguards and other special police forces, including traffic law enforcement, foreigner registration, and the maintenance of arrest records - provision of supplies for domestic emergency use in case of peacetime disasters
Exclusion Note: This class excludes: - operation of police laboratories, see 71.20 - use of security personnel for events, concerts, fairs and exhibitions, see 80.01 - administration and operation of military armed forces, see 84.22
broader: Provision of services to the community as a whole
in scheme: Statistical Classification of Economic Activities in the European Community, Rev. 2.1 (NACE Rev. 2.1)
Notation: 84.24
top concept of: Statistical Classification of Economic Activities in the European Community, Rev. 2.1 (NACE Rev. 2.1)

Manufacture of communication equipment
type: Concept
broader: Manufacture of computer, electronic and optical products
in scheme: Statistical Classification of Economic Activities in the European Community, Rev. 2.1 (NACE Rev. 2.1)
Notation: 26.3
top concept of: Statistical Classification of Economic Activities in the European Community, Rev. 2.1 (NACE Rev. 2.1)

Manufacture of machinery for food, beverage and tobacco processing
type: Concept
CoreContentNote: This class includes: - manufacture of dryers for agricultural products - manufacture of machinery for the dairy industry, e.g.: • cream separators • milk processing machinery (e.g. homogenisers) • milk converting machinery (e.g. butter churns, butter workers and moulding machines) • cheese-making machines (e.g. homogenisers, moulders, presses) - manufacture of machinery for the grain milling industry, e.g.: • machinery to clean, sort or grade seeds, grain or dried leguminous vegetables (e.g. winnowers, sieving belts, separators, grain brushing machines) • machinery to produce flour and meal, etc. (e.g. grinding mills, feeders, sifters, bran cleaners, blenders, rice hullers, pea splitters) - manufacture of presses, crushers, etc. (e.g.to make wine, cider, fruit juices) - manufacture of machinery for the bakery industry or for making macaroni, spaghetti or similar products, e.g.: • baking ovens, dough mixers, dough-dividers, moulders, slicers, cake depositing machines - manufacture of machines and equipment to process diverse foods, e.g.: • machinery to make confectionery, cocoa or chocolate; to manufacture sugar; for breweries; to process meat or poultry; to prepare fruits, nuts or vegetables; to prepare fish, shellfish or other seafood • other machinery for the industrial preparation or manufacture of food or drink - manufacture of machinery for filtering or purifying food and beverages - manufacture of machinery for the extraction or preparation of animal or vegetable fats or oils - manufacture of machinery for the preparation of tobacco and for the making of cigarettes or cigars, or for pipe or chewing tobacco or snuff - manufacture of machinery, plant and equipment for cooking or heating food in hotels and restaurants
Exclusion Note: This class excludes: - manufacture of food and milk irradiation equipment, see 26.60 - manufacture of packing, wrapping and weighing machinery, see 28.29 - manufacture of cleaning, sorting or grading machinery for eggs, fruits or other crops (except seeds, grains and dried leguminous vegetables), see 28.30
broader: Manufacture of other special-purpose machinery
in scheme: Statistical Classification of Economic Activities in the European Community, Rev. 2.1 (NACE Rev. 2.1)
Notation: 28.93
top concept of: Statistical Classification of Economic Activities in the European Community, Rev. 2.1 (NACE Rev. 2.1)

Made of

Food and beverage service activities
type: Concept
CoreContentNote: This division includes food and beverage serving activities providing meals or drinks fit for immediate consumption, whether in traditional restaurants, self-service or takeaway restaurants, whether permanent or temporary, with or without seating. The fact that meals fit for immediate consumption are offered is decisive, not the kind of facility providing them.
Exclusion Note: This division excludes: - the production of meals not fit for immediate consumption or not planned to be consumed immediately, or of prepared food which is not considered to be a meal, see divisions 10 and 11 - the sale of not self-manufactured food that is not considered to be a meal, or of meals that are not fit for immediate consumption, see section G - coffee dispenser and vending machines selling food and drinks prepared by the machine itself, see division 47
broader: ACCOMMODATION AND FOOD SERVICE ACTIVITIES
in scheme: Statistical Classification of Economic Activities in the European Community, Rev. 2.1 (NACE Rev. 2.1)
Notation: 56
top concept of: Statistical Classification of Economic Activities in the European Community, Rev. 2.1 (NACE Rev. 2.1)

Sports activities n.e.c.
type: Concept
CoreContentNote: This class includes: - activities of producers of sporting events, with or without facilities - activities of individual own account sportspersons and athletes, referees, judges, timekeepers, etc. - activities of individual own account participants of e-sports - activities of sports federations, sports leagues and sports governing bodies - activities related to promotion of sporting events - activities of racing stables, kennels and garages - operation of sport fishing and hunting preserves - activities of mountain guides - support activities for sport or recreational hunting and fishing - operation of vertical, aerodynamic wind tunnels - activities related to training animals for sports or entertainment - organisation and operation of outdoor or indoor sporting events for professionals or amateurs by organisations (not by sports clubs) without own facilities
Exclusion Note: This class excludes: - broadcasting of live performances and events, see 60.20 - rental of sports equipment, see 77.21 - organisation of conferences, conventions and trade shows, see 82.30 - sports instruction in camps or schools, see 85.51 - activities of sports instructors, teachers, coaches, see 85.51 - card game instruction, see 85.51 - technical planning, supply, setting-up and operation of audiovisual equipment and special effects associated with the organisation of artistic events, see 90.39 - provision of personnel and equipment as part of the organisation and operation of a sporting event (not by sports clubs) with own facilities, see 93.11 - operation of e-sports clubs, see 93.12 - organisation and operation of outdoor or indoor sporting events for professionals or amateurs by sports clubs, see 93.12 - technical planning, supply, setting-up and operation of audiovisual equipment and special effects associated with the organisation of non-artistic events, see 93.29 - park and beach activities, see 93.29
broader: Sports activities
in scheme: Statistical Classification of Economic Activities in the European Community, Rev. 2.1 (NACE Rev. 2.1)
Notation: 93.19
top concept of: Statistical Classification of Economic Activities in the European Community, Rev. 2.1 (NACE Rev. 2.1)

Raising of sheep and goats
type: Concept
CoreContentNote: This class includes: - raising and breeding of sheep and goats - production of raw sheep or goat milk - production of raw wool
Exclusion Note: This class excludes: - sheep shearing on a fee or contract basis, see 01.62 - production of pulled wool, see 10.11 - processing of milk, see 10.51
broader: Animal production
in scheme: Statistical Classification of Economic Activities in the European Community, Rev. 2.1 (NACE Rev. 2.1)
Notation: 01.45
top concept of: Statistical Classification of Economic Activities in the European Community, Rev. 2.1 (NACE Rev. 2.1)

Gathering of wild growing non-wood products
type: Concept
Additional Content Note: This class also includes: - harvesting wild herbs and associated natural drying
CoreContentNote: This class includes: - gathering of wild growing materials, e.g.: • mushrooms, truffles • berries • nuts • balata and other rubber-like gums • cork • lac and resins • balsams • acorns, horse chestnuts • mosses and lichens • vegetable hair / eelgrass
Exclusion Note: This class excludes: - non-wild growing of any of these products (except growing of cork trees), see division 01 - growing of mushrooms or truffles, see 01.13 - growing of berries or nuts, see 01.25 - gathering of firewood, see 02.20
broader: Gathering of wild growing non-wood products
in scheme: Statistical Classification of Economic Activities in the European Community, Rev. 2.1 (NACE Rev. 2.1)
Notation: 02.30
top concept of: Statistical Classification of Economic Activities in the European Community, Rev. 2.1 (NACE Rev. 2.1)

PROFESSIONAL, SCIENTIFIC AND TECHNICAL ACTIVITIES
type: Concept
CoreContentNote: This section includes specialised professional, scientific and technical activities. These activities require a high degree of training and make specialised knowledge and skills available to users.
in scheme: Statistical Classification of Economic Activities in the European Community, Rev. 2.1 (NACE Rev. 2.1)
Notation: N
top concept of: Statistical Classification of Economic Activities in the European Community, Rev. 2.1 (NACE Rev. 2.1)

Beauty care and other beauty treatment activities
type: Concept
CoreContentNote: This class includes beauty treatment activities not performed by medical specialists (for example, by cosmetologists), such as facial massage, manicure, pedicure, permanent make-up, depilation and tanning.
Exclusion Note: This class excludes: - cosmetic surgery activities performed by medical specialists, see 86.22
broader: Hairdressing, beauty treatment, day spa and similar activities
in scheme: Statistical Classification of Economic Activities in the European Community, Rev. 2.1 (NACE Rev. 2.1)
Notation: 96.22
top concept of: Statistical Classification of Economic Activities in the European Community, Rev. 2.1 (NACE Rev. 2.1)

ConceptNoneRandom0.3641904738645415
type: ConceptAssociation
description: NACE Rev. 2.1 class 87.91 is mapped to NACE Rev. 2 class 82.99
Type: 78:65
Source Concept: Intermediation service activities for residential care activities
Target Concept: http://data.europa.eu/ux2/nace2/8299
in scheme: Statistical Classification of Economic Activities in the European Community, Rev. 2.1 (NACE Rev. 2.1)
scope note: the content of the NACE Rev 2.1 class is fully covered in the corresponding NACE Rev 2 class
top concept of: Statistical Classification of Economic Activities in the European Community, Rev. 2.1 (NACE Rev. 2.1)
Mapping Cardinality: n m

Distribution of gaseous fuels through mains
type: Concept
CoreContentNote: This class includes: - transport, distribution and supply of gaseous fuels of all kinds through a system of mains - rental and leasing of gas utility networks
Exclusion Note: This class excludes: - transport, usually over long distances, of gas through pipelines, see 49.50
broader: Manufacture of gas, and distribution of gaseous fuels through mains
in scheme: Statistical Classification of Economic Activities in the European Community, Rev. 2.1 (NACE Rev. 2.1)
Notation: 35.22
top concept of: Statistical Classification of Economic Activities in the European Community, Rev. 2.1 (NACE Rev. 2.1)

Pre-primary education
type: Concept
CoreContentNote: This class includes: - pre-primary education, which is defined as the initial stage of organised instruction designed primarily to introduce very young children to a school-type environment, that is, to provide a bridge between the home and a school-based environment.
Exclusion Note: This class excludes: - child day-care activities, see 88.91
broader: Pre-primary education
in scheme: Statistical Classification of Economic Activities in the European Community, Rev. 2.1 (NACE Rev. 2.1)
Notation: 85.10
top concept of: Statistical Classification of Economic Activities in the European Community, Rev. 2.1 (NACE Rev. 2.1)

Fire service activities
type: Concept
CoreContentNote: This class includes: - firefighting activities: • administration and operation of regular and auxiliary fire brigades in fire prevention, firefighting, the rescue of persons and animals, assistance in civic disasters, floods, road accidents, etc., including firefighting by units on a contract or fee basis - activities of beach supervisors, i.e. lifeguards - activities of rescue operations on open water and in mountains
Exclusion Note: This class excludes: - fire-protection and firefighting services for forestry, see 02.40 - firefighting services and fire-prevention services for oilfields and gas fields, see 09.10 - firefighting and fire-prevention activities at airports, see 52.23
broader: Provision of services to the community as a whole
in scheme: Statistical Classification of Economic Activities in the European Community, Rev. 2.1 (NACE Rev. 2.1)
Notation: 84.25
top concept of: Statistical Classification of Economic Activities in the European Community, Rev. 2.1 (NACE Rev. 2.1)

ConceptNoneRandom0.02276616489261929
type: ConceptAssociation
description: NACE Rev. 2.1 class 46.18 is mapped to NACE Rev. 2 classes 45.11, 45.19, 45.31, 45.40, 46.18, 82.99
Type: 78:65
Source Concept: Activities of agents involved in the wholesale of other particular products
Target Concept: http://data.europa.eu/ux2/nace2/4540
Target Concept: http://data.europa.eu/ux2/nace2/4519
Target Concept: http://data.europa.eu/ux2/nace2/4618
Target Concept: http://data.europa.eu/ux2/nace2/8299
Target Concept: http://data.europa.eu/ux2/nace2/4511
Target Concept: http://data.europa.eu/ux2/nace2/4531
in scheme: Statistical Classification of Economic Activities in the European Community, Rev. 2.1 (NACE Rev. 2.1)
scope note: 45.11: - activities of agents involved in the wholesale of cars and light motor vehicles; these motor vehicles include electrical vehicles - activities of wholesale auctioneering houses of third-party goods of light motor vehicles, including internet wholesale auctions of light motor vehicles 45.19: - activities of agents involved in the wholesale of lorries, trailers and semi-trailers, camping vehicles, e.g.: caravans and motorhomes; these motor vehicles include electrical vehicles - activities of wholesale auctioneering houses of third-party goods of other motor vehicles, including internet wholesale auctions of other motor vehicles 45.31: - activities of agents involved in the wholesale of motor vehicle parts and accessories - activities of wholesale auctioneering houses of third-party goods of motor vehicle parts and accessories, including internet wholesale auctions of motor vehicle parts and accessories 45.40: - activities of agents involved in the wholesale of motorcycles - activities of agents involved in the wholesale of motor vehicle parts and accessories and parts and accessories for motorcycles - activities of wholesale auctioneering houses of third-party goods of motorcycles and related parts and accessories, including internet wholesale auctions of motorcycles and related parts and accessories 46.18: - activities of agents involved in the wholesale of pharmaceutical and medical goods, perfumery and toilet articles and cleaning materials - activities of agents involved in the wholesale of games and toys, sports goods, bicycles, books, newspapers, magazines and stationery, musical instruments, watches, clocks and jewellery, photographic and optical equipment - activities of agents involved in the wholesale of cars and light motor vehicles, lorries, trailers and semi-trailers, camping vehicles, e.g. caravans and motorhomes, motorcycles, including mopeds, motorised personal transport devices and rolling stock; these motor vehicles include electrical vehicl…
top concept of: Statistical Classification of Economic Activities in the European Community, Rev. 2.1 (NACE Rev. 2.1)
Mapping Cardinality: n m

ConceptNoneRandom0.4514252728623819
type: ConceptAssociation
description: NACE Rev. 2.1 group 74.2 is mapped to NACE Rev. 2 group 74.2
Type: 4:4
Source Concept: Photographic activities
Target Concept: http://data.europa.eu/ux2/nace2/742
in scheme: Statistical Classification of Economic Activities in the European Community, Rev. 2.1 (NACE Rev. 2.1)
top concept of: Statistical Classification of Economic Activities in the European Community, Rev. 2.1 (NACE Rev. 2.1)
Mapping Cardinality: n m

Manufacture of consumer electronics
type: Concept
broader: Manufacture of computer, electronic and optical products
in scheme: Statistical Classification of Economic Activities in the European Community, Rev. 2.1 (NACE Rev. 2.1)
Notation: 26.4
top concept of: Statistical Classification of Economic Activities in the European Community, Rev. 2.1 (NACE Rev. 2.1)

ConceptNoneRandom0.8724946384298614
type: ConceptAssociation
description: NACE Rev. 2.1 group 43.9 is mapped to NACE Rev. 2 groups 41.2, 43.9
Type: 26:18
Source Concept: Other specialised construction activities
Target Concept: http://data.europa.eu/ux2/nace2/439
Target Concept: http://data.europa.eu/ux2/nace2/412
in scheme: Statistical Classification of Economic Activities in the European Community, Rev. 2.1 (NACE Rev. 2.1)
top concept of: Statistical Classification of Economic Activities in the European Community, Rev. 2.1 (NACE Rev. 2.1)
Mapping Cardinality: n m

ConceptNoneRandom0.31917836825538093
type: ConceptAssociation
description: NACE Rev. 2.1 class 94.20 is mapped to NACE Rev. 2 class 94.20
Type: 1:1
Source Concept: Activities of trade unions
Target Concept: http://data.europa.eu/ux2/nace2/9420
in scheme: Statistical Classification of Economic Activities in the European Community, Rev. 2.1 (NACE Rev. 2.1)
scope note: the content of the NACE Rev 2.1 class is fully covered in the corresponding NACE Rev 2 class
top concept of: Statistical Classification of Economic Activities in the European Community, Rev. 2.1 (NACE Rev. 2.1)
Mapping Cardinality: 1 1

Manufacture of machinery for mining, quarrying and construction
type: Concept
CoreContentNote: This class includes: - manufacture of continuous-action elevators and conveyors for goods and materials, for underground use - manufacture of boring, cutting or sinking machinery for boring earth or extracting minerals or ores, or of coal or rock cutters and tunnelling machinery - manufacture of machinery for treating minerals by screening, sorting, separating, washing, crushing, grinding, mixing or kneading earth, stone, ores or other mineral substances, in solid (including powder or paste) form - manufacture of concrete and mortar mixers - manufacture of earth-moving machinery: • bulldozers, angledozers, graders, scrapers, levellers, mechanical shovels, shovel loaders, etc. - manufacture of piledrivers and pile extractors, mortar spreaders, bitumen spreaders, concrete surfacing machinery, etc. - manufacture of machines for mixing mineral substances with bitumen - manufacture of track-laying excavators - manufacture of bulldozer and angledozer blades - manufacture of off-road dumper trucks - manufacture of snowploughs and snowblowers
Exclusion Note: This class excludes: - manufacture of lifting and handling equipment, see 28.22 - manufacture of tractors, see 28.30, 29.10 - manufacture of machine tools for working stone, including machines for splitting or clearing stone, see 28.42 - manufacture of concrete mixer lorries, see 29.20
broader: Manufacture of other special-purpose machinery
in scheme: Statistical Classification of Economic Activities in the European Community, Rev. 2.1 (NACE Rev. 2.1)
Notation: 28.92
top concept of: Statistical Classification of Economic Activities in the European Community, Rev. 2.1 (NACE Rev. 2.1)

Preparation and spinning of textile fibres
type: Concept
broader: Manufacture of textiles
in scheme: Statistical Classification of Economic Activities in the European Community, Rev. 2.1 (NACE Rev. 2.1)
Notation: 13.1
top concept of: Statistical Classification of Economic Activities in the European Community, Rev. 2.1 (NACE Rev. 2.1)

Raising of poultry
type: Concept
CoreContentNote: This class includes: - raising and breeding of poultry, e.g.: • chickens, turkeys, ducks, geese, quails, ostriches or guineafowls - production of eggs from poultry - operation of poultry hatcheries - automated egg hatching for poultry
Exclusion Note: This class excludes: - production of feathers or down, see 10.12
broader: Animal production
in scheme: Statistical Classification of Economic Activities in the European Community, Rev. 2.1 (NACE Rev. 2.1)
Notation: 01.47
top concept of: Statistical Classification of Economic Activities in the European Community, Rev. 2.1 (NACE Rev. 2.1)

Raising of swine and pigs
type: Concept
CoreContentNote: This class includes: - raising and breeding of swine and pigs
broader: Animal production
in scheme: Statistical Classification of Economic Activities in the European Community, Rev. 2.1 (NACE Rev. 2.1)
Notation: 01.46
top concept of: Statistical Classification of Economic Activities in the European Community, Rev. 2.1 (NACE Rev. 2.1)

Service activities incidental to land transportation
type: Concept
Additional Content Note: This class also includes: - liquefaction and/or regasification of natural gas for the purpose of land transport
CoreContentNote: This class includes: - activities related to the transport of passengers, animals or freight by road, rail and other means of land transport: • operation of terminal facilities (e.g. railway stations, bus stations, stations for the handling of goods) • operation of railway infrastructure and rail-related facilities, cargo terminals, technical back-up points, railway stops for fuel • operation of roads, bridges and tunnels, including activities of winter maintenance - switching and shunting - operation of car parks or garages, parking for bicycles, winter storage of caravans - towing and roadside assistance - truck transport cargo surveying activities - toll collection services
Exclusion Note: This class excludes: - liquefaction of natural gas for transport purposes, done at the mine site, see 09.10 - regasification of natural gas for distribution through mains, see 35.22 - repair of roads, see division 42 - cargo handling, see 52.24 - moving cargos on industrial sites, typically with transport equipment that is not suitable for use on roads open to public traffic, see 52.24
broader: Support activities for transportation
in scheme: Statistical Classification of Economic Activities in the European Community, Rev. 2.1 (NACE Rev. 2.1)
Notation: 52.21
top concept of: Statistical Classification of Economic Activities in the European Community, Rev. 2.1 (NACE Rev. 2.1)

Day spa, sauna and steam bath activities
type: Concept
CoreContentNote: This class includes: - activities of Turkish baths, sauna and steam baths, day spas, solariums, weight loss and slendering salons, etc. - activities of massage salons for non-medical massage
Exclusion Note: This class excludes: - physical well-being services as part of accommodation activities, see division 55 - activities of medical massage therapists, see 86.95 - activities of practitioners in the field of shiatsu, Thai massage, Watsu, tui na, qigong, see 86.99 - activities of health, fitness and body-building clubs and facilities, see 93.13
broader: Hairdressing, beauty treatment, day spa and similar activities
in scheme: Statistical Classification of Economic Activities in the European Community, Rev. 2.1 (NACE Rev. 2.1)
Notation: 96.23
top concept of: Statistical Classification of Economic Activities in the European Community, Rev. 2.1 (NACE Rev. 2.1)

ADMINISTRATIVE AND SUPPORT SERVICE ACTIVITIES
type: Concept
CoreContentNote: This section includes a variety of activities that support general business operations. These activities differ from those in section N since their primary purpose is not the transfer of specialised knowledge.
in scheme: Statistical Classification of Economic Activities in the European Community, Rev. 2.1 (NACE Rev. 2.1)
Notation: O
top concept of: Statistical Classification of Economic Activities in the European Community, Rev. 2.1 (NACE Rev. 2.1)

Manufacture of gas
type: Concept
Additional Content Note: This class also includes: - cleansing of biogas for energy supply through a permanent network - regasification of natural gas for distribution through mains
CoreContentNote: This class includes: - production of gaseous fuels for energy supply through a gas distribution network (e.g. by carbonation of coal, gasification of lignite, electrolysis or methanisation) - production of gaseous fuels for energy supply with a specified calorific value, by purification, blending and other processes from gases of various types, including natural gas or hydrogen - production of biogas for the purpose of gas supply (e.g. from sewage sludge, manure, waste) - production of gaseous biofuels for energy supply through a gas distribution network
Exclusion Note: This class excludes: - extraction of crude natural gas, see 06.20 - production of coke oven gas, see 19.10 - manufacture of refined petroleum products, see 19.20 - production of liquefied petroleum gas (LPG), see 19.20 - manufacture of industrial gases, see 20.11 - production of hydrogen, not for energy supply through a network, see 20.11 - manufacture of basic organic gases, not for energy supply through a network, see 20.14 - production of blast furnace gas, see 24.10
broader: Manufacture of gas, and distribution of gaseous fuels through mains
in scheme: Statistical Classification of Economic Activities in the European Community, Rev. 2.1 (NACE Rev. 2.1)
Notation: 35.21
top concept of: Statistical Classification of Economic Activities in the European Community, Rev. 2.1 (NACE Rev. 2.1)

ConceptNoneRandom0.961101781913784
type: ConceptAssociation
description: NACE Rev. 2.1 group 56.1 is mapped to NACE Rev. 2 group 56.1
Type: 1:1
Source Concept: Restaurants and mobile food service activities
Target Concept: http://data.europa.eu/ux2/nace2/561
in scheme: Statistical Classification of Economic Activities in the European Community, Rev. 2.1 (NACE Rev. 2.1)
top concept of: Statistical Classification of Economic Activities in the European Community, Rev. 2.1 (NACE Rev. 2.1)
Mapping Cardinality: 1 1

ConceptNoneRandom0.1659499664405445
type: ConceptAssociation
description: NACE Rev. 2.1 group 47.6 is mapped to NACE Rev. 2 groups 47.5, 47.6, 47.7, 47.8, 47.9
Type: 42:34
Source Concept: Retail sale of cultural and recreational goods
Target Concept: http://data.europa.eu/ux2/nace2/479
Target Concept: http://data.europa.eu/ux2/nace2/478
Target Concept: http://data.europa.eu/ux2/nace2/477
Target Concept: http://data.europa.eu/ux2/nace2/476
Target Concept: http://data.europa.eu/ux2/nace2/475
in scheme: Statistical Classification of Economic Activities in the European Community, Rev. 2.1 (NACE Rev. 2.1)
top concept of: Statistical Classification of Economic Activities in the European Community, Rev. 2.1 (NACE Rev. 2.1)
Mapping Cardinality: n m

Other mining and quarrying n.e.c.
type: Concept
CoreContentNote: This class includes: - mining and quarrying of various minerals and materials: • abrasive materials, asbestos, siliceous fossil meals, natural graphite, steatite (talc), feldspar, etc. • natural asphalt, asphaltites and asphaltic rock; natural solid bitumen • gemstones, quartz, mica, etc.
broader: Mining and quarrying n.e.c.
in scheme: Statistical Classification of Economic Activities in the European Community, Rev. 2.1 (NACE Rev. 2.1)
Notation: 08.99
top concept of: Statistical Classification of Economic Activities in the European Community, Rev. 2.1 (NACE Rev. 2.1)

Manufacture of coke and refined petroleum products
type: Concept
Additional Content Note: This division also includes the manufacture for own account of characteristic products (for example, coke, butane, propane, petrol, kerosene, fuel oil) as well as processing services (for example, custom refining).
CoreContentNote: This division includes the transformation of crude petroleum and coal into usable products. The dominant process is petroleum refining, which involves the separation of crude petroleum into component products through such techniques as cracking and distillation. This division includes the manufacture of gases (for example, ethane, propane, butane) as products of petroleum refineries.
Exclusion Note: This division excludes the manufacture of such gases in other units (see 20.14), the manufacture of industrial gases (see 20.11), the extraction of natural gas (methane, ethane, butane or propane, see 06.20), and the manufacture of gases other than petroleum gases for the provision of gaseous fuels through a permanent supply network (for example, coal gas, water gas, producer gas, gasworks gas, see 35.21). The manufacture of petrochemicals from refined petroleum and the manufacture of liquid biofuels are classified in division 20.
broader: MANUFACTURING
in scheme: Statistical Classification of Economic Activities in the European Community, Rev. 2.1 (NACE Rev. 2.1)
Notation: 19
top concept of: Statistical Classification of Economic Activities in the European Community, Rev. 2.1 (NACE Rev. 2.1)

Wholesale of beverages
type: Concept
Additional Content Note: This class also includes: - buying of wine in bulk and bottling without transformation
CoreContentNote: This class includes: - wholesale of alcoholic beverages - wholesale of non-alcoholic beverages - wholesale of fruit and vegetable juices - wholesale of prepared beverages in cans or bottles
Exclusion Note: This class excludes: - blending of wine, distilled spirits and other beverages (in order to make a new product), see 11.01, 11.02, 11.07
broader: Wholesale of food, beverages and tobacco
in scheme: Statistical Classification of Economic Activities in the European Community, Rev. 2.1 (NACE Rev. 2.1)
Notation: 46.34
top concept of: Statistical Classification of Economic Activities in the European Community, Rev. 2.1 (NACE Rev. 2.1)

ConceptNoneRandom0.5090519878408647
type: ConceptAssociation
description: NACE Rev. 2.1 division 31 is mapped to NACE Rev. 2 divisions 23, 31
Type: 48:49
Source Concept: Manufacture of furniture
Target Concept: http://data.europa.eu/ux2/nace2/23
Target Concept: http://data.europa.eu/ux2/nace2/31
in scheme: Statistical Classification of Economic Activities in the European Community, Rev. 2.1 (NACE Rev. 2.1)
top concept of: Statistical Classification of Economic Activities in the European Community, Rev. 2.1 (NACE Rev. 2.1)
Mapping Cardinality: n m

ConceptNoneRandom0.13726013157671757
type: ConceptAssociation
description: NACE Rev. 2.1 class 51.10 is mapped to NACE Rev. 2 class 51.10
Type: 1:1
Source Concept: Passenger air transport
Target Concept: http://data.europa.eu/ux2/nace2/5110
in scheme: Statistical Classification of Economic Activities in the European Community, Rev. 2.1 (NACE Rev. 2.1)
scope note: the content of the NACE Rev 2.1 class is fully covered in the corresponding NACE Rev 2 class
top concept of: Statistical Classification of Economic Activities in the European Community, Rev. 2.1 (NACE Rev. 2.1)
Mapping Cardinality: 1 1

ConceptNoneRandom0.08441005532149204
type: ConceptAssociation
description: NACE Rev. 2.1 division 79 is mapped to NACE Rev. 2 division 79
Type: 48:49
Source Concept: Travel agency, tour operator and other reservation service and related activities
Target Concept: http://data.europa.eu/ux2/nace2/79
in scheme: Statistical Classification of Economic Activities in the European Community, Rev. 2.1 (NACE Rev. 2.1)
top concept of: Statistical Classification of Economic Activities in the European Community, Rev. 2.1 (NACE Rev. 2.1)
Mapping Cardinality: n m

Manufacture of fluid power equipment
type: Concept
CoreContentNote: This class includes: - manufacture of hydraulic and pneumatic power engines and motors, cylinders and valves - manufacture of hydraulic fluid power systems - manufacture of hydraulic transmission equipment - manufacture of hydrostatic transmission equipment
Exclusion Note: This class excludes: - manufacture of hydraulic or pneumatic tubes, pipes and hoses of rubber, see 22.12 - manufacture of hydraulic or pneumatic tubes, pipes and hoses of plastic, see 22.21 - manufacture of compressors, see 28.13 - manufacture of pumps other than hydraulic fluid power pumps, see 28.13 - manufacture of valves for non-fluid power applications, see 28.14 - manufacture of mechanical power transmission equipment, see 28.15
broader: Manufacture of general-purpose machinery
in scheme: Statistical Classification of Economic Activities in the European Community, Rev. 2.1 (NACE Rev. 2.1)
Notation: 28.12
top concept of: Statistical Classification of Economic Activities in the European Community, Rev. 2.1 (NACE Rev. 2.1)

Manufacture of cocoa, chocolate and sugar confectionery
type: Concept
CoreContentNote: This class includes: - manufacture of cocoa, cocoa butter, cocoa fat, cocoa oil - manufacture of chocolate and chocolate confectionery - manufacture of sugar confectionery: caramels, cachous, nougats, fondant, white chocolate - manufacture of chewing gum - preserving in sugar of fruits, nuts, fruit peels and other parts of plants - manufacture of confectionery lozenges and pastilles - manufacture of sugar-free confectionery
Exclusion Note: This class excludes: - manufacture of sucrose sugar, see 10.81
broader: Manufacture of other food products
in scheme: Statistical Classification of Economic Activities in the European Community, Rev. 2.1 (NACE Rev. 2.1)
Notation: 10.82
top concept of: Statistical Classification of Economic Activities in the European Community, Rev. 2.1 (NACE Rev. 2.1)

Wholesale of tobacco products
type: Concept
Additional Content Note: This class also includes: - wholesale of electronic cigarettes (vapes)
CoreContentNote: This class includes: - wholesale of tobacco and smoking products and accessories, including lighters, pipes, cigarette rolling equipment, etc.
Exclusion Note: This class excludes: - wholesale of e-liquids for electronic cigarettes, see 46.85
broader: Wholesale of food, beverages and tobacco
in scheme: Statistical Classification of Economic Activities in the European Community, Rev. 2.1 (NACE Rev. 2.1)
Notation: 46.35
top concept of: Statistical Classification of Economic Activities in the European Community, Rev. 2.1 (NACE Rev. 2.1)

Manufacture of electronic components and boards
type: Concept
broader: Manufacture of computer, electronic and optical products
in scheme: Statistical Classification of Economic Activities in the European Community, Rev. 2.1 (NACE Rev. 2.1)
Notation: 26.1
top concept of: Statistical Classification of Economic Activities in the European Community, Rev. 2.1 (NACE Rev. 2.1)

ConceptNoneRandom0.7593488558156175
type: ConceptAssociation
description: NACE Rev. 2.1 group 56.2 is mapped to NACE Rev. 2 group 56.2
Type: 1:1
Source Concept: Event catering, contract catering service activities and other food service activities
Target Concept: http://data.europa.eu/ux2/nace2/562
in scheme: Statistical Classification of Economic Activities in the European Community, Rev. 2.1 (NACE Rev. 2.1)
top concept of: Statistical Classification of Economic Activities in the European Community, Rev. 2.1 (NACE Rev. 2.1)
Mapping Cardinality: 1 1

ConceptNoneRandom0.1792146683317507
type: ConceptAssociation
description: NACE Rev. 2.1 group 21.1 is mapped to NACE Rev. 2 group 21.1
Type: 1:1
Source Concept: Manufacture of basic pharmaceutical products
Target Concept: http://data.europa.eu/ux2/nace2/211
in scheme: Statistical Classification of Economic Activities in the European Community, Rev. 2.1 (NACE Rev. 2.1)
top concept of: Statistical Classification of Economic Activities in the European Community, Rev. 2.1 (NACE Rev. 2.1)
Mapping Cardinality: 1 1

ConceptNoneRandom0.5022425121273215
type: ConceptAssociation
description: NACE Rev. 2.1 group 25.9 is mapped to NACE Rev. 2 group 25.9
Type: 1:1
Source Concept: Manufacture of other fabricated metal products
Target Concept: http://data.europa.eu/ux2/nace2/259
in scheme: Statistical Classification of Economic Activities in the European Community, Rev. 2.1 (NACE Rev. 2.1)
top concept of: Statistical Classification of Economic Activities in the European Community, Rev. 2.1 (NACE Rev. 2.1)
Mapping Cardinality: 1 1

ConceptNoneRandom0.720034037517207
type: ConceptAssociation
description: NACE Rev. 2.1 group 47.7 is mapped to NACE Rev. 2 groups 47.7, 47.8, 47.9
Type: 42:34
Source Concept: Retail sale of other goods, except motor vehicles and motorcycles
Target Concept: http://data.europa.eu/ux2/nace2/479
Target Concept: http://data.europa.eu/ux2/nace2/478
Target Concept: http://data.europa.eu/ux2/nace2/477
in scheme: Statistical Classification of Economic Activities in the European Community, Rev. 2.1 (NACE Rev. 2.1)
top concept of: Statistical Classification of Economic Activities in the European Community, Rev. 2.1 (NACE Rev. 2.1)
Mapping Cardinality: n m

Development of building projects
type: Concept
Additional Content Note: This class also includes: - redevelopment of building projects for self-owned residential and non-residential buildings or civil engineering works to realise the building projects for later sale
CoreContentNote: This class includes: - development of building projects for self-owned residential and non-residential buildings or civil engineering works by bringing together financial, technical and physical means to realise the building projects for later sale - subdividing and improving of self-owned land for later sale
Exclusion Note: This class excludes: - construction of residential and non-residential buildings, see division 41 - complete remodelling or renovating of existing residential or non-residential buildings involving several specialised construction activities, see division 41 - painting and glazing activities as part of maintenance, see 43.34 - construction activities related to land improvement, see section F - development of building projects for own operation, i.e. for renting out the space in these buildings, see 68.20 - architectural and engineering activities, see 71.1 - provision of architectural or engineering project management services for construction projects, see 71.1
broader: Real estate activities with own property and development of building projects
in scheme: Statistical Classification of Economic Activities in the European Community, Rev. 2.1 (NACE Rev. 2.1)
Notation: 68.12
top concept of: Statistical Classification of Economic Activities in the European Community, Rev. 2.1 (NACE Rev. 2.1)

Manufacture of computers and peripheral equipment
type: Concept
broader: Manufacture of computer, electronic and optical products
in scheme: Statistical Classification of Economic Activities in the European Community, Rev. 2.1 (NACE Rev. 2.1)
Notation: 26.2
top concept of: Statistical Classification of Economic Activities in the European Community, Rev. 2.1 (NACE Rev. 2.1)

ConceptNoneRandom0.5468024999791228
type: ConceptAssociation
description: NACE Rev. 2.1 division 30 is mapped to NACE Rev. 2 divisions 28, 30
Type: 48:49
Source Concept: Manufacture of other transport equipment
Target Concept: http://data.europa.eu/ux2/nace2/28
Target Concept: http://data.europa.eu/ux2/nace2/30
in scheme: Statistical Classification of Economic Activities in the European Community, Rev. 2.1 (NACE Rev. 2.1)
top concept of: Statistical Classification of Economic Activities in the European Community, Rev. 2.1 (NACE Rev. 2.1)
Mapping Cardinality: n m

ConceptNoneRandom0.9433758297122272
type: ConceptAssociation
description: NACE Rev. 2.1 division 78 is mapped to NACE Rev. 2 division 78
Type: 1:1
Source Concept: Employment activities
Target Concept: http://data.europa.eu/ux2/nace2/78
in scheme: Statistical Classification of Economic Activities in the European Community, Rev. 2.1 (NACE Rev. 2.1)
top concept of: Statistical Classification of Economic Activities in the European Community, Rev. 2.1 (NACE Rev. 2.1)
Mapping Cardinality: 1 1

Manufacture of engines and turbines, except aircraft, vehicle and cycle engines
type: Concept
CoreContentNote: This class includes: - manufacture of internal combustion piston engines, except for motor vehicle, aircraft and motorcycle propulsion engines: • marine engines • railway engines - manufacture of parts suitable for use solely or principally within internal combustion engines (e.g. pistons, piston rings, carburettors and such, except for motor vehicles) - manufacture of inlet and exhaust valves of internal combustion engines - manufacture of turbines and parts thereof: • steam turbines and other vapour turbines • hydraulic turbines, waterwheels and regulators thereof • wind turbines and mills • gas turbines, except turbojets or turbopropellers for aircraft propulsion - manufacture of boiler turbine sets - manufacture of turbine generator sets, consisting of a turbine and a generator mounted together - manufacture of engines for industrial application - factory overhaul of ship and boat engines
Exclusion Note: This class excludes: - manufacture of electric generators (except turbine generator sets), see 27.11 - manufacture of prime mover generator sets (except turbine generator sets), see 27.11 - manufacture of parts of motor vehicles’ combustion engines, see 29.10 - manufacture of electrical equipment and components of internal combustion piston engines for motor vehicles, see 29.3 - manufacture of pistons, piston rings and carburettors for motor vehicles, see 29.32 - manufacture of internal combustion piston engines for aircraft, see 30.3 - manufacture of aircraft engines, turbojets and turbopropellers, see 30.31, 30.32 - manufacture of motorcycle propulsion engines, see 30.91 - manufacture of pistons, piston rings and carburettors for motorcycles, see 30.91
broader: Manufacture of general-purpose machinery
in scheme: Statistical Classification of Economic Activities in the European Community, Rev. 2.1 (NACE Rev. 2.1)
Notation: 28.11
top concept of: Statistical Classification of Economic Activities in the European Community, Rev. 2.1 (NACE Rev. 2.1)

ConceptNoneRandom0.7145875005816094
type: ConceptAssociation
description: NACE Rev. 2.1 class 86.21 is mapped to NACE Rev. 2 class 86.21
Type: 1:1
Source Concept: General medical practice activities
Target Concept: http://data.europa.eu/ux2/nace2/8621
in scheme: Statistical Classification of Economic Activities in the European Community, Rev. 2.1 (NACE Rev. 2.1)
scope note: the content of the NACE Rev 2.1 class is fully covered in the corresponding NACE Rev 2 class
top concept of: Statistical Classification of Economic Activities in the European Community, Rev. 2.1 (NACE Rev. 2.1)
Mapping Cardinality: 1 1

Wholesale of sugar, chocolate and sugar confectionery
type: Concept
CoreContentNote: This class includes: - wholesale of sugar, including sugar cubes, molasses, sugar confectionery and chocolate - wholesale of bakery products
Exclusion Note: This class excludes: - wholesale of ice cream, see 46.33
broader: Wholesale of food, beverages and tobacco
in scheme: Statistical Classification of Economic Activities in the European Community, Rev. 2.1 (NACE Rev. 2.1)
Notation: 46.36
top concept of: Statistical Classification of Economic Activities in the European Community, Rev. 2.1 (NACE Rev. 2.1)

Retail sale of cultural and recreational goods n.e.c.
type: Concept
Additional Content Note: This class also includes: - retail sale of art supplies, including beads, clay, canvasses, oil paints and watercolours, etc.
CoreContentNote: This class includes the retail sale of cultural and recreational goods not elsewhere classified: - retail sale of recorded media - retail sale of musical instruments, scores and related accessories (e.g. strings, music stands, metronomes) - retail sale of philately, numismatics and collectors’ items (e.g. stamps and coins) - activities of commercial art galleries
Exclusion Note: This class excludes: - retail sale of video games on physical media, see 47.40 - retail sale of souvenirs, craftwork and religious articles, see 47.78 - retail sale of antiques, second-hand and antique books, second-hand musical instruments and second-hand recorded media, see 47.79 - distribution of audio via streaming and downloading by their publishers, see 59.20 - audio streaming and download distribution service activities not associated with publishing, see 60.10
broader: Retail sale of cultural and recreational goods
in scheme: Statistical Classification of Economic Activities in the European Community, Rev. 2.1 (NACE Rev. 2.1)
Notation: 47.69
top concept of: Statistical Classification of Economic Activities in the European Community, Rev. 2.1 (NACE Rev. 2.1)

Processing of tea and coffee
type: Concept
Additional Content Note: This class also includes: - manufacture of herb infusions (mint, vervain, chamomile, etc.) - manufacture of tea and coffee filled in bags, pads or capsules
CoreContentNote: This class includes: - decaffeinating and roasting of coffee - production of coffee products: • ground coffee • soluble coffee • extracts and concentrates of coffee - manufacture of coffee substitutes - blending of tea and maté - manufacture of extracts and preparations based on tea or maté
Exclusion Note: This class excludes: - drying, sorting, cleaning and cutting in the processing of medicinal herbs by third parties, see 01.63 - manufacture of inulin, see 10.62 - manufacture of spirits, beer, wine and soft drinks, see division 11 - preparation of botanical products for pharmaceutical use, see 21.20
broader: Manufacture of other food products
in scheme: Statistical Classification of Economic Activities in the European Community, Rev. 2.1 (NACE Rev. 2.1)
Notation: 10.83
top concept of: Statistical Classification of Economic Activities in the European Community, Rev. 2.1 (NACE Rev. 2.1)

ConceptNoneRandom0.3086670055136711
type: ConceptAssociation
description: NACE Rev. 2.1 class 05.20 is mapped to NACE Rev. 2 class 05.20
Type: 1:1
Source Concept: Mining of lignite
Target Concept: http://data.europa.eu/ux2/nace2/0520
in scheme: Statistical Classification of Economic Activities in the European Community, Rev. 2.1 (NACE Rev. 2.1)
scope note: the content of the NACE Rev 2.1 class is fully covered in the corresponding NACE Rev 2 class
top concept of: Statistical Classification of Economic Activities in the European Community, Rev. 2.1 (NACE Rev. 2.1)
Mapping Cardinality: 1 1

ConceptNoneRandom0.6680090633723939
type: ConceptAssociation
description: NACE Rev. 2.1 group 47.4 is mapped to NACE Rev. 2 groups 47.4, 47.8, 47.9
Type: 42:34
Source Concept: Retail sale of information and communication equipment
Target Concept: http://data.europa.eu/ux2/nace2/479
Target Concept: http://data.europa.eu/ux2/nace2/478
Target Concept: http://data.europa.eu/ux2/nace2/474
in scheme: Statistical Classification of Economic Activities in the European Community, Rev. 2.1 (NACE Rev. 2.1)
top concept of: Statistical Classification of Economic Activities in the European Community, Rev. 2.1 (NACE Rev. 2.1)
Mapping Cardinality: n m

ConceptNoneRandom0.8212777656529708
type: ConceptAssociation
description: NACE Rev. 2.1 group 69.2 is mapped to NACE Rev. 2 group 69.2
Type: 1:1
Source Concept: Accounting, bookkeeping and auditing activities; tax consultancy
Target Concept: http://data.europa.eu/ux2/nace2/692
in scheme: Statistical Classification of Economic Activities in the European Community, Rev. 2.1 (NACE Rev. 2.1)
top concept of: Statistical Classification of Economic Activities in the European Community, Rev. 2.1 (NACE Rev. 2.1)
Mapping Cardinality: 1 1

ConceptNoneRandom0.8293423016209782
type: ConceptAssociation
description: NACE Rev. 2.1 group 25.6 is mapped to NACE Rev. 2 group 25.7
Type: 1:1
Source Concept: Manufacture of cutlery, tools and general hardware
Target Concept: http://data.europa.eu/ux2/nace2/257
in scheme: Statistical Classification of Economic Activities in the European Community, Rev. 2.1 (NACE Rev. 2.1)
top concept of: Statistical Classification of Economic Activities in the European Community, Rev. 2.1 (NACE Rev. 2.1)
Mapping Cardinality: 1 1

Mining and quarrying n.e.c.
type: Concept
broader: Other mining and quarrying
in scheme: Statistical Classification of Economic Activities in the European Community, Rev. 2.1 (NACE Rev. 2.1)
Notation: 08.9
top concept of: Statistical Classification of Economic Activities in the European Community, Rev. 2.1 (NACE Rev. 2.1)

ConceptNoneRandom0.26420707599029936
type: ConceptAssociation
description: NACE Rev. 2.1 class 17.21 is mapped to NACE Rev. 2 class 17.21
Type: 1:1
Source Concept: Manufacture of corrugated paper, paperboard and containers of paper and paperboard
Target Concept: http://data.europa.eu/ux2/nace2/1721
in scheme: Statistical Classification of Economic Activities in the European Community, Rev. 2.1 (NACE Rev. 2.1)
scope note: the content of the NACE Rev 2.1 class is fully covered in the corresponding NACE Rev 2 class
top concept of: Statistical Classification of Economic Activities in the European Community, Rev. 2.1 (NACE Rev. 2.1)
Mapping Cardinality: 1 1

Retail sale of fruit and vegetables
type: Concept
CoreContentNote: This class includes: - retail sale of fresh fruits and vegetables, including cut fresh fruits and vegetables - retail sale of dried and preserved fruits and vegetables
Exclusion Note: This class excludes: - retail sale of fruit and vegetable juices, see 47.25
broader: Retail sale of food, beverages and tobacco
in scheme: Statistical Classification of Economic Activities in the European Community, Rev. 2.1 (NACE Rev. 2.1)
Notation: 47.21
top concept of: Statistical Classification of Economic Activities in the European Community, Rev. 2.1 (NACE Rev. 2.1)

ConceptNoneRandom0.7970523941899572
type: ConceptAssociation
description: NACE Rev. 2.1 class 38.11 is mapped to NACE Rev. 2 class 38.11
Type: 1:1
Source Concept: Collection of non-hazardous waste
Target Concept: http://data.europa.eu/ux2/nace2/3811
in scheme: Statistical Classification of Economic Activities in the European Community, Rev. 2.1 (NACE Rev. 2.1)
scope note: the content of the NACE Rev 2.1 class is fully covered in the corresponding NACE Rev 2 class
top concept of: Statistical Classification of Economic Activities in the European Community, Rev. 2.1 (NACE Rev. 2.1)
Mapping Cardinality: 1 1

ConceptNoneRandom0.023730266453235727
type: ConceptAssociation
description: NACE Rev. 2.1 division 33 is mapped to NACE Rev. 2 divisions 30, 33
Type: 48:49
Source Concept: Repair, maintenance and installation of machinery and equipment
Target Concept: http://data.europa.eu/ux2/nace2/30
Target Concept: http://data.europa.eu/ux2/nace2/33
in scheme: Statistical Classification of Economic Activities in the European Community, Rev. 2.1 (NACE Rev. 2.1)
top concept of: Statistical Classification of Economic Activities in the European Community, Rev. 2.1 (NACE Rev. 2.1)
Mapping Cardinality: n m

ConceptNoneRandom0.5944002528675622
type: ConceptAssociation
description: NACE Rev. 2.1 class 86.22 is mapped to NACE Rev. 2 class 86.22
Type: 1:1
Source Concept: Medical specialists activities
Target Concept: http://data.europa.eu/ux2/nace2/8622
in scheme: Statistical Classification of Economic Activities in the European Community, Rev. 2.1 (NACE Rev. 2.1)
scope note: the content of the NACE Rev 2.1 class is fully covered in the corresponding NACE Rev 2 class
top concept of: Statistical Classification of Economic Activities in the European Community, Rev. 2.1 (NACE Rev. 2.1)
Mapping Cardinality: 1 1

Wholesale of coffee, tea, cocoa and spices
type: Concept
Exclusion Note: This class excludes: - processing of tea and coffee, see 10.83 - wholesale of prepared beverages in cans or bottles, see 46.34
broader: Wholesale of food, beverages and tobacco
in scheme: Statistical Classification of Economic Activities in the European Community, Rev. 2.1 (NACE Rev. 2.1)
Notation: 46.37
top concept of: Statistical Classification of Economic Activities in the European Community, Rev. 2.1 (NACE Rev. 2.1)

Processing and finishing of wood
type: Concept
CoreContentNote: This class includes general activities for the processing and finishing of wood, which are typically carried out on a fee or contract basis: - activities mostly carried out on a fee or contract basis: • boring, turning, milling, broaching, levelling, grinding, polishing, splicing, etc., of wood - drying of wood - impregnation or chemical treatment of wood - treatment of wood in the rough with paint, stains or other preservatives - other activities of processing and finishing of wood
Exclusion Note: This class excludes: - manufacture of unassembled wooden flooring, see 16.11 - coating, impregnation or chemical treatment of wooden products, see 16.27 - disinfection and extermination services in buildings, etc., see 81.23 - reupholstering, refinishing and repairing of furniture, see 95.24
broader: Sawmilling and planing of wood; processing and finishing of wood
in scheme: Statistical Classification of Economic Activities in the European Community, Rev. 2.1 (NACE Rev. 2.1)
Notation: 16.12
top concept of: Statistical Classification of Economic Activities in the European Community, Rev. 2.1 (NACE Rev. 2.1)

ConceptNoneRandom0.7999659635286048
type: ConceptAssociation
description: NACE Rev. 2.1 class 98.20 is mapped to NACE Rev. 2 class 98.20
Type: 1:1
Source Concept: Undifferentiated service-producing activities of private households for own use
Target Concept: http://data.europa.eu/ux2/nace2/9820
in scheme: Statistical Classification of Economic Activities in the European Community, Rev. 2.1 (NACE Rev. 2.1)
scope note: the content of the NACE Rev 2.1 class is fully covered in the corresponding NACE Rev 2 class
top concept of: Statistical Classification of Economic Activities in the European Community, Rev. 2.1 (NACE Rev. 2.1)
Mapping Cardinality: 1 1

ConceptNoneRandom0.7939302210251739
type: ConceptAssociation
description: NACE Rev. 2.1 group 47.5 is mapped to NACE Rev. 2 groups 47.5, 47.7, 47.8, 47.9
Type: 42:34
Source Concept: Retail sale of other household equipment
Target Concept: http://data.europa.eu/ux2/nace2/479
Target Concept: http://data.europa.eu/ux2/nace2/478
Target Concept: http://data.europa.eu/ux2/nace2/477
Target Concept: http://data.europa.eu/ux2/nace2/475
in scheme: Statistical Classification of Economic Activities in the European Community, Rev. 2.1 (NACE Rev. 2.1)
top concept of: Statistical Classification of Economic Activities in the European Community, Rev. 2.1 (NACE Rev. 2.1)
Mapping Cardinality: n m

Close match

Manufacture of man-made fibres
type: Concept
CoreContentNote: This class includes: - manufacture of synthetic or artificial filament tow - manufacture of synthetic or artificial staple fibres, not carded, combed or otherwise processed for spinning - manufacture of synthetic or artificial filament yarn, including high-tenacity yarn - manufacture of synthetic or artificial monofilament or strip - manufacture of recycled fibres
Exclusion Note: This class excludes: - spinning of synthetic or artificial fibres, see 13.10 - manufacture of yarns made of man-made staple, see 13.10 - manufacture of carbon fibres, see 23.99
broader: Manufacture of man-made fibres
in scheme: Statistical Classification of Economic Activities in the European Community, Rev. 2.1 (NACE Rev. 2.1)
Notation: 20.60
top concept of: Statistical Classification of Economic Activities in the European Community, Rev. 2.1 (NACE Rev. 2.1)

Combined facilities support activities
type: Concept
CoreContentNote: This class includes the provision of a combination of support services within clients’ facilities. These services include general interior cleaning, maintenance, waste disposal, doormen and surveillance services, mail routing, reception, laundry and related services to support operations within facilities. These support activities are performed by operating staff, who are not involved with or responsible for the core business or activities of the client.
Exclusion Note: This class excludes: - provision of on-site management and operation of a client’s computer systems and/or data processing facilities, see 62.20 - management of real estate (e.g. property management of real estate or dwellings in joint ownership (mostly carried out on a fee or contract basis)), see 68.32 - guard and security service activities, see 80.01 - operation of prisons on a contract or fee basis, see 84.23 - provision of only one of the support services (e.g. general interior cleaning services) or addressing only a single function (e.g. heating), see the appropriate NACE class according to the service provided - provision of management and operating staff for the complete operation of a client’s establishment (e.g. hotel, restaurant, mine, hospital), see the class of the unit operated
broader: Combined facilities support activities
in scheme: Statistical Classification of Economic Activities in the European Community, Rev. 2.1 (NACE Rev. 2.1)
Notation: 81.10
top concept of: Statistical Classification of Economic Activities in the European Community, Rev. 2.1 (NACE Rev. 2.1)

Retail sale of meat and meat products
type: Concept
Additional Content Note: This class also includes: - retail sale of snails
CoreContentNote: This class includes: - retail sale of meat and meat products, including poultry and game - retail sale of tripe, delicatessen (charcuterie), salted meat
broader: Retail sale of food, beverages and tobacco
in scheme: Statistical Classification of Economic Activities in the European Community, Rev. 2.1 (NACE Rev. 2.1)
Notation: 47.22
top concept of: Statistical Classification of Economic Activities in the European Community, Rev. 2.1 (NACE Rev. 2.1)

ConceptNoneRandom0.8662884263513996
type: ConceptAssociation
description: NACE Rev. 2.1 class 38.12 is mapped to NACE Rev. 2 class 38.12
Type: 1:1
Source Concept: Collection of hazardous waste
Target Concept: http://data.europa.eu/ux2/nace2/3812
in scheme: Statistical Classification of Economic Activities in the European Community, Rev. 2.1 (NACE Rev. 2.1)
scope note: the content of the NACE Rev 2.1 class is fully covered in the corresponding NACE Rev 2 class
top concept of: Statistical Classification of Economic Activities in the European Community, Rev. 2.1 (NACE Rev. 2.1)
Mapping Cardinality: 1 1

ConceptNoneRandom0.724506466523857
type: ConceptAssociation
description: NACE Rev. 2.1 division 32 is mapped to NACE Rev. 2 divisions 27, 32
Type: 48:49
Source Concept: Other manufacturing
Target Concept: http://data.europa.eu/ux2/nace2/32
Target Concept: http://data.europa.eu/ux2/nace2/27
in scheme: Statistical Classification of Economic Activities in the European Community, Rev. 2.1 (NACE Rev. 2.1)
top concept of: Statistical Classification of Economic Activities in the European Community, Rev. 2.1 (NACE Rev. 2.1)
Mapping Cardinality: n m

ConceptNoneRandom0.23863719764785862
type: ConceptAssociation
description: NACE Rev. 2.1 class 62.20 is mapped to NACE Rev. 2 classes 62.02, 62.03
Type: 1:2
Source Concept: Computer consultancy and computer facilities management activities
Target Concept: http://data.europa.eu/ux2/nace2/6203
Target Concept: http://data.europa.eu/ux2/nace2/6202
in scheme: Statistical Classification of Economic Activities in the European Community, Rev. 2.1 (NACE Rev. 2.1)
scope note: 62.02: - planning and designing of computer systems, which integrate computer hardware, software and communication technologies - related users training 62.03: - provision of on-site management and operation of clients' computer systems and/or data processing facilities, as well as related support services
top concept of: Statistical Classification of Economic Activities in the European Community, Rev. 2.1 (NACE Rev. 2.1)
Mapping Cardinality: 1 m

Manufacture of military fighting vehicles
type: Concept
Additional Content Note: This class also includes: - factory overhaul and rebuilding of military fighting vehicles
CoreContentNote: This class includes the manufacture of military fighting vehicles, whether or not fitted with weapons, and of parts of such vehicles, for example: - manufacture of tanks - manufacture of armoured combat vehicles for transporting persons - manufacture of armoured supply vehicles or armoured recovery vehicles with cranes - manufacture of armoured amphibious military vehicles - manufacture of remotely operated tanks - manufacture of armoured fighting vehicle bodies and parts thereof (e.g. armoured turrets, armoured doors and covers) - manufacture of armoured plates that are identifiable as parts of military fighting vehicles - manufacture of special tracks and special wheels, and drive wheels for armoured fighting vehicles
Exclusion Note: This class excludes: - manufacture of weapons and ammunition, see 25.30 - manufacture of passenger cars and trucks with light armour or with removable armour, see 29.10 - manufacture of military ships, see 30.13 - manufacture of drones for military purposes, see 30.32 - repair and maintenance of military fighting vehicles, see 33.18
broader: Manufacture of military fighting vehicles
in scheme: Statistical Classification of Economic Activities in the European Community, Rev. 2.1 (NACE Rev. 2.1)
Notation: 30.40
top concept of: Statistical Classification of Economic Activities in the European Community, Rev. 2.1 (NACE Rev. 2.1)

Retail sale of fish, crustaceans and molluscs
type: Concept
Additional Content Note: This class also includes: - retail sale of algae and seaweed
CoreContentNote: This class includes: - retail sale of fish, seafood, seafood products and preparations thereof
broader: Retail sale of food, beverages and tobacco
in scheme: Statistical Classification of Economic Activities in the European Community, Rev. 2.1 (NACE Rev. 2.1)
Notation: 47.23
top concept of: Statistical Classification of Economic Activities in the European Community, Rev. 2.1 (NACE Rev. 2.1)

ConceptNoneRandom0.8676259862545945
type: ConceptAssociation
description: NACE Rev. 2.1 class 86.23 is mapped to NACE Rev. 2 class 86.23
Type: 1:1
Source Concept: Dental practice care activities
Target Concept: http://data.europa.eu/ux2/nace2/8623
in scheme: Statistical Classification of Economic Activities in the European Community, Rev. 2.1 (NACE Rev. 2.1)
scope note: the content of the NACE Rev 2.1 class is fully covered in the corresponding NACE Rev 2 class
top concept of: Statistical Classification of Economic Activities in the European Community, Rev. 2.1 (NACE Rev. 2.1)
Mapping Cardinality: 1 1

Manufacture of sugar
type: Concept
CoreContentNote: This class includes: - manufacture or refining of sugar (sucrose) and sugar substitutes from the juice of cane, beet, maple and palm - manufacture of sugar syrups - manufacture of molasses - production of maple syrup and sugar
Exclusion Note: This class excludes: - gathering of maple syrup in the wild, see 02.30 - manufacture of lactose and lactose syrup, see 10.51 - manufacture of glucose, glucose syrup, maltose, see 10.62
broader: Manufacture of other food products
in scheme: Statistical Classification of Economic Activities in the European Community, Rev. 2.1 (NACE Rev. 2.1)
Notation: 10.81
top concept of: Statistical Classification of Economic Activities in the European Community, Rev. 2.1 (NACE Rev. 2.1)

Wholesale of other food
type: Concept
Additional Content Note: This class also includes: - wholesale of ready-made meals - wholesale of homogenised food preparations and dietetic food - wholesale of food for pets - wholesale of food supplements for human consumption - wholesale of insects (e.g. crickets) which are processed and ready-to-eat
CoreContentNote: This class includes other specialised wholesale of food not already classified in the previous classes 46.31 to 46.37 (for example, wholesale of salt, vinegar, flour, yeast, honey).
Exclusion Note: This class excludes: - wholesale of livestock feed, see 46.21
broader: Wholesale of food, beverages and tobacco
in scheme: Statistical Classification of Economic Activities in the European Community, Rev. 2.1 (NACE Rev. 2.1)
Notation: 46.38
top concept of: Statistical Classification of Economic Activities in the European Community, Rev. 2.1 (NACE Rev. 2.1)

ConceptNoneRandom0.9378358442609833
type: ConceptAssociation
description: NACE Rev. 2.1 class 58.19 is mapped to NACE Rev. 2 classes 58.12, 58.19
Type: 1:2
Source Concept: Other publishing activities, except software publishing
Target Concept: http://data.europa.eu/ux2/nace2/5819
Target Concept: http://data.europa.eu/ux2/nace2/5812
in scheme: Statistical Classification of Economic Activities in the European Community, Rev. 2.1 (NACE Rev. 2.1)
scope note: 58.12: - publishing in any format, including print, digital or on the internet, e.g.: • directories and mailing lists • compilations, e.g. case law, pharmaceutical compendia 58.19: - publishing in any format, including print, digital or on the internet, e.g.: • catalogues • photos, engravings and postcards • greeting cards • forms • posters • reproduction of works of art • non-bound leaflets and advertising material • statistics and other information • datasets/databases without associated data processing services
top concept of: Statistical Classification of Economic Activities in the European Community, Rev. 2.1 (NACE Rev. 2.1)
Mapping Cardinality: 1 m

Sound recording and music publishing activities
type: Concept
Additional Content Note: This class also includes: - conversion of sound recordings to audio streaming formats - publishing of music and sheet music books
CoreContentNote: This class includes: - production of original (sound) master recordings, including digital recordings, that are accessible online or via any hard copy - sound recording service activities, including the production of recorded (i.e. non-live) radio programming, audio podcasts, as well as audio for film, television, books, etc. - music publishing, i.e. activities of: • acquiring and registering copyrights for musical compositions • promoting, authorising and using these compositions in recordings, radio, television, motion pictures, live performances, print and other media • jointly publishing and distributing sound recordings via streaming and downloads Releasing, promoting and distributing sound recordings to wholesalers, retailers or directly to the public may include production of master recordings or obtaining the reproduction and distribution rights to master recordings.
Exclusion Note: This class excludes: - reproduction from master copies of music or other sound recordings, see 18.20 - wholesale of recorded media, see 46.49 - retail sale of recorded media, see 47.69 - audio streaming and download distribution service activities not associated with publishing, see 60.10 - activities of musicians, see 90.20
broader: Sound recording and music publishing activities
in scheme: Statistical Classification of Economic Activities in the European Community, Rev. 2.1 (NACE Rev. 2.1)
Notation: 59.20
top concept of: Statistical Classification of Economic Activities in the European Community, Rev. 2.1 (NACE Rev. 2.1)

Sawmilling and planing of wood
type: Concept
CoreContentNote: This class includes: - sawing, planing and machining of wood - slicing, peeling or chipping logs - manufacture of wooden railway sleepers - manufacture of unassembled wooden flooring - manufacture outside the forest of wood wool, wood sawdust and flour, wood chips and particles
Exclusion Note: This class excludes: - logging and production of wood in the rough, see 02.20 - drying of wood, see 16.12 - manufacture of veneer sheets thin enough for use in plywood, boards and panels, see 16.21 - manufacture of parquet panels and other assembled flooring panels of wood or bamboo, see 16.22 - manufacture of wooden shingles and shakes, see 16.23 - manufacture of fire logs or pressed wood, see 16.26
broader: Sawmilling and planing of wood; processing and finishing of wood
in scheme: Statistical Classification of Economic Activities in the European Community, Rev. 2.1 (NACE Rev. 2.1)
Notation: 16.11
top concept of: Statistical Classification of Economic Activities in the European Community, Rev. 2.1 (NACE Rev. 2.1)

Business and other management consultancy activities
type: Concept
broader: Activities of head offices and management consultancy
in scheme: Statistical Classification of Economic Activities in the European Community, Rev. 2.1 (NACE Rev. 2.1)
Notation: 70.2
top concept of: Statistical Classification of Economic Activities in the European Community, Rev. 2.1 (NACE Rev. 2.1)

ConceptNoneRandom0.5884958525499762
type: ConceptAssociation
description: NACE Rev. 2.1 group 43.2 is mapped to NACE Rev. 2 groups 43.2, 43.3, 43.9
Type: 26:18
Source Concept: Electrical, plumbing and other construction installation activities
Target Concept: http://data.europa.eu/ux2/nace2/439
Target Concept: http://data.europa.eu/ux2/nace2/433
Target Concept: http://data.europa.eu/ux2/nace2/432
in scheme: Statistical Classification of Economic Activities in the European Community, Rev. 2.1 (NACE Rev. 2.1)
top concept of: Statistical Classification of Economic Activities in the European Community, Rev. 2.1 (NACE Rev. 2.1)
Mapping Cardinality: n m

Sports and recreation education
type: Concept
Additional Content Note: This class also includes: - activities of professional sports instructors, teachers, coaches
CoreContentNote: This class includes the provision of instruction in athletic activities to groups or individuals (for example, by camps, schools). Activities provided by day and overnight sports instruction camps are also included. Instruction may be provided in diverse settings (for example, the unit’s or client’s training facilities, educational institutions) or by other means, including the internet. Instruction provided in this class offers structured educational arrangements (for example, student-teacher relationships) that are specially designed for education and learning. However, it does not lead to qualifications at primary through to tertiary levels. This class includes: - sports instruction in camps or schools - gymnastics instruction - riding instruction - swimming instruction - martial arts instruction - card game instruction (e.g. bridge) - board game courses - yoga or Pilates instruction - e-sports instruction
Exclusion Note: This class excludes: - activities provided by academic schools, colleges and universities, see 85.40 - cultural education, see 85.52 - sports training within sports clubs, see 93.12 - fitness instruction provided by fitness centres, yoga studios and similar facilities, see 93.13
broader: Other education
in scheme: Statistical Classification of Economic Activities in the European Community, Rev. 2.1 (NACE Rev. 2.1)
Notation: 85.51
top concept of: Statistical Classification of Economic Activities in the European Community, Rev. 2.1 (NACE Rev. 2.1)

ConceptNoneRandom0.9087035431802637
type: ConceptAssociation
description: NACE Rev. 2.1 class 23.91 is mapped to NACE Rev. 2 class 23.91
Type: 1:1
Source Concept: Manufacture of abrasive products
Target Concept: http://data.europa.eu/ux2/nace2/2391
in scheme: Statistical Classification of Economic Activities in the European Community, Rev. 2.1 (NACE Rev. 2.1)
scope note: the content of the NACE Rev 2.1 class is fully covered in the corresponding NACE Rev 2 class
top concept of: Statistical Classification of Economic Activities in the European Community, Rev. 2.1 (NACE Rev. 2.1)
Mapping Cardinality: 1 1

ConceptNoneRandom0.7530288763949444
type: ConceptAssociation
description: NACE Rev. 2.1 class 30.20 is mapped to NACE Rev. 2 class 30.20
Type: 1:1
Source Concept: Manufacture of railway locomotives and rolling stock
Target Concept: http://data.europa.eu/ux2/nace2/3020
in scheme: Statistical Classification of Economic Activities in the European Community, Rev. 2.1 (NACE Rev. 2.1)
scope note: the content of the NACE Rev 2.1 class is fully covered in the corresponding NACE Rev 2 class
top concept of: Statistical Classification of Economic Activities in the European Community, Rev. 2.1 (NACE Rev. 2.1)
Mapping Cardinality: 1 1

ConceptNoneRandom0.4313053177939278
type: ConceptAssociation
description: NACE Rev. 2.1 division 75 is mapped to NACE Rev. 2 division 75
Type: 1:1
Source Concept: Veterinary activities
Target Concept: http://data.europa.eu/ux2/nace2/75
in scheme: Statistical Classification of Economic Activities in the European Community, Rev. 2.1 (NACE Rev. 2.1)
top concept of: Statistical Classification of Economic Activities in the European Community, Rev. 2.1 (NACE Rev. 2.1)
Mapping Cardinality: 1 1

Freight transport by road
type: Concept
Additional Content Note: This class also includes: - rental of freight vehicles with a driver - freight road transport by vehicles drawn by humans or animals - rental of concrete mixer lorries with a driver - delivery of furniture, can include unpacking and installation
CoreContentNote: This class includes: - all freight transport operations by road: • logging haulage • livestock haulage • refrigerated haulage • heavy haulage • bulk haulage, including haulage in tanker trucks, including milk collection at farms • haulage of automobiles • transport of waste and waste materials, without collection or disposal - road transport of freight, on behalf of postal or courier units, without carrying out any other post or courier activities - road transport of objects between different units (e.g. buildings, storage units, on a fee or contract basis)
Exclusion Note: This class excludes: - log hauling within the forest, as part of logging operations, see 02.40 - distribution of water by trucks, see 36.00 - waste transport as an integrated part of waste collection activities, see 38.11, 38.12 - removal services, see 49.42 - operation of terminal facilities for handling freight, see 52.2 - crating and packing activities for transport, see 52.2 - moving cargos on industrial sites, typically with transport equipment that is not suitable for use on roads open to public traffic, see 52.24 - pickup of goods and grouping for shipping, see 52.25 - post and courier activities, see 53.10, 53.20 - transport by armoured car service activities, see 80.01
broader: Freight transport by road and removal services
in scheme: Statistical Classification of Economic Activities in the European Community, Rev. 2.1 (NACE Rev. 2.1)
Notation: 49.41
top concept of: Statistical Classification of Economic Activities in the European Community, Rev. 2.1 (NACE Rev. 2.1)

Manufacture of leather and related products of other materials
type: Concept
Additional Content Note: It also includes the manufacture of direct substitute products (like-products) made from materials other than leather (for example, rubber footwear, textile luggage). Products made from leather substitutes are included here because they are made in ways similar to those in which leather products are made (for example, luggage) and are often produced in the same unit.
CoreContentNote: This division includes dressing and dyeing of fur and the transformation of hides or skins into leather by tanning or curing and fabricating the leather into products for final consumption.
broader: MANUFACTURING
in scheme: Statistical Classification of Economic Activities in the European Community, Rev. 2.1 (NACE Rev. 2.1)
Notation: 15
top concept of: Statistical Classification of Economic Activities in the European Community, Rev. 2.1 (NACE Rev. 2.1)

Gambling and betting activities
type: Concept
broader: Gambling and betting activities
in scheme: Statistical Classification of Economic Activities in the European Community, Rev. 2.1 (NACE Rev. 2.1)
Notation: 92.0
top concept of: Statistical Classification of Economic Activities in the European Community, Rev. 2.1 (NACE Rev. 2.1)

ConceptNoneRandom0.82749859872205
type: ConceptAssociation
description: NACE Rev. 2.1 class 17.23 is mapped to NACE Rev. 2 class 17.23
Type: 1:1
Source Concept: Manufacture of paper stationery
Target Concept: http://data.europa.eu/ux2/nace2/1723
in scheme: Statistical Classification of Economic Activities in the European Community, Rev. 2.1 (NACE Rev. 2.1)
scope note: the content of the NACE Rev 2.1 class is fully covered in the corresponding NACE Rev 2 class
top concept of: Statistical Classification of Economic Activities in the European Community, Rev. 2.1 (NACE Rev. 2.1)
Mapping Cardinality: 1 1

OTHER SERVICE ACTIVITIES
type: Concept
CoreContentNote: This section (as a residual category) includes the activities of membership organisations, the repair of computers, personal and household goods, motor vehicles and motorcycles, and a variety of personal service activities not covered elsewhere in the classification.
in scheme: Statistical Classification of Economic Activities in the European Community, Rev. 2.1 (NACE Rev. 2.1)
Notation: T
top concept of: Statistical Classification of Economic Activities in the European Community, Rev. 2.1 (NACE Rev. 2.1)

ConceptNoneRandom0.7273787686697136
type: ConceptAssociation
description: NACE Rev. 2.1 class 85.31 is mapped to NACE Rev. 2 class 85.31
Type: 1:1
Source Concept: General secondary education
Target Concept: http://data.europa.eu/ux2/nace2/8531
in scheme: Statistical Classification of Economic Activities in the European Community, Rev. 2.1 (NACE Rev. 2.1)
scope note: the content of the NACE Rev 2.1 class is fully covered in the corresponding NACE Rev 2 class
top concept of: Statistical Classification of Economic Activities in the European Community, Rev. 2.1 (NACE Rev. 2.1)
Mapping Cardinality: 1 1

Non-specialised wholesale of food, beverages and tobacco
type: Concept
CoreContentNote: This class includes the wholesale of food, beverages and tobacco products sold in five or more classes of group 46.3. If the products sold comprise up to four classes in group 46.3, the unit is considered a specialised trade and is classified, following the principal activity defined on the basis of its value added, in classes 46.31 to 46.38.
broader: Wholesale of food, beverages and tobacco
in scheme: Statistical Classification of Economic Activities in the European Community, Rev. 2.1 (NACE Rev. 2.1)
Notation: 46.39
top concept of: Statistical Classification of Economic Activities in the European Community, Rev. 2.1 (NACE Rev. 2.1)

Manufacture of wearing apparel
type: Concept
Additional Content Note: This division also includes: - manufacture of articles of apparel, clothing accessories and other articles of fur skin
CoreContentNote: This division includes all tailoring (ready-to-wear or made-to-measure), in all materials (for example, leather, fur fabric, knitted and crocheted fabrics), of all items of clothing (for example, outerwear, underwear for men, women or children; work, city or casual clothing) and accessories. There is no distinction made between clothing for adults and clothing for children.
Exclusion Note: This division excludes: - repair of wearing apparel, see 95.29
broader: MANUFACTURING
in scheme: Statistical Classification of Economic Activities in the European Community, Rev. 2.1 (NACE Rev. 2.1)
Notation: 14
top concept of: Statistical Classification of Economic Activities in the European Community, Rev. 2.1 (NACE Rev. 2.1)

Manufacture of articles of paper and paperboard
type: Concept
broader: Manufacture of paper and paper products
in scheme: Statistical Classification of Economic Activities in the European Community, Rev. 2.1 (NACE Rev. 2.1)
Notation: 17.2
top concept of: Statistical Classification of Economic Activities in the European Community, Rev. 2.1 (NACE Rev. 2.1)

Remediation activities and other waste management service activities
type: Concept
broader: Remediation activities and other waste management service activities
in scheme: Statistical Classification of Economic Activities in the European Community, Rev. 2.1 (NACE Rev. 2.1)
Notation: 39.0
top concept of: Statistical Classification of Economic Activities in the European Community, Rev. 2.1 (NACE Rev. 2.1)

Retail sale of bread, cake and confectionery
type: Concept
Additional Content Note: This class also includes: - retail sale of bread and rolls baked on the premises from pre-baked products - retail sale by automatic machines of ready-to-eat bread prepared by the machine itself
Exclusion Note: This class excludes: - manufacture of bread, fresh pastry goods and cakes, see 10.71
broader: Retail sale of food, beverages and tobacco
in scheme: Statistical Classification of Economic Activities in the European Community, Rev. 2.1 (NACE Rev. 2.1)
Notation: 47.24
top concept of: Statistical Classification of Economic Activities in the European Community, Rev. 2.1 (NACE Rev. 2.1)

Activities of fitness centres
type: Concept
Additional Content Note: This class also includes: - instruction provided by fitness clubs, yoga studios and similar facilities
CoreContentNote: This class includes: - activities of fitness clubs - activities of yoga studios - activities of Pilates studios - activities of tai chi studios
Exclusion Note: This class excludes: - sports instruction by individual teachers/trainers, see 85.51
broader: Sports activities
in scheme: Statistical Classification of Economic Activities in the European Community, Rev. 2.1 (NACE Rev. 2.1)
Notation: 93.13
top concept of: Statistical Classification of Economic Activities in the European Community, Rev. 2.1 (NACE Rev. 2.1)

ConceptNoneRandom0.4108316868678964
type: ConceptAssociation
description: NACE Rev. 2.1 class 06.10 is mapped to NACE Rev. 2 class 06.10
Type: 1:1
Source Concept: Extraction of crude petroleum
Target Concept: http://data.europa.eu/ux2/nace2/0610
in scheme: Statistical Classification of Economic Activities in the European Community, Rev. 2.1 (NACE Rev. 2.1)
scope note: the content of the NACE Rev 2.1 class is fully covered in the corresponding NACE Rev 2 class
top concept of: Statistical Classification of Economic Activities in the European Community, Rev. 2.1 (NACE Rev. 2.1)
Mapping Cardinality: 1 1

Repair and maintenance of motor vehicles
type: Concept
Additional Content Note: This class also includes: - repair and maintenance of caravan and motorhome housing cells
CoreContentNote: This class includes: - repair and maintenance of motor vehicles, including trailers and semi-trailers, e.g.: • mechanical repairs • electrical repairs • electronic injection systems repair • ordinary servicing • bodywork repair • repair of motor vehicle parts • washing, polishing, etc. • spraying and painting • repair of screens and windows • repair of motor vehicle seats • mechatronics system repair and diagnostics services - repair, fitting or replacement service activities for tubes and tyres - anti-rust treatment - installation of parts and accessories not as part of the manufacturing process - repair and maintenance of non-military amphibious vehicles
Exclusion Note: This class excludes: - retreading and rebuilding of tyres, see 22.11 - fitting out services for caravans and motorhomes, see 29.20 - repair of forklifts and agricultural tractors, see 33.12
broader: Repair and maintenance of motor vehicles and motorcycles
in scheme: Statistical Classification of Economic Activities in the European Community, Rev. 2.1 (NACE Rev. 2.1)
Notation: 95.31
top concept of: Statistical Classification of Economic Activities in the European Community, Rev. 2.1 (NACE Rev. 2.1)

Inland freight water transport
type: Concept
Additional Content Note: This class also includes: - rental of vessels with crew for inland freight water transport
CoreContentNote: This class includes: - transport of freight via rivers, canals, lakes and other inland waterways, including inside harbours and ports - transport of freight on inland waterways, involving vessels that are not suitable for sea transport
Exclusion Note: This class excludes: - cargo handling, see 52.24 - rental of commercial ships or boats without crew, see 77.34
broader: Inland freight water transport
in scheme: Statistical Classification of Economic Activities in the European Community, Rev. 2.1 (NACE Rev. 2.1)
Notation: 50.40
top concept of: Statistical Classification of Economic Activities in the European Community, Rev. 2.1 (NACE Rev. 2.1)

ConceptNoneRandom0.8240531974576076
type: ConceptAssociation
description: NACE Rev. 2.1 class 43.99 is mapped to NACE Rev. 2 classes 41.20, 43.99
Type: 23:16
Source Concept: Other specialised construction activities n.e.c.
Target Concept: http://data.europa.eu/ux2/nace2/4120
Target Concept: http://data.europa.eu/ux2/nace2/4399
in scheme: Statistical Classification of Economic Activities in the European Community, Rev. 2.1 (NACE Rev. 2.1)
scope note: 41.20: - renovation, renewal, reconstruction and retrofitting of historical and archaeological sites and buildings 43.99: - construction activities specialising in one aspect common to different kind of structures, requiring specialised skill or equipment, n.e.c.: • reinforcement steel bending activities, at the construction site • scaffolds and work platform erecting and dismantling - erection of construction site safety equipment - work with specialist access requirements necessitating climbing skills and the use of related equipment, e.g. working at height on tall structures - rental of cranes and other building equipment, which cannot be allocated to a specific construction type, with an operator - repairing of reinforced concrete structures (e.g. beams, columns) - erection of billboards or advertising columns - concreting works
top concept of: Statistical Classification of Economic Activities in the European Community, Rev. 2.1 (NACE Rev. 2.1)
Mapping Cardinality: n m

ConceptNoneRandom0.6881457988856144
type: ConceptAssociation
description: NACE Rev. 2.1 class 65.30 is mapped to NACE Rev. 2 class 65.30
Type: 1:1
Source Concept: Pension funding
Target Concept: http://data.europa.eu/ux2/nace2/6530
in scheme: Statistical Classification of Economic Activities in the European Community, Rev. 2.1 (NACE Rev. 2.1)
scope note: the content of the NACE Rev 2.1 class is fully covered in the corresponding NACE Rev 2 class
top concept of: Statistical Classification of Economic Activities in the European Community, Rev. 2.1 (NACE Rev. 2.1)
Mapping Cardinality: 1 1

ConceptNoneRandom0.5810031295216523
type: ConceptAssociation
description: NACE Rev. 2.1 group 65.1 is mapped to NACE Rev. 2 group 65.1
Type: 1:1
Source Concept: Insurance
Target Concept: http://data.europa.eu/ux2/nace2/651
in scheme: Statistical Classification of Economic Activities in the European Community, Rev. 2.1 (NACE Rev. 2.1)
top concept of: Statistical Classification of Economic Activities in the European Community, Rev. 2.1 (NACE Rev. 2.1)
Mapping Cardinality: 1 1

ConceptNoneRandom0.8705502951425668
type: ConceptAssociation
description: NACE Rev. 2.1 group 43.3 is mapped to NACE Rev. 2 groups 43.3, 43.9
Type: 26:18
Source Concept: Building completion and finishing
Target Concept: http://data.europa.eu/ux2/nace2/439
Target Concept: http://data.europa.eu/ux2/nace2/433
in scheme: Statistical Classification of Economic Activities in the European Community, Rev. 2.1 (NACE Rev. 2.1)
top concept of: Statistical Classification of Economic Activities in the European Community, Rev. 2.1 (NACE Rev. 2.1)
Mapping Cardinality: n m

ConceptNoneRandom0.014303978680230034
type: ConceptAssociation
description: NACE Rev. 2.1 class 17.22 is mapped to NACE Rev. 2 class 17.22
Type: 1:1
Source Concept: Manufacture of household and sanitary goods and of toilet requisites
Target Concept: http://data.europa.eu/ux2/nace2/1722
in scheme: Statistical Classification of Economic Activities in the European Community, Rev. 2.1 (NACE Rev. 2.1)
scope note: the content of the NACE Rev 2.1 class is fully covered in the corresponding NACE Rev 2 class
top concept of: Statistical Classification of Economic Activities in the European Community, Rev. 2.1 (NACE Rev. 2.1)
Mapping Cardinality: 1 1

Other personal service activities
type: Concept
broader: Personal service activities
in scheme: Statistical Classification of Economic Activities in the European Community, Rev. 2.1 (NACE Rev. 2.1)
Notation: 96.9
top concept of: Statistical Classification of Economic Activities in the European Community, Rev. 2.1 (NACE Rev. 2.1)

ConceptNoneRandom0.3342830905572347
type: ConceptAssociation
description: NACE Rev. 2.1 division 74 is mapped to NACE Rev. 2 division 74
Type: 48:49
Source Concept: Other professional, scientific and technical activities
Target Concept: http://data.europa.eu/ux2/nace2/74
in scheme: Statistical Classification of Economic Activities in the European Community, Rev. 2.1 (NACE Rev. 2.1)
top concept of: Statistical Classification of Economic Activities in the European Community, Rev. 2.1 (NACE Rev. 2.1)
Mapping Cardinality: n m

Cultural education
type: Concept
Additional Content Note: This class also includes: - activities of professional arts instructors and teachers
CoreContentNote: This class includes the provision of instruction in the arts, drama and music (for example, by schools, studios, classes). Structured educational arrangements specially designed for education and learning (for example, student-teacher relationships and/or interactions) are provided. Such instruction is mainly for hobby, recreational or self-development purposes, and does not lead to qualifications at primary through to tertiary levels. This class includes: - music instruction - art instruction - dance instruction - drama, fine arts, performing arts and photography instruction
Exclusion Note: This class excludes: - education activities of drama, fine arts, performing arts and photography schools which lead to qualifications at secondary, post-secondary non-tertiary or tertiary levels, see 85.3, 85.40 - foreign language instruction, see 85.59 - mediation activities, see 88.99
broader: Other education
in scheme: Statistical Classification of Economic Activities in the European Community, Rev. 2.1 (NACE Rev. 2.1)
Notation: 85.52
top concept of: Statistical Classification of Economic Activities in the European Community, Rev. 2.1 (NACE Rev. 2.1)

Removal services
type: Concept
Additional Content Note: This class also includes: - leasing of removal vehicles with a driver - storage of furniture as part of the removal service
CoreContentNote: This class includes: - removal (relocation) services to businesses and households by road transport
broader: Freight transport by road and removal services
in scheme: Statistical Classification of Economic Activities in the European Community, Rev. 2.1 (NACE Rev. 2.1)
Notation: 49.42
top concept of: Statistical Classification of Economic Activities in the European Community, Rev. 2.1 (NACE Rev. 2.1)

Manufacture of wood and of products of wood and cork, except furniture; manufacture of articles of straw and plaiting materials
type: Concept
CoreContentNote: This division includes the manufacture of wood products (for example, lumber, plywood, veneers, wood containers, wood flooring, wood trusses, prefabricated wood buildings, the manufacture of solid fuels from vegetable biomass, the finishing of wooden products). The production processes include sawing, planing, shaping, laminating and assembling of wood products starting from logs that are cut into bolts, or lumber that may then be cut further, or shaped by lathes or other shaping tools. The lumber or other transformed wood shapes may also be subsequently planed or smoothed, and assembled into finished products (for example, wooden containers). With the exception of sawmilling, this division is subdivided mainly based on the specific products manufactured.
Exclusion Note: This division excludes the manufacture of furniture (see 31.00), or the installation of wooden fittings, and so on, see 43.32, 43.33, 43.35.
broader: MANUFACTURING
in scheme: Statistical Classification of Economic Activities in the European Community, Rev. 2.1 (NACE Rev. 2.1)
Notation: 16
top concept of: Statistical Classification of Economic Activities in the European Community, Rev. 2.1 (NACE Rev. 2.1)

Television programming, broadcasting and video distribution activities
type: Concept
Additional Content Note: This class also includes: - programming of video-on-demand channels - video streaming and download service activities not associated with its publishing - broadcasting of live performances and events - operation of video game streaming sites
CoreContentNote: This class includes the creation of a complete television channel programme, from purchased programme components (for example, movies, documentaries), self-produced programme components (for example, local news, live reports), or a combination thereof. This complete television programme can be either broadcast by the producing unit or produced for transmission by a third-party operator of transmission facilities (for example, cable companies, satellite television providers). The programming may be of a general or specialised nature (for example, narrowcast formats such as news, sport, education, youth-oriented programming), may be made freely available to users or may be available only on a subscription basis.
Exclusion Note: This class excludes: - video game publishers, streaming and download distribution service activities of video game publishers, see 58.21 - production of television programme elements (movies, documentaries, talk shows, commercials, etc.), see 59.11 - assembly of a package of channels and transmission of that package, by cable or satellite transmission network operators to viewers, see 61.10 - provision of technical infrastructure related to video streaming services, data processing services and related activities, see 63.10 - rental of recorded videos on physical media to the general public, see 77.22
broader: Television programming, broadcasting and video distribution activities
in scheme: Statistical Classification of Economic Activities in the European Community, Rev. 2.1 (NACE Rev. 2.1)
Notation: 60.20
top concept of: Statistical Classification of Economic Activities in the European Community, Rev. 2.1 (NACE Rev. 2.1)

ConceptNoneRandom0.02703994924472819
type: ConceptAssociation
description: NACE Rev. 2.1 class 85.32 is mapped to NACE Rev. 2 class 85.32
Type: 1:1
Source Concept: Vocational secondary education
Target Concept: http://data.europa.eu/ux2/nace2/8532
in scheme: Statistical Classification of Economic Activities in the European Community, Rev. 2.1 (NACE Rev. 2.1)
scope note: the content of the NACE Rev 2.1 class is fully covered in the corresponding NACE Rev 2 class
top concept of: Statistical Classification of Economic Activities in the European Community, Rev. 2.1 (NACE Rev. 2.1)
Mapping Cardinality: 1 1

ACTIVITIES OF HOUSEHOLDS AS EMPLOYERS AND UNDIFFERENTIATED GOODS - AND SERVICE-PRODUCING ACTIVITIES OF HOUSEHOLDS FOR OWN USE
type: Concept
in scheme: Statistical Classification of Economic Activities in the European Community, Rev. 2.1 (NACE Rev. 2.1)
Notation: U
top concept of: Statistical Classification of Economic Activities in the European Community, Rev. 2.1 (NACE Rev. 2.1)

Retail sale of beverages
type: Concept
Additional Content Note: This class also includes: - retail sale of fruit and vegetable juices
CoreContentNote: This class includes: - retail sale of alcoholic and non-alcoholic beverages, not for consumption or manufactured on the premises
Exclusion Note: This class excludes: - sale of beverages for consumption on the premises, see 56.30
broader: Retail sale of food, beverages and tobacco
in scheme: Statistical Classification of Economic Activities in the European Community, Rev. 2.1 (NACE Rev. 2.1)
Notation: 47.25
top concept of: Statistical Classification of Economic Activities in the European Community, Rev. 2.1 (NACE Rev. 2.1)

Other telecommunication activities
type: Concept
broader: Telecommunication
in scheme: Statistical Classification of Economic Activities in the European Community, Rev. 2.1 (NACE Rev. 2.1)
Notation: 61.9
top concept of: Statistical Classification of Economic Activities in the European Community, Rev. 2.1 (NACE Rev. 2.1)

Repair and maintenance of motorcycles
type: Concept
CoreContentNote: This class includes: - repair and maintenance of motorcycles - motorcycle and motorcycle parts spraying and painting activities - bodywork repair on motorcycles - washing, polishing, etc., of motorcycles
Exclusion Note: This class excludes: - repair and maintenance of bicycles and electric bicycles, see 95.29
broader: Repair and maintenance of motor vehicles and motorcycles
in scheme: Statistical Classification of Economic Activities in the European Community, Rev. 2.1 (NACE Rev. 2.1)
Notation: 95.32
top concept of: Statistical Classification of Economic Activities in the European Community, Rev. 2.1 (NACE Rev. 2.1)

ConceptNoneRandom0.8949971416175413
type: ConceptAssociation
description: NACE Rev. 2.1 group 78.1 is mapped to NACE Rev. 2 group 78.1
Type: 1:1
Source Concept: Activities of employment placement agencies
Target Concept: http://data.europa.eu/ux2/nace2/781
in scheme: Statistical Classification of Economic Activities in the European Community, Rev. 2.1 (NACE Rev. 2.1)
top concept of: Statistical Classification of Economic Activities in the European Community, Rev. 2.1 (NACE Rev. 2.1)
Mapping Cardinality: 1 1

ConceptNoneRandom0.5696196194520831
type: ConceptAssociation
description: NACE Rev. 2.1 class 74.20 is mapped to NACE Rev. 2 class 74.20
Type: 4:5
Source Concept: Photographic activities
Target Concept: http://data.europa.eu/ux2/nace2/7420
in scheme: Statistical Classification of Economic Activities in the European Community, Rev. 2.1 (NACE Rev. 2.1)
scope note: the content of the NACE Rev 2.1 class is fully covered in the corresponding NACE Rev 2 class
top concept of: Statistical Classification of Economic Activities in the European Community, Rev. 2.1 (NACE Rev. 2.1)
Mapping Cardinality: n m

ConceptNoneRandom0.28483559930323177
type: ConceptAssociation
description: NACE Rev. 2.1 group 56.3 is mapped to NACE Rev. 2 group 56.3
Type: 1:1
Source Concept: Beverage serving activities
Target Concept: http://data.europa.eu/ux2/nace2/563
in scheme: Statistical Classification of Economic Activities in the European Community, Rev. 2.1 (NACE Rev. 2.1)
top concept of: Statistical Classification of Economic Activities in the European Community, Rev. 2.1 (NACE Rev. 2.1)
Mapping Cardinality: 1 1

ConceptNoneRandom0.8720907274053118
type: ConceptAssociation
description: NACE Rev. 2.1 group 47.8 is mapped to NACE Rev. 2 groups 45.1, 45.3, 45.4
Type: 42:34
Source Concept: Retail sale of motor vehicles, motorcycles and related parts and accessories
Target Concept: http://data.europa.eu/ux2/nace2/454
Target Concept: http://data.europa.eu/ux2/nace2/453
Target Concept: http://data.europa.eu/ux2/nace2/451
in scheme: Statistical Classification of Economic Activities in the European Community, Rev. 2.1 (NACE Rev. 2.1)
top concept of: Statistical Classification of Economic Activities in the European Community, Rev. 2.1 (NACE Rev. 2.1)
Mapping Cardinality: n m

ConceptNoneRandom0.31155002260822506
type: ConceptAssociation
description: NACE Rev. 2.1 group 21.2 is mapped to NACE Rev. 2 group 21.2
Type: 1:1
Source Concept: Manufacture of pharmaceutical preparations
Target Concept: http://data.europa.eu/ux2/nace2/212
in scheme: Statistical Classification of Economic Activities in the European Community, Rev. 2.1 (NACE Rev. 2.1)
top concept of: Statistical Classification of Economic Activities in the European Community, Rev. 2.1 (NACE Rev. 2.1)
Mapping Cardinality: 1 1

ConceptNoneRandom0.6871492524649925
type: ConceptAssociation
description: NACE Rev. 2.1 class 39.00 is mapped to NACE Rev. 2 class 39.00
Type: 1:1
Source Concept: Remediation activities and other waste management service activities
Target Concept: http://data.europa.eu/ux2/nace2/3900
in scheme: Statistical Classification of Economic Activities in the European Community, Rev. 2.1 (NACE Rev. 2.1)
scope note: the content of the NACE Rev 2.1 class is fully covered in the corresponding NACE Rev 2 class
top concept of: Statistical Classification of Economic Activities in the European Community, Rev. 2.1 (NACE Rev. 2.1)
Mapping Cardinality: 1 1

ConceptNoneRandom0.7510148395626408
type: ConceptAssociation
description: NACE Rev. 2.1 class 53.30 is mapped to NACE Rev. 2 class 82.99
Type: 78:65
Source Concept: Intermediation service activities for postal and courier activities
Target Concept: http://data.europa.eu/ux2/nace2/8299
in scheme: Statistical Classification of Economic Activities in the European Community, Rev. 2.1 (NACE Rev. 2.1)
scope note: the content of the NACE Rev 2.1 class is fully covered in the corresponding NACE Rev 2 class
top concept of: Statistical Classification of Economic Activities in the European Community, Rev. 2.1 (NACE Rev. 2.1)
Mapping Cardinality: n m

ConceptNoneRandom0.012506406332403186
type: ConceptAssociation
description: NACE Rev. 2.1 class 17.25 is mapped to NACE Rev. 2 class 17.29
Type: 1:1
Source Concept: Manufacture of other articles of paper and paperboard
Target Concept: http://data.europa.eu/ux2/nace2/1729
in scheme: Statistical Classification of Economic Activities in the European Community, Rev. 2.1 (NACE Rev. 2.1)
scope note: the content of the NACE Rev 2.1 class is fully covered in the corresponding NACE Rev 2 class
top concept of: Statistical Classification of Economic Activities in the European Community, Rev. 2.1 (NACE Rev. 2.1)
Mapping Cardinality: 1 1

ConceptNoneRandom0.15614338647442372
type: ConceptAssociation
description: NACE Rev. 2.1 division 77 is mapped to NACE Rev. 2 divisions 77, 79, 82
Type: 48:49
Source Concept: Rental and leasing activities
Target Concept: http://data.europa.eu/ux2/nace2/82
Target Concept: http://data.europa.eu/ux2/nace2/77
Target Concept: http://data.europa.eu/ux2/nace2/79
in scheme: Statistical Classification of Economic Activities in the European Community, Rev. 2.1 (NACE Rev. 2.1)
top concept of: Statistical Classification of Economic Activities in the European Community, Rev. 2.1 (NACE Rev. 2.1)
Mapping Cardinality: n m

Manufacture of paper and paper products
type: Concept
CoreContentNote: This division includes the manufacture of pulp, paper, converted paper and the manufacture of products of recycled goods from wood, paper, cardboard and paperboard. The manufacture of these products is grouped together because they constitute a series of vertically connected processes. More than one activity is often carried out in a single unit. The manufacture of pulp involves separating the cellulose fibres from other matter in wood, or dissolving and de-inking of used paper, and mixing in small amounts of reagents to reinforce the binding of the fibres. Converted paper products are made from paper and other materials by various techniques. The paper articles may be printed (for example, wallpaper, gift wrap), as long as the printing of information is not the main purpose. The production of pulp, paper and paperboard in bulk is included in group 17.1, while the remaining classes include the production of further-processed paper and paper products.
broader: MANUFACTURING
in scheme: Statistical Classification of Economic Activities in the European Community, Rev. 2.1 (NACE Rev. 2.1)
Notation: 17
top concept of: Statistical Classification of Economic Activities in the European Community, Rev. 2.1 (NACE Rev. 2.1)

Manufacture of batteries and accumulators
type: Concept
CoreContentNote: This class includes the manufacture of non-rechargeable and rechargeable batteries. This class includes: - manufacture of primary cells and primary batteries • cells containing manganese dioxide, mercuric dioxide, silver oxide, etc. - manufacture of electric accumulators, including parts thereof: • separators, containers, covers - manufacture of lead acid batteries - manufacture of nickel–cadmium (NiCad) batteries - manufacture of nickel–metal hydride (NiMH) batteries - manufacture of lithium batteries - manufacture of dry cell batteries - manufacture of wet cell batteries - manufacture of batteries for vehicles, bicycles and other cycles - manufacture of battery energy storage systems
Exclusion Note: This class excludes: - manufacture of charging facilities for cars, see 27.90 - installation of electric storage systems for buildings, see 43.21
broader: Manufacture of batteries and accumulators
in scheme: Statistical Classification of Economic Activities in the European Community, Rev. 2.1 (NACE Rev. 2.1)
Notation: 27.20
top concept of: Statistical Classification of Economic Activities in the European Community, Rev. 2.1 (NACE Rev. 2.1)

Extraction of peat
type: Concept
CoreContentNote: This class includes: - peat digging - preparation of peat to improve quality or facilitate transport/storage
Exclusion Note: This class excludes: - service activities incidental to peat mining, see 09.90 - manufacture of peat briquettes, see 19.20 - manufacture of potting soil mixtures (e.g. of peat, natural soil, sands, clays, fertiliser minerals), see 20.15 - manufacture of articles of peat, see 23.99
broader: Mining and quarrying n.e.c.
in scheme: Statistical Classification of Economic Activities in the European Community, Rev. 2.1 (NACE Rev. 2.1)
Notation: 08.92
top concept of: Statistical Classification of Economic Activities in the European Community, Rev. 2.1 (NACE Rev. 2.1)

NACE - Level 2 - Divisions
type: Collection
type: ClassificationLevel
comment: Level 2: 87 divisions identified by two-digit numerical codes (01 to 99)
Depth: 2
Notation Pattern: [01-99]{2}
Organized By: generic division
in scheme: Statistical Classification of Economic Activities in the European Community, Rev. 2.1 (NACE Rev. 2.1)
Member: Manufacture of coke and refined petroleum products
Member: Manufacture of electrical equipment
Member: Manufacture of leather and related products of other materials
Member: Motion picture, video and television programme production, sound recording and music publishing activities
Member: Mining of metal ores
Member: Remediation activities and other waste management service activities
Member: Employment activities
Member: Activities auxiliary to financial services and insurance activities
Member: Manufacture of rubber and plastic products
Member: Manufacture of wearing apparel
Member: Publishing activities
Member: Forestry and logging
Member: Wholesale trade
Member: Other professional, scientific and technical activities
Member: Manufacture of other transport equipment
Member: Computer programming, consultancy and related activities
Member: Undifferentiated goods- and service-producing activities of private households for own use
Member: Manufacture of food products
Member: Human health activities
Member: Civil engineering
Member: Activities of head offices and management consultancy
Member: Activities of membership organisations
Member: Water transport
Member: Office administrative, office support and other business support activities
Member: Arts creation and performing arts activities
Member: Other mining and quarrying
Member: Manufacture of wood and of products of wood and cork, except furniture; manufacture of articles of straw and plaiting materials
Member: Manufacture of machinery and equipment n.e.c.
Member: Manufacture of other non-metallic mineral products
Member: Activities of extraterritorial organisations and bodies
Member: Accommodation
Member: Manufacture of beverages
Member: Retail trade
Member: Fishing and aquaculture
Member: Travel agency, tour operator and other reservation service and related activities
Member: Electricity, gas, steam and air conditioning supply
Member: Computing infrastructure, data processing, hosting and other information service activities
Member: Air transport
Member: Repair and maintenance of computers, personal and household goods, and motor vehicles and motorcycles
Member: Residential care activities
Member: Specialised construction activities
Member: Veterinary activities
Member: Manufacture of furniture
Member: Libraries, archives, museums and other cultural activities
Member: Architectural and engineering activities; technical testing and analysis
Member: Mining support service activities
Member: Land transport and transport via pipelines
Member: Mining of coal and lignite
Member: Sewerage
Member: Manufacture of motor vehicles, trailers and semi-trailers
Member: Manufacture of paper and paper products
Member: Food and beverage service activities
Member: Manufacture of tobacco products
Member: Social work activities without accommodation
Member: Water collection, treatment and supply
Member: Manufacture of basic metals
Member: Real estate activities
Member: Personal service activities
Member: Warehousing, storage and support activities for transportation
Member: Public administration and defence; compulsory social security
Member: Other manufacturing
Member: Financial service activities, except insurance and pension funding
Member: Manufacture of chemicals and chemical products
Member: Gambling and betting activities
Member: Investigation and security activities
Member: Scientific research and development
Member: Programming, broadcasting, news agency and other content distribution activities
Member: Waste collection, recovery and disposal activities
Member: Manufacture of computer, electronic and optical products
Member: Printing and reproduction of recorded media
Member: Extraction of crude petroleum and natural gas
Member: Crop and animal production, hunting and related service activities

ConceptNoneRandom0.39111930582089094
type: ConceptAssociation
description: NACE Rev. 2.1 class 85.33 is mapped to NACE Rev. 2 class 85.41
Type: 1:1
Source Concept: Post-secondary non-tertiary education
Target Concept: http://data.europa.eu/ux2/nace2/8541
in scheme: Statistical Classification of Economic Activities in the European Community, Rev. 2.1 (NACE Rev. 2.1)
scope note: the content of the NACE Rev 2.1 class is fully covered in the corresponding NACE Rev 2 class
top concept of: Statistical Classification of Economic Activities in the European Community, Rev. 2.1 (NACE Rev. 2.1)
Mapping Cardinality: 1 1

ConceptNoneRandom0.3612831993808536
type: ConceptAssociation
description: NACE Rev. 2.1 class 87.99 is mapped to NACE Rev. 2 class 87.90
Type: 1:1
Source Concept: Other residential care activities n.e.c.
Target Concept: http://data.europa.eu/ux2/nace2/8790
in scheme: Statistical Classification of Economic Activities in the European Community, Rev. 2.1 (NACE Rev. 2.1)
scope note: the content of the NACE Rev 2.1 class is fully covered in the corresponding NACE Rev 2 class
top concept of: Statistical Classification of Economic Activities in the European Community, Rev. 2.1 (NACE Rev. 2.1)
Mapping Cardinality: 1 1

Retail sale of tobacco products
type: Concept
Additional Content Note: This class also includes: - retail sale of electronic cigarettes (vapes) and e-liquids used in vaping devices
CoreContentNote: This class includes: - retail sale of tobacco in any form (e.g. cigarettes, cigars, pipe tobacco, chewing tobacco) - retail sale of tobacco and smoking products and accessories, including lighters, pipes, cigarette rolling equipment, etc.
broader: Retail sale of food, beverages and tobacco
in scheme: Statistical Classification of Economic Activities in the European Community, Rev. 2.1 (NACE Rev. 2.1)
Notation: 47.26
top concept of: Statistical Classification of Economic Activities in the European Community, Rev. 2.1 (NACE Rev. 2.1)

ConceptNoneRandom0.6557854101363384
type: ConceptAssociation
description: NACE Rev. 2.1 class 20.41 is mapped to NACE Rev. 2 class 20.41
Type: 1:1
Source Concept: Manufacture of soap and detergents, cleaning and polishing preparations
Target Concept: http://data.europa.eu/ux2/nace2/2041
in scheme: Statistical Classification of Economic Activities in the European Community, Rev. 2.1 (NACE Rev. 2.1)
scope note: the content of the NACE Rev 2.1 class is fully covered in the corresponding NACE Rev 2 class
top concept of: Statistical Classification of Economic Activities in the European Community, Rev. 2.1 (NACE Rev. 2.1)
Mapping Cardinality: 1 1

Operation of sports facilities
type: Concept
Additional Content Note: This class also includes: - managing and providing the staff to operate these facilities - provision of equipment to operate these facilities - operation of sports areas, which may include the operation of cableways, ski lifts and chairlifts - management of outdoor sport-equipped areas - operation of grass-roots sporting facilities
CoreContentNote: This class includes: - operation of facilities for outdoor or indoor sporting events (open, closed or covered, with or without spectator seating) - organisation and operation of outdoor or indoor sporting events for professionals or amateurs by organisations in their own facilities (not by sports clubs)
Exclusion Note: This class excludes: - transport by cableways, ski lifts and chairlifts, which may include the preparation of ski slopes, see 49.34 - rental of recreation and sports equipment, see 77.21 - organisation and operation of outdoor or indoor sporting events for professionals or amateurs by sports clubs, see 93.12 - activities of fitness facilities, see 93.13 - organisation and operation of outdoor or indoor sporting events for professionals or amateurs by organisations (not by sports clubs) without own facilities, see 93.19 - park and beach activities, see 93.29
broader: Sports activities
in scheme: Statistical Classification of Economic Activities in the European Community, Rev. 2.1 (NACE Rev. 2.1)
Notation: 93.11
top concept of: Statistical Classification of Economic Activities in the European Community, Rev. 2.1 (NACE Rev. 2.1)

ConceptNoneRandom0.9905880884706573
type: ConceptAssociation
description: NACE Rev. 2.1 class 10.61 is mapped to NACE Rev. 2 classes 10.61, 10.86
Type: 6:6
Source Concept: Manufacture of grain mill products
Target Concept: http://data.europa.eu/ux2/nace2/1086
Target Concept: http://data.europa.eu/ux2/nace2/1061
in scheme: Statistical Classification of Economic Activities in the European Community, Rev. 2.1 (NACE Rev. 2.1)
scope note: 10.61: - grain milling: production of flour, semolina, groats, meal or pellets of wheat, rye, oats, maize (corn) or other cereal grains - rice milling: production of husked, milled, polished, glazed, parboiled or converted rice; production of rice flour - vegetable milling: production of flour or meal of dried leguminous vegetables, of roots or tubers, or of edible nuts - manufacture of cereal breakfast foods - manufacture of flour mixes and prepared blended flour and dough for bread, cakes, biscuits, pancakes, etc. 10.86: - manufacture of gluten-free products
top concept of: Statistical Classification of Economic Activities in the European Community, Rev. 2.1 (NACE Rev. 2.1)
Mapping Cardinality: n m

ACTIVITIES OF EXTRATERRITORIAL ORGANISATIONS AND BODIES
type: Concept
in scheme: Statistical Classification of Economic Activities in the European Community, Rev. 2.1 (NACE Rev. 2.1)
Notation: V
top concept of: Statistical Classification of Economic Activities in the European Community, Rev. 2.1 (NACE Rev. 2.1)

ConceptNoneRandom0.1580536443751427
type: ConceptAssociation
description: NACE Rev. 2.1 class 29.20 is mapped to NACE Rev. 2 class 29.20
Type: 1:1
Source Concept: Manufacture of bodies and coachwork for motor vehicles; manufacture of trailers and semi-trailers
Target Concept: http://data.europa.eu/ux2/nace2/2920
in scheme: Statistical Classification of Economic Activities in the European Community, Rev. 2.1 (NACE Rev. 2.1)
scope note: the content of the NACE Rev 2.1 class is fully covered in the corresponding NACE Rev 2 class
top concept of: Statistical Classification of Economic Activities in the European Community, Rev. 2.1 (NACE Rev. 2.1)
Mapping Cardinality: 1 1

ConceptNoneRandom0.2630974855271916
type: ConceptAssociation
description: NACE Rev. 2.1 class 63.10 is mapped to NACE Rev. 2 classes 52.10, 63.11
Type: 78:65
Source Concept: Computing infrastructure, data processing, hosting and related activities
Target Concept: http://data.europa.eu/ux2/nace2/6311
Target Concept: http://data.europa.eu/ux2/nace2/5210
in scheme: Statistical Classification of Economic Activities in the European Community, Rev. 2.1 (NACE Rev. 2.1)
scope note: 52.10: - digitalisation of files (for further processing of data) 63.11: - provision of computing infrastructure, including cloud infrastructure and platform provision (IaaS, PaaS) - cloud computing (except software publishing and computer systems design), whether or not in combination with infrastructure provision - provision of technical infrastructure related to streaming services, data processing services and related activities: • complete processing of data supplied by clients • generation of specialised reports from data supplied by clients • blockchain/distributed ledger technology (DLT) data processing activities - specialised hosting activities, e.g.: • web hosting • application hosting - general time-share provision of mainframe facilities to clients - provision of data entry services - data centre colocation activities (i.e., rental of server and networking space in data centres, including routine monitoring of servers) - digital data storage - issuing of crypto assets without a corresponding liability (not by a monetary authority)
top concept of: Statistical Classification of Economic Activities in the European Community, Rev. 2.1 (NACE Rev. 2.1)
Mapping Cardinality: n m

ConceptNoneRandom0.35941259236564016
type: ConceptAssociation
description: NACE Rev. 2.1 class 79.90 is mapped to NACE Rev. 2 class 79.90
Type: 78:65
Source Concept: Other reservation service and related activities
Target Concept: http://data.europa.eu/ux2/nace2/7990
in scheme: Statistical Classification of Economic Activities in the European Community, Rev. 2.1 (NACE Rev. 2.1)
scope note: the content of the NACE Rev 2.1 class is fully covered in the corresponding NACE Rev 2 class
top concept of: Statistical Classification of Economic Activities in the European Community, Rev. 2.1 (NACE Rev. 2.1)
Mapping Cardinality: n m

ConceptNoneRandom0.22045335739830196
type: ConceptAssociation
description: NACE Rev. 2.1 group 43.1 is mapped to NACE Rev. 2 group 43.1
Type: 1:1
Source Concept: Demolition and site preparation
Target Concept: http://data.europa.eu/ux2/nace2/431
in scheme: Statistical Classification of Economic Activities in the European Community, Rev. 2.1 (NACE Rev. 2.1)
top concept of: Statistical Classification of Economic Activities in the European Community, Rev. 2.1 (NACE Rev. 2.1)
Mapping Cardinality: 1 1

Sewerage
type: Concept
Additional Content Note: This class also includes: - freeze-drying of sewage sludge by wastewater treatment plants - emptying and cleaning of cesspools and septic tanks, sinks and pits from sewage - servicing of chemical toilets
CoreContentNote: This class includes: - operation of wastewater treatment facilities for reuse (e.g. of agricultural, industrial and road cleaning wastewater or collected rainwater), or for artificial recharge or augmentation of groundwater bodies - collection and transport of wastewater from users (e.g. households or industrial units) - collection and transport of rainwater by means of sewerage networks, collectors, tanks and other means of transport (e.g. sewage vehicles, etc.) - maintenance and cleaning of sewers and drains, including sewer rodding
Exclusion Note: This class excludes: - further treatment of sludge extracted from wastewater, see division 38 • anaerobic digestion, see 38.2 • aerobic treatment, such as composting, see 38.21 • incineration with energy recovery, see 38.22 • incineration without energy recovery, see 38.31 - decontamination of surface water and groundwater at the place of pollution, see 39.00 - construction or repair of sewerage systems, see 42.21 - cleaning and unblocking of drainpipes in buildings, see 43.22 - rental of portable toilets, see 77.39
broader: Sewerage
in scheme: Statistical Classification of Economic Activities in the European Community, Rev. 2.1 (NACE Rev. 2.1)
Notation: 37.00
top concept of: Statistical Classification of Economic Activities in the European Community, Rev. 2.1 (NACE Rev. 2.1)

Activities of head offices
type: Concept
broader: Activities of head offices and management consultancy
in scheme: Statistical Classification of Economic Activities in the European Community, Rev. 2.1 (NACE Rev. 2.1)
Notation: 70.1
top concept of: Statistical Classification of Economic Activities in the European Community, Rev. 2.1 (NACE Rev. 2.1)

ConceptNoneRandom0.21297991985217568
type: ConceptAssociation
description: NACE Rev. 2.1 group 78.2 is mapped to NACE Rev. 2 groups 78.2, 78.3
Type: 1:2
Source Concept: Temporary employment agency activities and other human resource provisions
Target Concept: http://data.europa.eu/ux2/nace2/783
Target Concept: http://data.europa.eu/ux2/nace2/782
in scheme: Statistical Classification of Economic Activities in the European Community, Rev. 2.1 (NACE Rev. 2.1)
top concept of: Statistical Classification of Economic Activities in the European Community, Rev. 2.1 (NACE Rev. 2.1)
Mapping Cardinality: 1 m

Other waste disposal
type: Concept
CoreContentNote: This class includes: - release of liquid waste to seas/oceans or other water bodies, including seabed insertion - injection of pumpable discards into wells, salt domes or naturally occurring repositories
Exclusion Note: This class excludes: - operation of facilities where recoverable materials are sorted, see 38.21 - energy recovery by thermal treatment of waste, see 38.22 - decontamination, cleaning up land, water and toxic material abatement, see 39.00
broader: Waste disposal without recovery
in scheme: Statistical Classification of Economic Activities in the European Community, Rev. 2.1 (NACE Rev. 2.1)
Notation: 38.33
top concept of: Statistical Classification of Economic Activities in the European Community, Rev. 2.1 (NACE Rev. 2.1)

ConceptNoneRandom0.8894198570588248
type: ConceptAssociation
description: NACE Rev. 2.1 group 47.9 is mapped to NACE Rev. 2 groups 45.1, 45.3, 45.4, 47.1, 47.2, 47.3, 47.4, 47.5, 47.6, 47.7, 47.9, 82.9
Type: 42:34
Source Concept: Intermediation service activities for retail sale
Target Concept: http://data.europa.eu/ux2/nace2/479
Target Concept: http://data.europa.eu/ux2/nace2/477
Target Concept: http://data.europa.eu/ux2/nace2/454
Target Concept: http://data.europa.eu/ux2/nace2/476
Target Concept: http://data.europa.eu/ux2/nace2/453
Target Concept: http://data.europa.eu/ux2/nace2/475
Target Concept: http://data.europa.eu/ux2/nace2/474
Target Concept: http://data.europa.eu/ux2/nace2/451
Target Concept: http://data.europa.eu/ux2/nace2/473
Target Concept: http://data.europa.eu/ux2/nace2/472
Target Concept: http://data.europa.eu/ux2/nace2/471
Target Concept: http://data.europa.eu/ux2/nace2/829
in scheme: Statistical Classification of Economic Activities in the European Community, Rev. 2.1 (NACE Rev. 2.1)
top concept of: Statistical Classification of Economic Activities in the European Community, Rev. 2.1 (NACE Rev. 2.1)
Mapping Cardinality: n m

ConceptNoneRandom0.8049697227056186
type: ConceptAssociation
description: NACE Rev. 2.1 group 56.4 is mapped to NACE Rev. 2 group 79.9
Type: 42:34
Source Concept: Intermediation service activities for food and beverage services activities
Target Concept: http://data.europa.eu/ux2/nace2/799
in scheme: Statistical Classification of Economic Activities in the European Community, Rev. 2.1 (NACE Rev. 2.1)
top concept of: Statistical Classification of Economic Activities in the European Community, Rev. 2.1 (NACE Rev. 2.1)
Mapping Cardinality: n m

Other professional, scientific and technical activities n.e.c.
type: Concept
broader: Other professional, scientific and technical activities
in scheme: Statistical Classification of Economic Activities in the European Community, Rev. 2.1 (NACE Rev. 2.1)
Notation: 74.9
top concept of: Statistical Classification of Economic Activities in the European Community, Rev. 2.1 (NACE Rev. 2.1)

NACE - Level 1 - Sections
type: Collection
type: ClassificationLevel
comment: Level 1: 22 sections identified by alphabetical letters A to U
Depth: 1
Notation Pattern: [A-U]{1}
Organized By: generic section
in scheme: Statistical Classification of Economic Activities in the European Community, Rev. 2.1 (NACE Rev. 2.1)
Member: ELECTRICITY, GAS, STEAM AND AIR CONDITIONING SUPPLY
Member: WATER SUPPLY; SEWERAGE, WASTE MANAGEMENT AND REMEDIATION ACTIVITIES
Member: MINING AND QUARRYING
Member: MANUFACTURING
Member: AGRICULTURE, FORESTRY AND FISHING
Member: FINANCIAL AND INSURANCE ACTIVITIES
Member: REAL ESTATE ACTIVITIES
Member: PUBLISHING, BROADCASTING, AND CONTENT PRODUCTION AND DISTRIBUTION ACTIVITIES
Member: TELECOMMUNICATION, COMPUTER PROGRAMMING, CONSULTING, COMPUTING INFRASTRUCTURE AND OTHER INFORMATION SERVICE ACTIVITIES
Member: TRANSPORTATION AND STORAGE
Member: ACCOMMODATION AND FOOD SERVICE ACTIVITIES
Member: CONSTRUCTION
Member: WHOLESALE AND RETAIL TRADE
Member: OTHER SERVICE ACTIVITIES
Member: ACTIVITIES OF HOUSEHOLDS AS EMPLOYERS AND UNDIFFERENTIATED GOODS - AND SERVICE-PRODUCING ACTIVITIES OF HOUSEHOLDS FOR OWN USE
Member: HUMAN HEALTH AND SOCIAL WORK ACTIVITIES
Member: ARTS, SPORTS AND RECREATION
Member: PUBLIC ADMINISTRATION AND DEFENCE; COMPULSORY SOCIAL SECURITY
Member: EDUCATION
Member: PROFESSIONAL, SCIENTIFIC AND TECHNICAL ACTIVITIES
Member: ADMINISTRATIVE AND SUPPORT SERVICE ACTIVITIES
Member: ACTIVITIES OF EXTRATERRITORIAL ORGANISATIONS AND BODIES
top concept of: Statistical Classification of Economic Activities in the European Community, Rev. 2.1 (NACE Rev. 2.1)

Printing and reproduction of recorded media
type: Concept
Additional Content Note: This division also includes: - the reproduction of recorded media (e.g. compact discs, video recordings, software on discs or tapes, records)
CoreContentNote: This division includes printing of products (for example, newspapers, books, periodicals, business forms and greeting cards), printing on T-shirts and other types of material, and associated support activities (for example, bookbinding, plate-making services, data imaging). The support activities included here are an integral part of the printing industry, and a product (a printing plate, a bound book, or a computer disk or file) that is an integral part of the printing industry is almost always provided by these operations. The ownership of the input material is irrelevant to the classification of printing and reproduction of recorded media activities. Division 18 covers explicitly the processing activities. Processes used in printing include a variety of methods for transferring an image from a plate, screen or computer file to a medium (for example, paper, plastics, metal, textile articles, wood). The most prominent of these methods entails the transfer of the image from a plate or screen to the medium through lithographic, gravure, screen or flexographic printing. Often a computer file is used to directly drive the printing mechanism to create the image or electrostatic and other types of equipment (digital or non-impact printing). Though printing and publishing can be carried out by the same unit (for example, a newspaper), it is less and less the case that these distinct activities are carried out in the same physical location.
Exclusion Note: This division excludes: - publishing activities, see section J - manufacture of products with a 3D printer, which are classified according to the product and material used
broader: MANUFACTURING
in scheme: Statistical Classification of Economic Activities in the European Community, Rev. 2.1 (NACE Rev. 2.1)
Notation: 18
top concept of: Statistical Classification of Economic Activities in the European Community, Rev. 2.1 (NACE Rev. 2.1)

ConceptNoneRandom0.6310299959254552
type: ConceptAssociation
description: NACE Rev. 2.1 class 17.24 is mapped to NACE Rev. 2 class 17.24
Type: 1:1
Source Concept: Manufacture of wallpaper
Target Concept: http://data.europa.eu/ux2/nace2/1724
in scheme: Statistical Classification of Economic Activities in the European Community, Rev. 2.1 (NACE Rev. 2.1)
scope note: the content of the NACE Rev 2.1 class is fully covered in the corresponding NACE Rev 2 class
top concept of: Statistical Classification of Economic Activities in the European Community, Rev. 2.1 (NACE Rev. 2.1)
Mapping Cardinality: 1 1

Retail sale of other food
type: Concept
Additional Content Note: This class also includes: - retail sale of ready-made meals, except for immediate consumption on the spot - retail sale of food supplements for human consumption (e.g. dietary supplements, diet products)
CoreContentNote: This class includes the retail sale of food products not elsewhere classified. The retail sale of organically labelled foods, regional foods, and so on, is included in classes 47.21 to 47.27, depending on the product sold. This class includes: - retail sale of dairy products, including milk and cheese preparations, and eggs - retail sale of coffee, tea, oils, flour, sugar, pasta, etc. - retail sale of other food products n.e.c.
Exclusion Note: This class excludes: - retail sale of ready-made meals for immediate consumption on the spot, see 56.1
broader: Retail sale of food, beverages and tobacco
in scheme: Statistical Classification of Economic Activities in the European Community, Rev. 2.1 (NACE Rev. 2.1)
Notation: 47.27
top concept of: Statistical Classification of Economic Activities in the European Community, Rev. 2.1 (NACE Rev. 2.1)

Extraction of salt
type: Concept
CoreContentNote: This class includes: - extraction of salt from underground, including by dissolving and pumping - salt production by evaporation of sea water or other saline waters - crushing, purification and refining of salt by the producer
Exclusion Note: This class excludes: - processing of salt into food-grade salt (e.g. iodised salt), see 10.84 - potable water production by evaporation of saline water, see 36.00
broader: Mining and quarrying n.e.c.
in scheme: Statistical Classification of Economic Activities in the European Community, Rev. 2.1 (NACE Rev. 2.1)
Notation: 08.93
top concept of: Statistical Classification of Economic Activities in the European Community, Rev. 2.1 (NACE Rev. 2.1)

ConceptNoneRandom0.061535607549862203
type: ConceptAssociation
description: NACE Rev. 2.1 class 43.50 is mapped to NACE Rev. 2 classes 42.11, 43.99
Type: 23:16
Source Concept: Specialised construction activities in civil engineering
Target Concept: http://data.europa.eu/ux2/nace2/4211
Target Concept: http://data.europa.eu/ux2/nace2/4399
in scheme: Statistical Classification of Economic Activities in the European Community, Rev. 2.1 (NACE Rev. 2.1)
scope note: 42.11: - construction activities specialising in one aspect common in civil engineering, requiring specialised skill or equipment: • installation of crash barriers, traffic signs etc. - road painting and other marking 43.99: - construction activities specialising in one aspect common in civil engineering, requiring specialised skill or equipment: • construction of foundations for civil engineering, including pile driving • shaft sinking • erection of steel elements for civil engineering projects - erection of noise protection walls, e.g. along roads - installation of street furniture - installation of prefabricated swimming pools - erection of protective rock walls and installation of rock fall protection
top concept of: Statistical Classification of Economic Activities in the European Community, Rev. 2.1 (NACE Rev. 2.1)
Mapping Cardinality: n m

Manufacture of pulp, paper and paperboard
type: Concept
broader: Manufacture of paper and paper products
in scheme: Statistical Classification of Economic Activities in the European Community, Rev. 2.1 (NACE Rev. 2.1)
Notation: 17.1
top concept of: Statistical Classification of Economic Activities in the European Community, Rev. 2.1 (NACE Rev. 2.1)

Activities of sports clubs
type: Concept
Additional Content Note: This class also includes: - organisation and operation of outdoor or indoor sporting events for professionals or amateurs by sports clubs - provision of clubhouse services by sports clubs - sports training within sports clubs
CoreContentNote: This class includes the activities of sports clubs, which, whether professional, semi-professional or amateur clubs, give their members the opportunity to engage in sporting activities. Sports clubs are typically non-profit entities, but inclusion in the sports sector is legitimised by the prevailing purpose of the activity carried out (in other words, the promotion of practicing sports). The activities of education, training, the sale of advertising space and the provision of clubhouse services are, in this context, ancillary activities, which may have a prevailing weight at an economic level, but which are instrumental with respect to the prevailing purpose of the activity carried out and for its perpetuation. This class includes: - operation of sports clubs, e.g.: • football clubs • bowling clubs • swimming clubs • golf clubs • boxing clubs • winter sports clubs • chess clubs • track and field clubs • shooting clubs • e-sports clubs • card game clubs (e.g. bridge clubs)
Exclusion Note: This class excludes: - sports instruction by individual teachers/trainers, see 85.51 - operation of sports facilities, see 93.11 - activities of individual own account sportspersons and athletes, referees, judges, timekeepers, etc., see 93.19 - activities of individual own account participants of e-sports, see 93.19 - activities of sports federations, see 93.19
broader: Sports activities
in scheme: Statistical Classification of Economic Activities in the European Community, Rev. 2.1 (NACE Rev. 2.1)
Notation: 93.12
top concept of: Statistical Classification of Economic Activities in the European Community, Rev. 2.1 (NACE Rev. 2.1)

Research and experimental development on social sciences and humanities
type: Concept
Additional Content Note: This class also includes: - research and development on socio-economic relations
CoreContentNote: This class includes: - research and development on social sciences (e.g. economics and business administration; psychology and cognitive sciences; education; sociology; law; political science; media and communication) - research and development on humanities and arts (e.g. history and archaeology; literature and languages; philosophy) - interdisciplinary research and development, predominantly on social sciences and humanities
Exclusion Note: This class excludes: - market research and public opinion polling, see 73.20
broader: Research and experimental development on social sciences and humanities
in scheme: Statistical Classification of Economic Activities in the European Community, Rev. 2.1 (NACE Rev. 2.1)
Notation: 72.20
top concept of: Statistical Classification of Economic Activities in the European Community, Rev. 2.1 (NACE Rev. 2.1)

Quarrying of ornamental stone, limestone, gypsum, slate and other stone
type: Concept
CoreContentNote: This class includes: - quarrying, rough trimming and sawing of monumental and building stone (for example, marble, granite, sandstone) - breaking and crushing of ornamental and building stone - quarrying, crushing and breaking of limestone - mining of gypsum and anhydrite - mining of chalk and uncalcined dolomite - production of granules, chippings and powder of extracted stones, whether heat-treated or not
Exclusion Note: This class excludes: - mining of chemical and fertiliser minerals, see 08.91 - production of calcined dolomite, see 23.52 - cutting, shaping and finishing of stone outside quarries, see 23.70
broader: Quarrying of stone, sand and clay
in scheme: Statistical Classification of Economic Activities in the European Community, Rev. 2.1 (NACE Rev. 2.1)
Notation: 08.11
top concept of: Statistical Classification of Economic Activities in the European Community, Rev. 2.1 (NACE Rev. 2.1)

Wholesale of other intermediate products
type: Concept
CoreContentNote: This class includes: - wholesale of plastic materials in primary forms - wholesale of rubber - wholesale of textile fibres - wholesale of packaging articles - wholesale of raw precious stones - wholesale of unworked synthetic or reconstructed precious or semi-precious stones - wholesale of non-metallic ores - wholesale of paper in bulk and of paper pulp
Exclusion Note: This class excludes: - wholesale of agricultural raw products, see 46.21 - wholesale of processed precious stones, see 46.48 - wholesale of stationery, see 46.49
broader: Other specialised wholesale
in scheme: Statistical Classification of Economic Activities in the European Community, Rev. 2.1 (NACE Rev. 2.1)
Notation: 46.86
top concept of: Statistical Classification of Economic Activities in the European Community, Rev. 2.1 (NACE Rev. 2.1)

Organized By

Manufacture of light metal packaging
type: Concept
CoreContentNote: This class includes: - manufacture of iron or steel cans which are to be closed by soldering or crimping, of a capacity of less than 50 litres - manufacture of aluminium casks, drums, cans, boxes and similar containers, of a capacity not exceeding 300 litres - manufacture of tins and cans for food products, collapsible tubes and boxes - manufacture of metallic closures
Exclusion Note: This class excludes: - manufacture of containers of metal, for compressed or liquefied gas, of a capacity exceeding 300 litres, see 25.22
broader: Manufacture of other fabricated metal products
in scheme: Statistical Classification of Economic Activities in the European Community, Rev. 2.1 (NACE Rev. 2.1)
Notation: 25.92
top concept of: Statistical Classification of Economic Activities in the European Community, Rev. 2.1 (NACE Rev. 2.1)

ConceptNoneRandom0.37661423024838314
type: ConceptAssociation
description: NACE Rev. 2.1 class 77.33 is mapped to NACE Rev. 2 class 77.33
Type: 1:1
Source Concept: Rental and leasing of office machinery, equipment and computers
Target Concept: http://data.europa.eu/ux2/nace2/7733
in scheme: Statistical Classification of Economic Activities in the European Community, Rev. 2.1 (NACE Rev. 2.1)
scope note: the content of the NACE Rev 2.1 class is fully covered in the corresponding NACE Rev 2 class
top concept of: Statistical Classification of Economic Activities in the European Community, Rev. 2.1 (NACE Rev. 2.1)
Mapping Cardinality: 1 1

Other residential care activities
type: Concept
broader: Residential care activities
in scheme: Statistical Classification of Economic Activities in the European Community, Rev. 2.1 (NACE Rev. 2.1)
Notation: 87.9
top concept of: Statistical Classification of Economic Activities in the European Community, Rev. 2.1 (NACE Rev. 2.1)

Other building completion and finishing
type: Concept
CoreContentNote: This class includes the finishing work which concludes the construction of a building. This class includes: - installation of prefabricated metal sheets, steel parts, profiles, etc. - ornamentation fitting works on buildings - cladding for exterior walls - erection of curtain walls - other building completion and finishing work n.e.c.
Exclusion Note: This class excludes: - installation of large-scale shelving (e.g. in shops or warehouses (not an integral part of the building)), see 33.20 - installation of acoustic panels, tiles and similar materials, see 43.23 - interior design activities, see 74.13 - general interior cleaning of buildings and other structures, see 81.21 - specialised interior and exterior cleaning of buildings, see 81.22 - steam cleaning, sandblasting and similar activities for building exteriors, see 81.22
broader: Building completion and finishing
in scheme: Statistical Classification of Economic Activities in the European Community, Rev. 2.1 (NACE Rev. 2.1)
Notation: 43.35
top concept of: Statistical Classification of Economic Activities in the European Community, Rev. 2.1 (NACE Rev. 2.1)

ConceptNoneRandom0.46493168695723663
type: ConceptAssociation
description: NACE Rev. 2.1 class 90.31 is mapped to NACE Rev. 2 class 90.04
Type: 1:1
Source Concept: Operation of arts facilities and sites
Target Concept: http://data.europa.eu/ux2/nace2/9004
in scheme: Statistical Classification of Economic Activities in the European Community, Rev. 2.1 (NACE Rev. 2.1)
scope note: the content of the NACE Rev 2.1 class is fully covered in the corresponding NACE Rev 2 class
top concept of: Statistical Classification of Economic Activities in the European Community, Rev. 2.1 (NACE Rev. 2.1)
Mapping Cardinality: 1 1

Retail sale of clothing
type: Concept
Additional Content Note: This class also includes: - retail sale of work clothes, uniforms, disguises, carnival costumes, etc.
CoreContentNote: This class includes: - retail sale of articles of clothing, including underwear - retail sale of fur articles - retail sale of clothing accessories, (e.g. gloves, ties, braces)
Exclusion Note: This class excludes: - retail sale of textiles, see 47.51 - retail sale of special sports equipment clothes for skiing, martial arts, ballet, etc., see 47.63 - retail sale of protective gear for cyclists, see 47.63 - retail sale of second-hand clothing, see 47.79 - retail sale of protective gear for motorcyclists, see 47.83
broader: Retail sale of other goods, except motor vehicles and motorcycles
in scheme: Statistical Classification of Economic Activities in the European Community, Rev. 2.1 (NACE Rev. 2.1)
Notation: 47.71
top concept of: Statistical Classification of Economic Activities in the European Community, Rev. 2.1 (NACE Rev. 2.1)

Intermediation service activities for personal services
type: Concept
broader: Personal service activities
in scheme: Statistical Classification of Economic Activities in the European Community, Rev. 2.1 (NACE Rev. 2.1)
Notation: 96.4
top concept of: Statistical Classification of Economic Activities in the European Community, Rev. 2.1 (NACE Rev. 2.1)

ConceptNoneRandom0.3878592590545701
type: ConceptAssociation
description: NACE Rev. 2.1 class 18.12 is mapped to NACE Rev. 2 classes 18.12, 74.20, 82.19
Type: 4:5
Source Concept: Other printing
Target Concept: http://data.europa.eu/ux2/nace2/8219
Target Concept: http://data.europa.eu/ux2/nace2/7420
Target Concept: http://data.europa.eu/ux2/nace2/1812
in scheme: Statistical Classification of Economic Activities in the European Community, Rev. 2.1 (NACE Rev. 2.1)
scope note: 18.12: - printing of magazines and other periodicals, appearing less than four times a week - printing of books and brochures, music and music manuscripts, maps, atlases, posters, advertising catalogues, prospectuses and other printed advertising, postage stamps, taxation stamps, documents of title, cheques and other security papers, smart cards, albums, diaries, calendars and other commercial printed matter, beer mats, personalised stationery and other printed matter by letterpress, offset, photogravure, flexographic, screen printing, and other printing presses, duplication machines, computer printers, embossers etc., including quick printing directly onto textiles, plastic, glass, metal, wood and ceramics - digital printing - decorative printing, e.g. printing of gift wraps, wallpapers, materials for transfer - large format printing, e.g. printing of flags, banners, roll-ups, posters - printing on labels or tags, e.g. lithographic, gravure printing, flexographic printing, printing signs - laser engraving on textiles 74.20: - activities of printing photographs (from mobile telephones, memory cards, USB and other electronic supports) 82.19: - photocopying of documents
top concept of: Statistical Classification of Economic Activities in the European Community, Rev. 2.1 (NACE Rev. 2.1)
Mapping Cardinality: n m

Rental and leasing of trucks
type: Concept
CoreContentNote: This class includes: - rental and operating leasing of the following types of vehicles: • trucks, motorhomes, utility trailers and heavy motor vehicles (with a maximum permissible weight of more than 3,5 tons) without a driver
Exclusion Note: This class excludes: - rental or leasing of heavy goods vehicles or trucks with a driver, see 49.41, 49.42 - rental or leasing of land transport equipment (other than motor vehicles) without a driver (e.g. caravans), see 77.39
broader: Rental and leasing of motor vehicles
in scheme: Statistical Classification of Economic Activities in the European Community, Rev. 2.1 (NACE Rev. 2.1)
Notation: 77.12
top concept of: Statistical Classification of Economic Activities in the European Community, Rev. 2.1 (NACE Rev. 2.1)

ConceptNoneRandom0.06113248039891772
type: ConceptAssociation
description: NACE Rev. 2.1 class 42.22 is mapped to NACE Rev. 2 class 42.22
Type: 1:1
Source Concept: Construction of utility projects for electricity and telecommunications
Target Concept: http://data.europa.eu/ux2/nace2/4222
in scheme: Statistical Classification of Economic Activities in the European Community, Rev. 2.1 (NACE Rev. 2.1)
scope note: the content of the NACE Rev 2.1 class is fully covered in the corresponding NACE Rev 2 class
top concept of: Statistical Classification of Economic Activities in the European Community, Rev. 2.1 (NACE Rev. 2.1)
Mapping Cardinality: 1 1

Manufacture of carpets and rugs
type: Concept
Additional Content Note: This class also includes: - manufacture of needle-loom felt floor coverings - manufacture of artificial grass (synthetic turf)
CoreContentNote: This class includes: - manufacture of textile floor coverings, e.g.: • carpets, rugs and mats, tiles
Exclusion Note: This class excludes: - manufacture of mats and matting of plaiting materials, see 16.28 - manufacture of floor coverings of cork, see 16.28 - manufacture of resilient floor coverings (e.g. vinyl, linoleum) see 22.24
broader: Manufacture of other textiles
in scheme: Statistical Classification of Economic Activities in the European Community, Rev. 2.1 (NACE Rev. 2.1)
Notation: 13.93
top concept of: Statistical Classification of Economic Activities in the European Community, Rev. 2.1 (NACE Rev. 2.1)

ConceptNoneRandom0.9272559175307689
type: ConceptAssociation
description: NACE Rev. 2.1 class 47.91 is mapped to NACE Rev. 2 classes 47.11, 47.19, 47.79, 47.91, 47.99, 82.99
Type: 78:65
Source Concept: Intermediation service activities for non-specialised retail sale
Target Concept: http://data.europa.eu/ux2/nace2/4791
Target Concept: http://data.europa.eu/ux2/nace2/4719
Target Concept: http://data.europa.eu/ux2/nace2/4799
Target Concept: http://data.europa.eu/ux2/nace2/4711
Target Concept: http://data.europa.eu/ux2/nace2/4779
Target Concept: http://data.europa.eu/ux2/nace2/8299
in scheme: Statistical Classification of Economic Activities in the European Community, Rev. 2.1 (NACE Rev. 2.1)
scope note: 47.79: - activities of retail auctioning houses 47.99: - intermediation service activities for non-specialised retail sale by commission agents 82.99: - activities of independent auctioneers
top concept of: Statistical Classification of Economic Activities in the European Community, Rev. 2.1 (NACE Rev. 2.1)
Mapping Cardinality: n m

Manufacture of margarine and similar edible fats
type: Concept
CoreContentNote: This class includes: - manufacture of margarine - manufacture of melanges and similar spreads - manufacture of compound cooking fats
broader: Manufacture of vegetable and animal oils and fats
in scheme: Statistical Classification of Economic Activities in the European Community, Rev. 2.1 (NACE Rev. 2.1)
Notation: 10.42
top concept of: Statistical Classification of Economic Activities in the European Community, Rev. 2.1 (NACE Rev. 2.1)

ConceptNoneRandom0.937862831586325
type: ConceptAssociation
description: NACE Rev. 2.1 group 26.2 is mapped to NACE Rev. 2 groups 26.2, 28.2
Type: 18:19
Source Concept: Manufacture of computers and peripheral equipment
Target Concept: http://data.europa.eu/ux2/nace2/282
Target Concept: http://data.europa.eu/ux2/nace2/262
in scheme: Statistical Classification of Economic Activities in the European Community, Rev. 2.1 (NACE Rev. 2.1)
top concept of: Statistical Classification of Economic Activities in the European Community, Rev. 2.1 (NACE Rev. 2.1)
Mapping Cardinality: n m

Arts creation and performing arts activities
type: Concept
CoreContentNote: This division includes arts creation and performing arts activities and the operation of facilities and provision of services to meet cultural and entertainment interests. This includes the production and promotion of, and participation in, live performances, events or exhibits intended for public viewing; the provision of artistic, creative or technical skills for the production of artistic products, live performances and events.
Exclusion Note: This division excludes: - motion picture and video production/distribution, see 59.11, 59.12, 59.13 - motion picture projection, see 59.14 - radio and television broadcasting, see 60.10, 60.20 - photographic activities, see 74.20 - cultural education (non-academic teaching of instrument playing, painting, acting, dancing, etc.), see 85.52 - the operation of museums of all kinds, archaeological and historical sites and monuments, libraries, archives, botanical and zoological gardens; the preservation of historical sites; activities of nature reserves; see division 91 - conservation and restoration of cultural heritage, see 91.30 - gambling and betting activities, see 92.00 - sports, amusement and recreation activities, see division 93
broader: ARTS, SPORTS AND RECREATION
in scheme: Statistical Classification of Economic Activities in the European Community, Rev. 2.1 (NACE Rev. 2.1)
Notation: 90
top concept of: Statistical Classification of Economic Activities in the European Community, Rev. 2.1 (NACE Rev. 2.1)

Literary creation and musical composition activities
type: Concept
Additional Content Note: This class also includes: - technical writing
CoreContentNote: This class includes: - activities of individual writers, for all subjects, including fictional writing, etc. - musical composition - texts and compositions writing on behalf of someone else - activities of scriptwriting - activities of journalists whose content is published by a third party - activities of bloggers whose content is published by a third party
Exclusion Note: This class excludes: - (re)production, distribution of books and music, see section J - translators working on book editing, see 74.30 - activities of independent musicians and actors participating in video and audiovisual content of all kinds, see 90.20
broader: Arts creation activities
in scheme: Statistical Classification of Economic Activities in the European Community, Rev. 2.1 (NACE Rev. 2.1)
Notation: 90.11
top concept of: Statistical Classification of Economic Activities in the European Community, Rev. 2.1 (NACE Rev. 2.1)

ConceptNoneRandom0.09959018921736207
type: ConceptAssociation
description: NACE Rev. 2.1 group 26.3 is mapped to NACE Rev. 2 group 26.3
Type: 2:2
Source Concept: Manufacture of communication equipment
Target Concept: http://data.europa.eu/ux2/nace2/263
in scheme: Statistical Classification of Economic Activities in the European Community, Rev. 2.1 (NACE Rev. 2.1)
top concept of: Statistical Classification of Economic Activities in the European Community, Rev. 2.1 (NACE Rev. 2.1)
Mapping Cardinality: n m

Manufacture of steel drums and similar containers
type: Concept
CoreContentNote: This class includes: - manufacture of iron or steel tanks, cans, drums, buckets, boxes and similar containers, of a capacity not exceeding 300 litres
Exclusion Note: This class excludes: - manufacture of containers of metal, for compressed or liquefied gas, of a capacity exceeding 300 litres, see 25.22
broader: Manufacture of other fabricated metal products
in scheme: Statistical Classification of Economic Activities in the European Community, Rev. 2.1 (NACE Rev. 2.1)
Notation: 25.91
top concept of: Statistical Classification of Economic Activities in the European Community, Rev. 2.1 (NACE Rev. 2.1)

ConceptNoneRandom0.7592057035782216
type: ConceptAssociation
description: NACE Rev. 2.1 class 77.34 is mapped to NACE Rev. 2 class 77.34
Type: 1:1
Source Concept: Rental and leasing of water transport equipment
Target Concept: http://data.europa.eu/ux2/nace2/7734
in scheme: Statistical Classification of Economic Activities in the European Community, Rev. 2.1 (NACE Rev. 2.1)
scope note: the content of the NACE Rev 2.1 class is fully covered in the corresponding NACE Rev 2 class
top concept of: Statistical Classification of Economic Activities in the European Community, Rev. 2.1 (NACE Rev. 2.1)
Mapping Cardinality: 1 1

Operation of gravel and sand pits and mining of clay and kaolin
type: Concept
CoreContentNote: This class includes: - extraction and dredging of industrial sand, sand for construction and gravel - breaking and crushing of gravel - quarrying of sand - mining of clays, refractory clays and kaolin
Exclusion Note: This class excludes: - mining of bituminous sand, see 06.10
broader: Quarrying of stone, sand and clay
in scheme: Statistical Classification of Economic Activities in the European Community, Rev. 2.1 (NACE Rev. 2.1)
Notation: 08.12
top concept of: Statistical Classification of Economic Activities in the European Community, Rev. 2.1 (NACE Rev. 2.1)

Wholesale of waste and scrap
type: Concept
CoreContentNote: This class includes: - wholesale of metal and non-metal waste and scrap and materials for recycling, including collecting, sorting, separating, stripping of used goods (e.g. cars in order to obtain reusable parts), packing and repacking, storage and delivery, but without a transformation process. Additionally, the purchased and sold waste has a remaining value - wholesale of usable goods (metal, plastics), following the dismantling of cars, computers, televisions and other equipment on own account by the unit without further transformation of the goods - wholesale of car wrecks
Exclusion Note: This class excludes: - collection of household and industrial waste, see 38.1 - processing of waste and scrap and other articles into secondary raw materials when a transformation process is required (the resulting secondary raw material is fit for direct use in an industrial manufacturing process, but is not a final product), see 38.21 - dismantling of unusable automobiles, computers, televisions, and other equipment and parts for materials recovery, see 38.21 - ship-breaking, see 38.21 - shredding of cars by means of a mechanical process, see 38.21 - treatment of waste for disposal without recovery, see 38.3 - retail sale of second-hand goods, see 47.79
broader: Other specialised wholesale
in scheme: Statistical Classification of Economic Activities in the European Community, Rev. 2.1 (NACE Rev. 2.1)
Notation: 46.87
top concept of: Statistical Classification of Economic Activities in the European Community, Rev. 2.1 (NACE Rev. 2.1)

Retail sale of footwear and leather goods
type: Concept
CoreContentNote: This class includes: - retail sale of footwear - retail sale of leather goods - retail sale of travel accessories of leather and leather substitutes
Exclusion Note: This class excludes: - retail sale of special footwear for sports (e.g. football shoes, ice skates, ski boots), see 47.63 - retail sale of leather clothing, see 47.71 - retail sale of orthopaedic footwear, see 47.74
broader: Retail sale of other goods, except motor vehicles and motorcycles
in scheme: Statistical Classification of Economic Activities in the European Community, Rev. 2.1 (NACE Rev. 2.1)
Notation: 47.72
top concept of: Statistical Classification of Economic Activities in the European Community, Rev. 2.1 (NACE Rev. 2.1)

ConceptNoneRandom0.30751882460258295
type: ConceptAssociation
description: NACE Rev. 2.1 class 18.11 is mapped to NACE Rev. 2 class 18.11
Type: 1:1
Source Concept: Printing of newspapers
Target Concept: http://data.europa.eu/ux2/nace2/1811
in scheme: Statistical Classification of Economic Activities in the European Community, Rev. 2.1 (NACE Rev. 2.1)
scope note: the content of the NACE Rev 2.1 class is fully covered in the corresponding NACE Rev 2 class
top concept of: Statistical Classification of Economic Activities in the European Community, Rev. 2.1 (NACE Rev. 2.1)
Mapping Cardinality: 1 1

ConceptNoneRandom0.7895689010346226
type: ConceptAssociation
description: NACE Rev. 2.1 division 39 is mapped to NACE Rev. 2 division 39
Type: 1:1
Source Concept: Remediation activities and other waste management service activities
Target Concept: http://data.europa.eu/ux2/nace2/39
in scheme: Statistical Classification of Economic Activities in the European Community, Rev. 2.1 (NACE Rev. 2.1)
top concept of: Statistical Classification of Economic Activities in the European Community, Rev. 2.1 (NACE Rev. 2.1)
Mapping Cardinality: 1 1

Rental and leasing of cars and light motor vehicles
type: Concept
Additional Content Note: This class also includes: - rental and operating leasing of an individual’s own car without a driver - rental and leasing of motorcycles
CoreContentNote: This class includes: - rental and operating leasing of motor vehicles (with a maximum permissible weight not exceeding 3,5 tons) without a driver, regardless of the length of rental period or way of payment (e.g. subscription): • passenger cars, motorhomes, other light motor vehicles without a driver - rental of shared cars
Exclusion Note: This class excludes: - rental or leasing of passenger cars or light motor vehicles with a driver, see 49.33 - intermediation service activities for the rental and leasing of passenger cars and light motor vehicles, see 77.51
broader: Rental and leasing of motor vehicles
in scheme: Statistical Classification of Economic Activities in the European Community, Rev. 2.1 (NACE Rev. 2.1)
Notation: 77.11
top concept of: Statistical Classification of Economic Activities in the European Community, Rev. 2.1 (NACE Rev. 2.1)

ConceptNoneRandom0.6762327795585492
type: ConceptAssociation
description: NACE Rev. 2.1 class 10.62 is mapped to NACE Rev. 2 classes 10.62, 10.86
Type: 6:6
Source Concept: Manufacture of starches and starch products
Target Concept: http://data.europa.eu/ux2/nace2/1086
Target Concept: http://data.europa.eu/ux2/nace2/1062
in scheme: Statistical Classification of Economic Activities in the European Community, Rev. 2.1 (NACE Rev. 2.1)
scope note: 10.62: - manufacture of starches from rice, potatoes, maize etc. - wet corn milling - manufacture of glucose, glucose syrup, maltose, inulin etc. - manufacture of gluten - manufacture of tapioca and tapioca substitutes prepared from starch - manufacture of corn oil 10.86: - manufacture of gluten-free products
top concept of: Statistical Classification of Economic Activities in the European Community, Rev. 2.1 (NACE Rev. 2.1)
Mapping Cardinality: n m

ConceptNoneRandom0.47899343097343394
type: ConceptAssociation
description: NACE Rev. 2.1 class 47.92 is mapped to NACE Rev. 2 classes 45.11, 45.19, 45.32, 45.40, 47.21, 47.22, 47.23, 47.24, 47.25, 47.26, 47.29, 47.30, 47.41, 47.42, 47.43, 47.51, 47.52, 47.53, 47.54, 47.59, 47.61, 47.62, 47.63, 47.64, 47.65, 47.71, 47.72, 47.73, 47.74, 47.75, 47.76, 47.77, 47.78, 47.79, 47.91, 47.99, 82.99
Type: 78:65
Source Concept: Intermediation service activities for specialised retail sale
Target Concept: http://data.europa.eu/ux2/nace2/4729
Target Concept: http://data.europa.eu/ux2/nace2/4759
Target Concept: http://data.europa.eu/ux2/nace2/4519
Target Concept: http://data.europa.eu/ux2/nace2/4725
Target Concept: http://data.europa.eu/ux2/nace2/4777
Target Concept: http://data.europa.eu/ux2/nace2/4799
Target Concept: http://data.europa.eu/ux2/nace2/4743
Target Concept: http://data.europa.eu/ux2/nace2/4765
Target Concept: http://data.europa.eu/ux2/nace2/4721
Target Concept: http://data.europa.eu/ux2/nace2/4779
Target Concept: http://data.europa.eu/ux2/nace2/8299
Target Concept: http://data.europa.eu/ux2/nace2/4723
Target Concept: http://data.europa.eu/ux2/nace2/4773
Target Concept: http://data.europa.eu/ux2/nace2/4751
Target Concept: http://data.europa.eu/ux2/nace2/4761
Target Concept: http://data.europa.eu/ux2/nace2/4511
Target Concept: http://data.europa.eu/ux2/nace2/4753
Target Concept: http://data.europa.eu/ux2/nace2/4775
Target Concept: http://data.europa.eu/ux2/nace2/4741
Target Concept: http://data.europa.eu/ux2/nace2/4763
Target Concept: http://data.europa.eu/ux2/nace2/4791
Target Concept: http://data.europa.eu/ux2/nace2/4771
Target Concept: http://data.europa.eu/ux2/nace2/4726
Target Concept: http://data.europa.eu/ux2/nace2/4722
Target Concept: http://data.europa.eu/ux2/nace2/4754
Target Concept: http://data.europa.eu/ux2/nace2/4776
Target Concept: http://data.europa.eu/ux2/nace2/4724
Target Concept: http://data.europa.eu/ux2/nace2/4778
Target Concept: http://data.europa.eu/ux2/nace2/4532
Target Concept: http://data.europa.eu/ux2/nace2/4762
Target Concept: http://data.europa.eu/ux2/nace2/4772
Target Concept: http://data.europa.eu/ux2/nace2/4764
Target Concept: http://data.europa.eu/ux2/nace2/4742
Target Concept: http://data.europa.eu/ux2/nace2/4730
Target Concept: http://data.europa.eu/ux2/nace2/4774
Target Concept: http://data.europa.eu/ux2/nace2/4752
Target Concept: http://data.europa.eu/ux2/nace2/4540
in scheme: Statistical Classification of Economic Activities in the European Community, Rev. 2.1 (NACE Rev. 2.1)
scope note: 47.79: - activities of retail auctioning houses 82.99: - activities of independent auctioneers
top concept of: Statistical Classification of Economic Activities in the European Community, Rev. 2.1 (NACE Rev. 2.1)
Mapping Cardinality: n m

ConceptNoneRandom0.3704129209743473
type: ConceptAssociation
description: NACE Rev. 2.1 class 20.42 is mapped to NACE Rev. 2 class 20.42
Type: 1:1
Source Concept: Manufacture of perfumes and toilet preparations
Target Concept: http://data.europa.eu/ux2/nace2/2042
in scheme: Statistical Classification of Economic Activities in the European Community, Rev. 2.1 (NACE Rev. 2.1)
scope note: the content of the NACE Rev 2.1 class is fully covered in the corresponding NACE Rev 2 class
top concept of: Statistical Classification of Economic Activities in the European Community, Rev. 2.1 (NACE Rev. 2.1)
Mapping Cardinality: 1 1

Manufacture of cordage, rope, twine and netting
type: Concept
CoreContentNote: This class includes: - manufacture of twine, cordage, rope and cables of textile fibres or strip, etc., whether or not impregnated, coated, covered or sheathed with rubber or plastics - manufacture of knotted netting of twine, cordage or rope - manufacture of products of rope or netting (e.g. fishing nets, ships’ fenders, unloading cushions, loading slings, rope or cable fitted with metal rings, etc.)
Exclusion Note: This class excludes: - manufacture of hairnets, see 14.29 - manufacture of wire rope, see 25.93 - manufacture of landing-nets for sports fishing, see 32.30
broader: Manufacture of other textiles
in scheme: Statistical Classification of Economic Activities in the European Community, Rev. 2.1 (NACE Rev. 2.1)
Notation: 13.94
top concept of: Statistical Classification of Economic Activities in the European Community, Rev. 2.1 (NACE Rev. 2.1)

Libraries, archives, museums and other cultural activities
type: Concept
Additional Content Note: It also includes the preservation and exhibition of objects, sites and natural wonders of historical, cultural or educational interest (for example, World Heritage Sites).
CoreContentNote: This division includes the activities of libraries and archives; the operation of museums of all kinds, heritage collections of all types, including library and archival documents, botanical and zoological gardens; the operation of archaeological and historical sites or buildings and the activities of nature reserves. These activities include the identification, collection, inventory, conservation/restoration and mediation of cultural or natural, tangible and intangible heritage.
Exclusion Note: This division excludes: - manufacture of musical instruments, see 32.20 - renovation, renewal, reconstruction and retrofitting of historical and archaeological sites and buildings, see 43.99 - retail sale of paintings and sculptures (activities of commercial art galleries), see 47.69 - retail sale of second-hand goods, see 47.79 - transport and storage activities, see division 52 - insurance activities, see division 66 - architectural activities to support the conservation and restoration of cultural heritage properties, see 71.11 - research activities, conservation sciences devoted to cultural heritage, see division 72 - activities of tourist guides and lecturers, see 79.90 - sports, amusement and recreation activities (e.g. the operation of bathing beaches and recreation parks), see division 93 - repair of musical instruments not considered cultural heritage and non-historical, see 95.29
broader: ARTS, SPORTS AND RECREATION
in scheme: Statistical Classification of Economic Activities in the European Community, Rev. 2.1 (NACE Rev. 2.1)
Notation: 91
top concept of: Statistical Classification of Economic Activities in the European Community, Rev. 2.1 (NACE Rev. 2.1)

Manufacture of musical instruments
type: Concept
Additional Content Note: This class also includes: - manufacture of whistles, call horns and other mouth-blown sound-signalling instruments
CoreContentNote: This class includes: - manufacture of string instruments - manufacture of keyboard stringed instruments, including automatic pianos - manufacture of keyboard pipe organs, harmoniums and similar keyboard instruments with free metal reeds - manufacture of accordions and similar instruments, including mouth organs - manufacture of wind instruments - manufacture of percussion instruments (e.g. drums, xylophones, cymbals, castanets, maracas) - manufacture of musical instruments that generate sound electronically (e.g. digital pianos, synthesisers) - manufacture of musical boxes, fairground organs, calliopes, etc. - manufacture of instrument parts and accessories, e.g.: • metronomes, tuning forks, pitch pipes, cards, discs and rolls for automatic mechanical instruments
Exclusion Note: This class excludes: - reproduction of pre-recorded sound and videotapes and discs, see 18.20 - manufacture of microphones, amplifiers, loudspeakers, headphones and similar components, see 26.40 - manufacture of record players, tape recorders, etc., see 26.40 - manufacture of toy musical instruments, see 32.40 - publishing of pre-recorded sound and videotapes and discs, see 59.20 - repair of musical instruments not considered cultural heritage and non-historical, see 95.29 - piano tuning, see 95.29
broader: Manufacture of musical instruments
in scheme: Statistical Classification of Economic Activities in the European Community, Rev. 2.1 (NACE Rev. 2.1)
Notation: 32.20
top concept of: Statistical Classification of Economic Activities in the European Community, Rev. 2.1 (NACE Rev. 2.1)

Hairdressing, beauty treatment, day spa and similar activities
type: Concept
broader: Personal service activities
in scheme: Statistical Classification of Economic Activities in the European Community, Rev. 2.1 (NACE Rev. 2.1)
Notation: 96.2
top concept of: Statistical Classification of Economic Activities in the European Community, Rev. 2.1 (NACE Rev. 2.1)

Wired, wireless, and satellite telecommunication activities
type: Concept
broader: Telecommunication
in scheme: Statistical Classification of Economic Activities in the European Community, Rev. 2.1 (NACE Rev. 2.1)
Notation: 61.1
top concept of: Statistical Classification of Economic Activities in the European Community, Rev. 2.1 (NACE Rev. 2.1)

Botanical and zoological garden activities
type: Concept
CoreContentNote: This class includes: - operation of botanical and zoological gardens, including children’s zoos - operation of aquariums
Exclusion Note: This class excludes: - landscape and gardening activities, see 81.30 - operation of sport fishing and hunting preserves, see 93.19
broader: Botanical and zoological garden and nature reserve activities
in scheme: Statistical Classification of Economic Activities in the European Community, Rev. 2.1 (NACE Rev. 2.1)
Notation: 91.41
top concept of: Statistical Classification of Economic Activities in the European Community, Rev. 2.1 (NACE Rev. 2.1)

ConceptNoneRandom0.908185639637642
type: ConceptAssociation
description: NACE Rev. 2.1 class 77.35 is mapped to NACE Rev. 2 class 77.35
Type: 1:1
Source Concept: Rental and leasing of air transport equipment
Target Concept: http://data.europa.eu/ux2/nace2/7735
in scheme: Statistical Classification of Economic Activities in the European Community, Rev. 2.1 (NACE Rev. 2.1)
scope note: the content of the NACE Rev 2.1 class is fully covered in the corresponding NACE Rev 2 class
top concept of: Statistical Classification of Economic Activities in the European Community, Rev. 2.1 (NACE Rev. 2.1)
Mapping Cardinality: 1 1

ConceptNoneRandom0.40107927919805253
type: ConceptAssociation
description: NACE Rev. 2.1 class 32.40 is mapped to NACE Rev. 2 class 32.40
Type: 1:1
Source Concept: Manufacture of games and toys
Target Concept: http://data.europa.eu/ux2/nace2/3240
in scheme: Statistical Classification of Economic Activities in the European Community, Rev. 2.1 (NACE Rev. 2.1)
scope note: the content of the NACE Rev 2.1 class is fully covered in the corresponding NACE Rev 2 class
top concept of: Statistical Classification of Economic Activities in the European Community, Rev. 2.1 (NACE Rev. 2.1)
Mapping Cardinality: 1 1

ConceptNoneRandom0.2554571035732319
type: ConceptAssociation
description: NACE Rev. 2.1 class 78.20 is mapped to NACE Rev. 2 classes 78.20, 78.30
Type: 1:2
Source Concept: Temporary employment agency activities and other human resource provisions
Target Concept: http://data.europa.eu/ux2/nace2/7830
Target Concept: http://data.europa.eu/ux2/nace2/7820
in scheme: Statistical Classification of Economic Activities in the European Community, Rev. 2.1 (NACE Rev. 2.1)
scope note: 78.20: - activities of supplying workers to clients' businesses for limited periods of time to temporarily replace or supplement the working force of the client, where the individuals provided are employees of the temporary help service unit 78.30: - activities of providing human resources for client businesses
top concept of: Statistical Classification of Economic Activities in the European Community, Rev. 2.1 (NACE Rev. 2.1)
Mapping Cardinality: 1 m

ConceptNoneRandom0.20208542889213743
type: ConceptAssociation
description: NACE Rev. 2.1 class 01.70 is mapped to NACE Rev. 2 class 01.70
Type: 1:1
Source Concept: Hunting, trapping and related service activities
Target Concept: http://data.europa.eu/ux2/nace2/0170
in scheme: Statistical Classification of Economic Activities in the European Community, Rev. 2.1 (NACE Rev. 2.1)
scope note: the content of the NACE Rev 2.1 class is fully covered in the corresponding NACE Rev 2 class
top concept of: Statistical Classification of Economic Activities in the European Community, Rev. 2.1 (NACE Rev. 2.1)
Mapping Cardinality: 1 1

ConceptNoneRandom0.017280274890925762
type: ConceptAssociation
description: NACE Rev. 2.1 class 18.14 is mapped to NACE Rev. 2 class 18.14
Type: 1:1
Source Concept: Binding and related services
Target Concept: http://data.europa.eu/ux2/nace2/1814
in scheme: Statistical Classification of Economic Activities in the European Community, Rev. 2.1 (NACE Rev. 2.1)
scope note: the content of the NACE Rev 2.1 class is fully covered in the corresponding NACE Rev 2 class
top concept of: Statistical Classification of Economic Activities in the European Community, Rev. 2.1 (NACE Rev. 2.1)
Mapping Cardinality: 1 1

Retail sale of pharmaceutical products
type: Concept
Additional Content Note: This class also includes: - retail sale of homeopathic products and medicines without prescription - retail sale of herbal medicinal products and herbal remedies
CoreContentNote: This class includes: - retail sale of pharmaceuticals - retail sale of veterinary medicines
broader: Retail sale of other goods, except motor vehicles and motorcycles
in scheme: Statistical Classification of Economic Activities in the European Community, Rev. 2.1 (NACE Rev. 2.1)
Notation: 47.73
top concept of: Statistical Classification of Economic Activities in the European Community, Rev. 2.1 (NACE Rev. 2.1)

Quarrying of stone, sand and clay
type: Concept
broader: Other mining and quarrying
in scheme: Statistical Classification of Economic Activities in the European Community, Rev. 2.1 (NACE Rev. 2.1)
Notation: 08.1
top concept of: Statistical Classification of Economic Activities in the European Community, Rev. 2.1 (NACE Rev. 2.1)

Manufacture of knitted and crocheted fabrics
type: Concept
Additional Content Note: This class also includes: - manufacture of imitation fur by knitting
CoreContentNote: This class includes: - manufacture and processing of knitted or crocheted fabrics: • pile and terry fabrics • net and window furnishing type fabrics • other knitted or crocheted fabrics
Exclusion Note: This class excludes: - manufacture of net and window furnishing type fabrics of lace, see 13.99 - manufacture of knitted and crocheted apparel, see 14.10
broader: Manufacture of other textiles
in scheme: Statistical Classification of Economic Activities in the European Community, Rev. 2.1 (NACE Rev. 2.1)
Notation: 13.91
top concept of: Statistical Classification of Economic Activities in the European Community, Rev. 2.1 (NACE Rev. 2.1)

Exclusion Note

Gambling and betting activities
type: Concept
CoreContentNote: This division includes the operation of gambling facilities (for example, casinos, bingo halls, electronic gambling machines) and the provision of gambling services (for example, lotteries, off-track betting). These gambling and betting activities can be carried out in gambling facilities or online.
Exclusion Note: This division excludes: - operation of coin-operated games, see 93.29
broader: ARTS, SPORTS AND RECREATION
in scheme: Statistical Classification of Economic Activities in the European Community, Rev. 2.1 (NACE Rev. 2.1)
Notation: 92
top concept of: Statistical Classification of Economic Activities in the European Community, Rev. 2.1 (NACE Rev. 2.1)

Activities of political organisations
type: Concept
CoreContentNote: This class includes: - activities of political organisations and auxiliary organisations (e.g. young people’s auxiliaries associated with a political party). These organisations chiefly engage in influencing decision-taking in public governing bodies by placing members of the party or those sympathetic to the party in political office and involve the dissemination of information, public relations, fundraising, etc.
broader: Activities of other membership organisations
in scheme: Statistical Classification of Economic Activities in the European Community, Rev. 2.1 (NACE Rev. 2.1)
Notation: 94.92
top concept of: Statistical Classification of Economic Activities in the European Community, Rev. 2.1 (NACE Rev. 2.1)

Telecommunication reselling activities and intermediation service activities for telecommunication
type: Concept
broader: Telecommunication
in scheme: Statistical Classification of Economic Activities in the European Community, Rev. 2.1 (NACE Rev. 2.1)
Notation: 61.2
top concept of: Statistical Classification of Economic Activities in the European Community, Rev. 2.1 (NACE Rev. 2.1)

Nature reserve activities
type: Concept
CoreContentNote: This class includes: - operation of nature reserves, including wildlife preservation, etc. - conservation and maintenance services of national parks, nature parks and reserves
Exclusion Note: This class excludes: - protection or restoring activities of agricultural land, see division 01 - protection or restoring activities of forestry land, see division 02 - protection or restoring activities of landscape (e.g. for parks, gardens), see 81.30 - operation of sport fishing and hunting preserves, see 93.19
broader: Botanical and zoological garden and nature reserve activities
in scheme: Statistical Classification of Economic Activities in the European Community, Rev. 2.1 (NACE Rev. 2.1)
Notation: 91.42
top concept of: Statistical Classification of Economic Activities in the European Community, Rev. 2.1 (NACE Rev. 2.1)

Manufacture of transport equipment n.e.c.
type: Concept
CoreContentNote: This group includes the manufacture of transport equipment other than motor vehicles and rail, water, air or space transport equipment and military vehicles.
broader: Manufacture of other transport equipment
in scheme: Statistical Classification of Economic Activities in the European Community, Rev. 2.1 (NACE Rev. 2.1)
Notation: 30.9
top concept of: Statistical Classification of Economic Activities in the European Community, Rev. 2.1 (NACE Rev. 2.1)

Retail sale of medical and orthopaedic goods
type: Concept
Additional Content Note: This class also includes: - retail sale of non-corrective sunglasses
CoreContentNote: This class includes: - retail sale of corrective glasses, lenses and sunglasses - retail sale of hearing aids - retail sale of orthopaedic footwear - retail sale of crutches and wheelchairs - retail sale of orthopaedic prostheses - retail sale of cervical collars and corsets - retail sale of elastocompressive products (e.g. elastic stockings, sleeves)
broader: Retail sale of other goods, except motor vehicles and motorcycles
in scheme: Statistical Classification of Economic Activities in the European Community, Rev. 2.1 (NACE Rev. 2.1)
Notation: 47.74
top concept of: Statistical Classification of Economic Activities in the European Community, Rev. 2.1 (NACE Rev. 2.1)

Other specialised wholesale n.e.c.
type: Concept
CoreContentNote: This class includes other specialised wholesale activities not classified in other classes of this division.
broader: Other specialised wholesale
in scheme: Statistical Classification of Economic Activities in the European Community, Rev. 2.1 (NACE Rev. 2.1)
Notation: 46.89
top concept of: Statistical Classification of Economic Activities in the European Community, Rev. 2.1 (NACE Rev. 2.1)

Manufacture of pesticides, disinfectants and other agrochemical products
type: Concept
CoreContentNote: This class includes: - manufacture of insecticides, rodenticides, fungicides, herbicides, acaricides, molluscicides, biocides - manufacture of anti-sprouting products, plant growth regulators - manufacture of disinfectants (for agricultural and other use) - manufacture of other agrochemical products n.e.c.
Exclusion Note: This class excludes: - manufacture of fertilisers and nitrogen compounds, see 20.15
broader: Manufacture of pesticides, disinfectants and other agrochemical products
in scheme: Statistical Classification of Economic Activities in the European Community, Rev. 2.1 (NACE Rev. 2.1)
Notation: 20.20
top concept of: Statistical Classification of Economic Activities in the European Community, Rev. 2.1 (NACE Rev. 2.1)

ConceptNoneRandom0.23823058773693906
type: ConceptAssociation
description: NACE Rev. 2.1 class 18.13 is mapped to NACE Rev. 2 class 18.13
Type: 1:1
Source Concept: Pre-press and pre-media services
Target Concept: http://data.europa.eu/ux2/nace2/1813
in scheme: Statistical Classification of Economic Activities in the European Community, Rev. 2.1 (NACE Rev. 2.1)
scope note: the content of the NACE Rev 2.1 class is fully covered in the corresponding NACE Rev 2 class
top concept of: Statistical Classification of Economic Activities in the European Community, Rev. 2.1 (NACE Rev. 2.1)
Mapping Cardinality: 1 1

Wholesale of textiles
type: Concept
CoreContentNote: This class includes: - wholesale of yarn - wholesale of fabrics - wholesale of household linen, etc. - wholesale of haberdashery: needles, sewing thread, etc. - wholesale of parasols, tarpaulins, sails, parachutes, etc.
Exclusion Note: This class excludes: - wholesale of clothing, see 46.42 - wholesale of tents and sleeping bags, see 46.49 - wholesale of textile fibres, see 46.86
broader: Wholesale of household goods
in scheme: Statistical Classification of Economic Activities in the European Community, Rev. 2.1 (NACE Rev. 2.1)
Notation: 46.41
top concept of: Statistical Classification of Economic Activities in the European Community, Rev. 2.1 (NACE Rev. 2.1)

Funeral and related activities
type: Concept
broader: Personal service activities
in scheme: Statistical Classification of Economic Activities in the European Community, Rev. 2.1 (NACE Rev. 2.1)
Notation: 96.3
top concept of: Statistical Classification of Economic Activities in the European Community, Rev. 2.1 (NACE Rev. 2.1)

Manufacture of household textiles and made-up furnishing articles
type: Concept
Additional Content Note: This class also includes: - manufacture of the textile part of electric blankets - manufacture of hand-woven tapestries
CoreContentNote: This class includes: - manufacture of made-up household textiles articles of any material, including of knitted or crocheted fabrics, e.g.: • blankets, including travelling rugs • bed, table, toilet or kitchen linen • quilts, eiderdowns, cushions, pouffes, pillows, sleeping bags - manufacture of made-up furnishing articles: • curtains, valances, bedspreads • flags, banners, pennants • dust-cloths, dishcloths and similar articles
Exclusion Note: This class excludes: - manufacture of textile articles for technical use, see 13.96 - manufacture of blinds and sunblinds, see 13.96 - manufacture of napkins and napkin liners for babies, period panties and similar articles of textile materials, see 17.22
broader: Manufacture of other textiles
in scheme: Statistical Classification of Economic Activities in the European Community, Rev. 2.1 (NACE Rev. 2.1)
Notation: 13.92
top concept of: Statistical Classification of Economic Activities in the European Community, Rev. 2.1 (NACE Rev. 2.1)

ConceptNoneRandom0.4158176893046681
type: ConceptAssociation
description: NACE Rev. 2.1 class 42.21 is mapped to NACE Rev. 2 class 42.21
Type: 1:1
Source Concept: Construction of utility projects for fluids
Target Concept: http://data.europa.eu/ux2/nace2/4221
in scheme: Statistical Classification of Economic Activities in the European Community, Rev. 2.1 (NACE Rev. 2.1)
scope note: the content of the NACE Rev 2.1 class is fully covered in the corresponding NACE Rev 2 class
top concept of: Statistical Classification of Economic Activities in the European Community, Rev. 2.1 (NACE Rev. 2.1)
Mapping Cardinality: 1 1

Manufacture of oils and fats
type: Concept
Additional Content Note: This class also includes: - manufacture of non-edible animal oils and fats - extraction of fish and marine mammal oils - production of cotton linters, oilcakes and other residual products of oil production
CoreContentNote: This class includes: - manufacture of crude and refined vegetable oils (e.g. olive oil, soya-bean oil, hemp oil, sunflower seed oil, rape oil) - manufacture of non-defatted flour or meal of oilseeds, oil nuts or oil kernels - processing of vegetable oils (e.g. blowing, boiling, dehydration, hydrogenation)
Exclusion Note: This class excludes: - rendering and refining of lard and other edible fats of bovine animals, sheep, goats or pigs, see 10.11 - rendering of edible poultry fats, see 10.12 - manufacture of margarine, see 10.42 - wet corn milling, see 10.62 - manufacture of corn oil, see 10.62 - manufacture of essential oils, see 20.59 - treatment of oil and fats by chemical processes, see 20.59
broader: Manufacture of vegetable and animal oils and fats
in scheme: Statistical Classification of Economic Activities in the European Community, Rev. 2.1 (NACE Rev. 2.1)
Notation: 10.41
top concept of: Statistical Classification of Economic Activities in the European Community, Rev. 2.1 (NACE Rev. 2.1)

Event catering activities
type: Concept
CoreContentNote: This class includes the provision of food and supply, based on contractual agreements, at the location specified by the customer, for a specific event.
Exclusion Note: This class excludes: - manufacture of perishable food items, see 10.89 - retail sale of perishable food items, see 47.2
broader: Event catering, contract catering service activities and other food service activities
in scheme: Statistical Classification of Economic Activities in the European Community, Rev. 2.1 (NACE Rev. 2.1)
Notation: 56.21
top concept of: Statistical Classification of Economic Activities in the European Community, Rev. 2.1 (NACE Rev. 2.1)

Sports activities and amusement and recreation activities
type: Concept
Additional Content Note: This division also includes: - organisation of sporting events
CoreContentNote: This division includes sports activities in any form of physical activity undertaken, either occasionally or in an organised participatory manner, with the aim of expressing and improving physical fitness and mental well-being, and of establishing social links or achieving results in competitions at all levels. This division includes the provision of amusement and recreation activities.
Exclusion Note: This division excludes: - dramatic arts, music, other arts and entertainment (e.g. the production of live theatrical presentations, concerts, opera or dance productions, other stage productions), see division 90 - the operation of museums of all kinds, archaeological and historical sites and monuments, libraries, archives, botanical and zoological gardens; the preservation of historical sites; activities of nature reserves; see division 91
broader: ARTS, SPORTS AND RECREATION
in scheme: Statistical Classification of Economic Activities in the European Community, Rev. 2.1 (NACE Rev. 2.1)
Notation: 93
top concept of: Statistical Classification of Economic Activities in the European Community, Rev. 2.1 (NACE Rev. 2.1)

ConceptNoneRandom0.136580921929091
type: ConceptAssociation
description: NACE Rev. 2.1 group 26.1 is mapped to NACE Rev. 2 group 26.1
Type: 1:1
Source Concept: Manufacture of electronic components and boards
Target Concept: http://data.europa.eu/ux2/nace2/261
in scheme: Statistical Classification of Economic Activities in the European Community, Rev. 2.1 (NACE Rev. 2.1)
top concept of: Statistical Classification of Economic Activities in the European Community, Rev. 2.1 (NACE Rev. 2.1)
Mapping Cardinality: 1 1

Manufacture of other food products n.e.c.
type: Concept
Additional Content Note: This class also includes: - manufacture of yeast - manufacture of extracts and juices of meat, fish, crustaceans or molluscs - manufacture of meat and cheese substitutes - manufacture of egg products (e.g. egg albumin) - manufacture of artificial concentrates - processing of purchased natural honey - production of semi-finished products for ice cream and pastries - manufacture of pre-cooked instant soups and instant noodles - manufacture of artificial honey and caramel - manufacture of malt extracts and syrups - manufacture of insect meal and other insect-based preparations
CoreContentNote: This class includes the manufacture of food products edible within a maximum of three days after production: - manufacture of soups and broths - manufacture of perishable prepared foods, e.g.: • sandwiches • fresh (uncooked) pizza - manufacture of quiche and croque-monsieur
Exclusion Note: This class excludes: - manufacture of perishable prepared foods of fruits and vegetables, see 10.39 - manufacture of tofu (bean curd), see 10.39 - manufacture of frozen pizza, see 10.85 - manufacture of spirits, beer, wine and soft drinks, see division 11 - production of plant-based milk substitutes (e.g. coconut, rice, almond, soya-based beverages), see 11.07 - manufacture of vitamins, see 21.10
broader: Manufacture of other food products
in scheme: Statistical Classification of Economic Activities in the European Community, Rev. 2.1 (NACE Rev. 2.1)
Notation: 10.89
top concept of: Statistical Classification of Economic Activities in the European Community, Rev. 2.1 (NACE Rev. 2.1)

ConceptNoneRandom0.12749962210688004
type: ConceptAssociation
description: NACE Rev. 2.1 group 26.6 is mapped to NACE Rev. 2 groups 26.6, 32.5
Type: 18:19
Source Concept: Manufacture of irradiation, electromedical and electrotherapeutic equipment
Target Concept: http://data.europa.eu/ux2/nace2/266
Target Concept: http://data.europa.eu/ux2/nace2/325
in scheme: Statistical Classification of Economic Activities in the European Community, Rev. 2.1 (NACE Rev. 2.1)
top concept of: Statistical Classification of Economic Activities in the European Community, Rev. 2.1 (NACE Rev. 2.1)
Mapping Cardinality: n m

ConceptNoneRandom0.89394933252964
type: ConceptAssociation
description: NACE Rev. 2.1 class 23.99 is mapped to NACE Rev. 2 classes 13.20, 23.99
Type: 4:4
Source Concept: Manufacture of other non-metallic mineral products n.e.c.
Target Concept: http://data.europa.eu/ux2/nace2/2399
Target Concept: http://data.europa.eu/ux2/nace2/1320
in scheme: Statistical Classification of Economic Activities in the European Community, Rev. 2.1 (NACE Rev. 2.1)
scope note: 13.20: - manufacture of woven carbon threads 23.99: - manufacture of friction material and unmounted articles thereof with a base of mineral substances or of cellulose - manufacture of mineral insulating materials, e.g.: • slag wool, rock wool and similar mineral wools; exfoliated vermiculite, expanded clays and similar heat-insulating, sound-insulating or sound-absorbing materials - manufacture of articles of diverse mineral substances, e.g.: • worked mica and articles of mica, of peat, of graphite (other than electrical articles) - manufacture of articles of asphalt or similar material, e.g. petroleum bitumen or coal tar pitch - manufacture of carbon and graphite fibres and products (except electrodes and electrical applications) - manufacture of artificial corundum - calcination of kaolin
top concept of: Statistical Classification of Economic Activities in the European Community, Rev. 2.1 (NACE Rev. 2.1)
Mapping Cardinality: n m

Compares

ConceptNoneRandom0.713832183406568
type: ConceptAssociation
description: NACE Rev. 2.1 group 35.1 is mapped to NACE Rev. 2 group 35.1
Type: 42:34
Source Concept: Electric power generation, transmission and distribution
Target Concept: http://data.europa.eu/ux2/nace2/351
in scheme: Statistical Classification of Economic Activities in the European Community, Rev. 2.1 (NACE Rev. 2.1)
top concept of: Statistical Classification of Economic Activities in the European Community, Rev. 2.1 (NACE Rev. 2.1)
Mapping Cardinality: n m

Cutting, shaping and finishing of stone
type: Concept
CoreContentNote: This class includes: - cutting, shaping and finishing of stone (e.g. for use in construction, in cemeteries, on roads, as roofing) - manufacture of stone furniture
Exclusion Note: This class excludes: - activities carried out by operators of quarries (e.g. production of rough-cut stone), see 08.11 - production of millstones, abrasive stones and similar products, see 23.9
broader: Cutting, shaping and finishing of stone
in scheme: Statistical Classification of Economic Activities in the European Community, Rev. 2.1 (NACE Rev. 2.1)
Notation: 23.70
top concept of: Statistical Classification of Economic Activities in the European Community, Rev. 2.1 (NACE Rev. 2.1)

Other specialised construction activities
type: Concept
broader: Specialised construction activities
in scheme: Statistical Classification of Economic Activities in the European Community, Rev. 2.1 (NACE Rev. 2.1)
Notation: 43.9
top concept of: Statistical Classification of Economic Activities in the European Community, Rev. 2.1 (NACE Rev. 2.1)

ConceptNoneRandom0.23662701267150466
type: ConceptAssociation
description: NACE Rev. 2.1 class 23.51 is mapped to NACE Rev. 2 class 23.51
Type: 1:1
Source Concept: Manufacture of cement
Target Concept: http://data.europa.eu/ux2/nace2/2351
in scheme: Statistical Classification of Economic Activities in the European Community, Rev. 2.1 (NACE Rev. 2.1)
scope note: the content of the NACE Rev 2.1 class is fully covered in the corresponding NACE Rev 2 class
top concept of: Statistical Classification of Economic Activities in the European Community, Rev. 2.1 (NACE Rev. 2.1)
Mapping Cardinality: 1 1

ConceptNoneRandom0.9025449767392298
type: ConceptAssociation
description: NACE Rev. 2.1 group 13.3 is mapped to NACE Rev. 2 groups 13.3, 18.1
Type: 4:4
Source Concept: Finishing of textiles
Target Concept: http://data.europa.eu/ux2/nace2/133
Target Concept: http://data.europa.eu/ux2/nace2/181
in scheme: Statistical Classification of Economic Activities in the European Community, Rev. 2.1 (NACE Rev. 2.1)
top concept of: Statistical Classification of Economic Activities in the European Community, Rev. 2.1 (NACE Rev. 2.1)
Mapping Cardinality: n m

ConceptNoneRandom0.8169657917130045
type: ConceptAssociation
description: NACE Rev. 2.1 class 55.10 is mapped to NACE Rev. 2 class 55.10
Type: 1:1
Source Concept: Hotels and similar accommodation
Target Concept: http://data.europa.eu/ux2/nace2/5510
in scheme: Statistical Classification of Economic Activities in the European Community, Rev. 2.1 (NACE Rev. 2.1)
scope note: the content of the NACE Rev 2.1 class is fully covered in the corresponding NACE Rev 2 class
top concept of: Statistical Classification of Economic Activities in the European Community, Rev. 2.1 (NACE Rev. 2.1)
Mapping Cardinality: 1 1

Retail sale of cosmetic and toilet articles
type: Concept
CoreContentNote: This class includes: - retail sale of perfumes, cosmetics, toiletries, personal care products, etc.
Exclusion Note: This class excludes: - retail sale of toiletries, hygiene products, etc. for pets, see 47.76
broader: Retail sale of other goods, except motor vehicles and motorcycles
in scheme: Statistical Classification of Economic Activities in the European Community, Rev. 2.1 (NACE Rev. 2.1)
Notation: 47.75
top concept of: Statistical Classification of Economic Activities in the European Community, Rev. 2.1 (NACE Rev. 2.1)

Wholesale of clothing and footwear
type: Concept
Additional Content Note: This class also includes: - wholesale of work clothes, uniforms, costumes
CoreContentNote: This class includes: - wholesale of clothing, including sports clothes - wholesale of clothing accessories (e.g. gloves, ties and braces) - wholesale of footwear, including non-specialised sports footwear - wholesale of fur articles - wholesale of umbrellas
Exclusion Note: This class excludes: - wholesale of jewellery, see 46.48 - wholesale of leather goods, excluding clothing and footwear, see 46.49 - wholesale of specialised sports footwear only used in the practice of a sport (e.g. ski boots, football shoes, skates, ballet shoes), see 46.49 - wholesale of protective gear for motorcyclists, see 46.73
broader: Wholesale of household goods
in scheme: Statistical Classification of Economic Activities in the European Community, Rev. 2.1 (NACE Rev. 2.1)
Notation: 46.42
top concept of: Statistical Classification of Economic Activities in the European Community, Rev. 2.1 (NACE Rev. 2.1)

Photographic activities
type: Concept
broader: Other professional, scientific and technical activities
in scheme: Statistical Classification of Economic Activities in the European Community, Rev. 2.1 (NACE Rev. 2.1)
Notation: 74.2
top concept of: Statistical Classification of Economic Activities in the European Community, Rev. 2.1 (NACE Rev. 2.1)

ConceptNoneRandom0.8177915546034785
type: ConceptAssociation
description: NACE Rev. 2.1 division 35 is mapped to NACE Rev. 2 divisions 35, 52
Type: 48:49
Source Concept: Electricity, gas, steam and air conditioning supply
Target Concept: http://data.europa.eu/ux2/nace2/52
Target Concept: http://data.europa.eu/ux2/nace2/35
in scheme: Statistical Classification of Economic Activities in the European Community, Rev. 2.1 (NACE Rev. 2.1)
top concept of: Statistical Classification of Economic Activities in the European Community, Rev. 2.1 (NACE Rev. 2.1)
Mapping Cardinality: n m

ConceptNoneRandom0.7246106500964706
type: ConceptAssociation
description: NACE Rev. 2.1 division 36 is mapped to NACE Rev. 2 division 36
Type: 1:1
Source Concept: Water collection, treatment and supply
Target Concept: http://data.europa.eu/ux2/nace2/36
in scheme: Statistical Classification of Economic Activities in the European Community, Rev. 2.1 (NACE Rev. 2.1)
top concept of: Statistical Classification of Economic Activities in the European Community, Rev. 2.1 (NACE Rev. 2.1)
Mapping Cardinality: 1 1

Manufacture of homogenised food preparations and dietetic food
type: Concept
CoreContentNote: This class includes: - manufacture of foods for particular nutritional uses: • infant formulae • follow-up formulae milk and other follow-up foods • baby foods • low-energy and energy-reduced foods intended for weight control • foods for medical purposes
Exclusion Note: This class excludes: - manufacture of lactose-free dairy products, see 10.51 - manufacture of gluten-free products, see 10.6, 10.7 - manufacture of sugar-free confectionery, see 10.82
broader: Manufacture of other food products
in scheme: Statistical Classification of Economic Activities in the European Community, Rev. 2.1 (NACE Rev. 2.1)
Notation: 10.86
top concept of: Statistical Classification of Economic Activities in the European Community, Rev. 2.1 (NACE Rev. 2.1)

ConceptNoneRandom0.7275422371417789
type: ConceptAssociation
description: NACE Rev. 2.1 class 46.62 is mapped to NACE Rev. 2 class 46.62
Type: 1:1
Source Concept: Wholesale of machine tools
Target Concept: http://data.europa.eu/ux2/nace2/4662
in scheme: Statistical Classification of Economic Activities in the European Community, Rev. 2.1 (NACE Rev. 2.1)
scope note: the content of the NACE Rev 2.1 class is fully covered in the corresponding NACE Rev 2 class
top concept of: Statistical Classification of Economic Activities in the European Community, Rev. 2.1 (NACE Rev. 2.1)
Mapping Cardinality: 1 1

Contract catering service activities and other food service activities
type: Concept
CoreContentNote: This class includes industrial catering, in other words, food preparation and supply based on contractual arrangements with the customer, for a fixed term. Further included is the operation of food concessions (for example, at sports and similar facilities). The food can be prepared directly on the premises of the client organisation or in a central unit. This class includes: - activities of food service contractors (e.g. for transport companies) - operation of canteens or cafeterias (e.g. for factories, offices, hospitals or schools), on a concession basis
Exclusion Note: This class excludes: - manufacture of perishable food items, see 10.89 - retail sale of perishable food items, see 47.2
broader: Event catering, contract catering service activities and other food service activities
in scheme: Statistical Classification of Economic Activities in the European Community, Rev. 2.1 (NACE Rev. 2.1)
Notation: 56.22
top concept of: Statistical Classification of Economic Activities in the European Community, Rev. 2.1 (NACE Rev. 2.1)

ConceptNoneRandom0.2945491153758234
type: ConceptAssociation
description: NACE Rev. 2.1 class 43.11 is mapped to NACE Rev. 2 class 43.11
Type: 1:1
Source Concept: Demolition
Target Concept: http://data.europa.eu/ux2/nace2/4311
in scheme: Statistical Classification of Economic Activities in the European Community, Rev. 2.1 (NACE Rev. 2.1)
scope note: the content of the NACE Rev 2.1 class is fully covered in the corresponding NACE Rev 2 class
top concept of: Statistical Classification of Economic Activities in the European Community, Rev. 2.1 (NACE Rev. 2.1)
Mapping Cardinality: 1 1

Translation and interpretation activities
type: Concept
broader: Other professional, scientific and technical activities
in scheme: Statistical Classification of Economic Activities in the European Community, Rev. 2.1 (NACE Rev. 2.1)
Notation: 74.3
top concept of: Statistical Classification of Economic Activities in the European Community, Rev. 2.1 (NACE Rev. 2.1)

Washing and cleaning of textile and fur products
type: Concept
broader: Personal service activities
in scheme: Statistical Classification of Economic Activities in the European Community, Rev. 2.1 (NACE Rev. 2.1)
Notation: 96.1
top concept of: Statistical Classification of Economic Activities in the European Community, Rev. 2.1 (NACE Rev. 2.1)

ConceptNoneRandom0.1475717288319498
type: ConceptAssociation
description: NACE Rev. 2.1 group 35.2 is mapped to NACE Rev. 2 groups 35.2, 52.1
Type: 42:34
Source Concept: Manufacture of gas, and distribution of gaseous fuels through mains
Target Concept: http://data.europa.eu/ux2/nace2/352
Target Concept: http://data.europa.eu/ux2/nace2/521
in scheme: Statistical Classification of Economic Activities in the European Community, Rev. 2.1 (NACE Rev. 2.1)
top concept of: Statistical Classification of Economic Activities in the European Community, Rev. 2.1 (NACE Rev. 2.1)
Mapping Cardinality: n m

ConceptNoneRandom0.715781190289668
type: ConceptAssociation
description: NACE Rev. 2.1 class 23.52 is mapped to NACE Rev. 2 class 23.52
Type: 1:1
Source Concept: Manufacture of lime and plaster
Target Concept: http://data.europa.eu/ux2/nace2/2352
in scheme: Statistical Classification of Economic Activities in the European Community, Rev. 2.1 (NACE Rev. 2.1)
scope note: the content of the NACE Rev 2.1 class is fully covered in the corresponding NACE Rev 2 class
top concept of: Statistical Classification of Economic Activities in the European Community, Rev. 2.1 (NACE Rev. 2.1)
Mapping Cardinality: 1 1

ConceptNoneRandom0.7966137995075429
type: ConceptAssociation
description: NACE Rev. 2.1 group 26.7 is mapped to NACE Rev. 2 groups 26.7, 26.8
Type: 1:2
Source Concept: Manufacture of optical instruments, magnetic and optical media and photographic equipment
Target Concept: http://data.europa.eu/ux2/nace2/267
Target Concept: http://data.europa.eu/ux2/nace2/268
in scheme: Statistical Classification of Economic Activities in the European Community, Rev. 2.1 (NACE Rev. 2.1)
top concept of: Statistical Classification of Economic Activities in the European Community, Rev. 2.1 (NACE Rev. 2.1)
Mapping Cardinality: 1 m

Wholesale of electrical household appliances
type: Concept
CoreContentNote: This class includes: - wholesale of electrical household appliances - wholesale of radio and television equipment - wholesale of photographic and optical goods except corrective glasses, lenses and sunglasses - wholesale of electrical heating and cooling appliances - wholesale of heating equipment using renewable resources - wholesale of heating, ventilation and air-conditioning equipment - wholesale of sewing machines of household-type - wholesale of safety systems and alarms
Exclusion Note: This class excludes: - wholesale of corrective glasses, lenses and sunglasses, see 46.46 - wholesale of recorded media, see 46.49 - wholesale of recordable media, see 46.50 - wholesale of sewing machines other than household-type, see 46.64 - wholesale of hardware, plumbing and heating equipment and supplies, see 46.84 - wholesale of heating, ventilation and air-conditioning equipment for non-domestic use, see 46.84
broader: Wholesale of household goods
in scheme: Statistical Classification of Economic Activities in the European Community, Rev. 2.1 (NACE Rev. 2.1)
Notation: 46.43
top concept of: Statistical Classification of Economic Activities in the European Community, Rev. 2.1 (NACE Rev. 2.1)

Retail sale of flowers, plants, fertilisers, pets and pet food
type: Concept
Additional Content Note: This class also includes: - retail sale of toiletries, hygiene products, etc. for pets
CoreContentNote: This class includes: - retail sale of flowers and plants - retail sale of fertilisers and plant protection products - retail sale of pets and articles for pets - retail sale of food for pets and other animals kept at home for pleasure (e.g. chickens, horses)
broader: Retail sale of other goods, except motor vehicles and motorcycles
in scheme: Statistical Classification of Economic Activities in the European Community, Rev. 2.1 (NACE Rev. 2.1)
Notation: 47.76
top concept of: Statistical Classification of Economic Activities in the European Community, Rev. 2.1 (NACE Rev. 2.1)

Rental and operating of own or leased real estate
type: Concept
Additional Content Note: This class also includes: - letting of roofs (e.g. for solar power installations) - rental of industrial plants and factories, including machinery and equipment - provision of space exclusively for animal boarding
CoreContentNote: This class includes: - rental and operating of self-owned or leased real estate: • apartment buildings and dwellings • non-residential buildings, including office buildings, industrial buildings, warehouses, hotels and other leisure buildings, exhibition halls, self-storage facilities, retail stores/shops, and shopping centres • data centres • land, including agricultural and forestry land - provision of homes and furnished or unfurnished flats or apartments for more permanent use, on an annual basis or longer - operation of residential mobile home sites for primary residences - development of building projects for own operation, i.e. for rental of space in these buildings
Exclusion Note: This class excludes: - operation of hotels, suite hotels, holiday homes, rooming houses, camping grounds, trailer parks and other non-residential or short-stay accommodation places (including student accommodation) provided for less than one year, see division 55 - development of building projects for residential and non-residential buildings, for later sale, see 68.12 - rental of machinery, see 77.3 - residential care activities for older persons or persons with physical disabilities, including supervision and assistance in daily living, see 87.30
broader: Rental and operating of own or leased real estate
in scheme: Statistical Classification of Economic Activities in the European Community, Rev. 2.1 (NACE Rev. 2.1)
Notation: 68.20
top concept of: Statistical Classification of Economic Activities in the European Community, Rev. 2.1 (NACE Rev. 2.1)

ConceptNoneRandom0.5944729522376136
type: ConceptAssociation
description: NACE Rev. 2.1 class 87.10 is mapped to NACE Rev. 2 class 87.10
Type: 1:1
Source Concept: Residential nursing care activities
Target Concept: http://data.europa.eu/ux2/nace2/8710
in scheme: Statistical Classification of Economic Activities in the European Community, Rev. 2.1 (NACE Rev. 2.1)
scope note: the content of the NACE Rev 2.1 class is fully covered in the corresponding NACE Rev 2 class
top concept of: Statistical Classification of Economic Activities in the European Community, Rev. 2.1 (NACE Rev. 2.1)
Mapping Cardinality: 1 1

Other information technology and computer service activities
type: Concept
CoreContentNote: This class includes other information technology and computer-related activities not elsewhere classified, for example: - computer disaster recovery services - installation (setting-up) of personal computers - third-party software installation services
Exclusion Note: This class excludes: - installation of mainframe and similar computers, see 33.20 - computer programming, see 62.10 - computer consultancy, see 62.20 - computer facilities management, see 62.20 - provision of computing infrastructure, data processing and hosting, see 63.10
broader: Other information technology and computer service activities
in scheme: Statistical Classification of Economic Activities in the European Community, Rev. 2.1 (NACE Rev. 2.1)
Notation: 62.90
top concept of: Statistical Classification of Economic Activities in the European Community, Rev. 2.1 (NACE Rev. 2.1)

Manufacture of bearings, gears, gearing and driving elements
type: Concept
CoreContentNote: This class includes: - manufacture of ball and roller bearings, and parts thereof - manufacture of mechanical power transmission equipment, e.g.: • transmission shafts, including camshafts, crankshafts and cranks • bearing housings and plain shaft bearings - manufacture of gears, gearing and gearboxes, and other speed changers - manufacture of clutches and shaft couplings - manufacture of flywheels and pulleys - manufacture of articulated link chain - manufacture of power transmission chain
Exclusion Note: This class excludes: - manufacture of other chain, see 25.93 - manufacture of hydraulic transmission equipment, see 28.12 - manufacture of hydrostatic transmission equipment, see 28.12 - manufacture of clutches for motor vehicles, see 29.31 - manufacture of gears, gearboxes and parts thereof for motor vehicles, see 29.32 - manufacture of sub-assemblies of power transmission equipment which are suitable for use solely or principally with motor vehicles or aircraft, see divisions 29, 30
broader: Manufacture of general-purpose machinery
in scheme: Statistical Classification of Economic Activities in the European Community, Rev. 2.1 (NACE Rev. 2.1)
Notation: 28.15
top concept of: Statistical Classification of Economic Activities in the European Community, Rev. 2.1 (NACE Rev. 2.1)

Activities of other membership organisations n.e.c.
type: Concept
Additional Content Note: This class also includes: - grant-giving activities by membership organisations or others - activities of philanthropic intermediaries and activities to promote volunteerism - international cooperation and solidarity activities - service activities to promote hunting and trapping
CoreContentNote: This class includes: - activities of organisations (not directly affiliated to a political party) furthering a public cause or issue by means of public education, political influence, fundraising, etc.: • citizens’ initiative or protest movements • environmental and ecological movements • organisations supporting community and educational facilities n.e.c. • organisations for the protection and betterment of special groups (e.g. ethnic and minority groups) • associations for patriotic purposes, including war veterans’ associations • associations intended to promote health • associations for the protection of animals • consumer associations - activities of automobile associations (other than sports) - activities of associations for the purpose of social acquaintanceship (e.g. Rotary Clubs, lodges) - activities of associations of youth (e.g. scout associations, young persons’ associations, student associations, clubs, fraternities and sororities) - activities of associations for the pursuit of cultural or recreational activities or a hobby, other than sports or games (e.g. poetry, literature and book clubs, historical clubs, gardening clubs, film and photographic clubs, music and art clubs, craft and collectors’ clubs, social clubs, carnival clubs)
Exclusion Note: This class excludes: - charitable activities like fundraising aimed at social work, see 88.99 - activities of sports clubs, see 93.12 - activities of sports federations, see 93.19 - activities of professional membership organisations, see 94.12 - activities of international organisations under international treaties between states, see 99.00
broader: Activities of other membership organisations
in scheme: Statistical Classification of Economic Activities in the European Community, Rev. 2.1 (NACE Rev. 2.1)
Notation: 94.99
top concept of: Statistical Classification of Economic Activities in the European Community, Rev. 2.1 (NACE Rev. 2.1)

ConceptNoneRandom0.7550688919736176
type: ConceptAssociation
description: NACE Rev. 2.1 class 66.22 is mapped to NACE Rev. 2 class 66.22
Type: 1:1
Source Concept: Activities of insurance agents and brokers
Target Concept: http://data.europa.eu/ux2/nace2/6622
in scheme: Statistical Classification of Economic Activities in the European Community, Rev. 2.1 (NACE Rev. 2.1)
scope note: the content of the NACE Rev 2.1 class is fully covered in the corresponding NACE Rev 2 class
top concept of: Statistical Classification of Economic Activities in the European Community, Rev. 2.1 (NACE Rev. 2.1)
Mapping Cardinality: 1 1

ConceptNoneRandom0.0031052235209434453
type: ConceptAssociation
description: NACE Rev. 2.1 class 46.63 is mapped to NACE Rev. 2 class 46.63
Type: 1:1
Source Concept: Wholesale of mining, construction and civil engineering machinery
Target Concept: http://data.europa.eu/ux2/nace2/4663
in scheme: Statistical Classification of Economic Activities in the European Community, Rev. 2.1 (NACE Rev. 2.1)
scope note: the content of the NACE Rev 2.1 class is fully covered in the corresponding NACE Rev 2 class
top concept of: Statistical Classification of Economic Activities in the European Community, Rev. 2.1 (NACE Rev. 2.1)
Mapping Cardinality: 1 1

ConceptNoneRandom0.3064225513933443
type: ConceptAssociation
description: NACE Rev. 2.1 class 43.12 is mapped to NACE Rev. 2 class 43.12
Type: 1:1
Source Concept: Site preparation
Target Concept: http://data.europa.eu/ux2/nace2/4312
in scheme: Statistical Classification of Economic Activities in the European Community, Rev. 2.1 (NACE Rev. 2.1)
scope note: the content of the NACE Rev 2.1 class is fully covered in the corresponding NACE Rev 2 class
top concept of: Statistical Classification of Economic Activities in the European Community, Rev. 2.1 (NACE Rev. 2.1)
Mapping Cardinality: 1 1

Manufacture of refined petroleum products and fossil fuel products
type: Concept
Additional Content Note: This class also includes: - manufacture of peat briquettes - manufacture of hard coal and lignite fuel briquettes
CoreContentNote: This class includes the manufacture of liquid or gaseous fuels or other products from crude petroleum, bituminous minerals or their fractionation products. Petroleum refining involves one or more of the following activities: fractionation; straight distillation of crude oil; cracking. This class includes: - production of motor fuel: gasoline, kerosene, etc. - production of fuel: light, medium and heavy fuel oil, refinery gases (e.g. ethane, propane, butane) - manufacture of oil-based lubricating oils or greases, including from waste oil - manufacture of products for the petrochemical industry and for the manufacture of road coverings - manufacture of various refined petroleum products, white spirit, Vaseline, paraffin wax, petroleum jelly, etc. - manufacture of petroleum briquettes - blending of biofuels, i.e. blending of alcohols with petroleum (e.g. gasohol) - manufacture of products from petroleum waste materials (e.g. waste lubricating petroleum oils)
Exclusion Note: This class excludes: - manufacture of solid fuels from biomass, see 16.26 - manufacture of liquid biofuels, see 20.51
broader: Manufacture of refined petroleum products and fossil fuel products
in scheme: Statistical Classification of Economic Activities in the European Community, Rev. 2.1 (NACE Rev. 2.1)
Notation: 19.20
top concept of: Statistical Classification of Economic Activities in the European Community, Rev. 2.1 (NACE Rev. 2.1)

Manufacture of military fighting vehicles
type: Concept
broader: Manufacture of other transport equipment
in scheme: Statistical Classification of Economic Activities in the European Community, Rev. 2.1 (NACE Rev. 2.1)
Notation: 30.4
top concept of: Statistical Classification of Economic Activities in the European Community, Rev. 2.1 (NACE Rev. 2.1)

Residential care activities for older persons or persons with physical disabilities
type: Concept
broader: Residential care activities
in scheme: Statistical Classification of Economic Activities in the European Community, Rev. 2.1 (NACE Rev. 2.1)
Notation: 87.3
top concept of: Statistical Classification of Economic Activities in the European Community, Rev. 2.1 (NACE Rev. 2.1)

ConceptNoneRandom0.9074720990997017
type: ConceptAssociation
description: NACE Rev. 2.1 group 26.4 is mapped to NACE Rev. 2 groups 26.2, 26.4
Type: 18:19
Source Concept: Manufacture of consumer electronics
Target Concept: http://data.europa.eu/ux2/nace2/262
Target Concept: http://data.europa.eu/ux2/nace2/264
in scheme: Statistical Classification of Economic Activities in the European Community, Rev. 2.1 (NACE Rev. 2.1)
top concept of: Statistical Classification of Economic Activities in the European Community, Rev. 2.1 (NACE Rev. 2.1)
Mapping Cardinality: n m

ConceptNoneRandom0.5204016259505237
type: ConceptAssociation
description: NACE Rev. 2.1 group 13.1 is mapped to NACE Rev. 2 group 13.1
Type: 1:1
Source Concept: Preparation and spinning of textile fibres
Target Concept: http://data.europa.eu/ux2/nace2/131
in scheme: Statistical Classification of Economic Activities in the European Community, Rev. 2.1 (NACE Rev. 2.1)
top concept of: Statistical Classification of Economic Activities in the European Community, Rev. 2.1 (NACE Rev. 2.1)
Mapping Cardinality: 1 1

Visual arts creation activities
type: Concept
CoreContentNote: This class includes the activities of creation and production of works of the visual arts. This class includes: - activities of independent artists (e.g. sculptors, painters, cartoonists, calligraphers, engravers, etchers) - digital forms of visual arts creation - creations of art featuring light installations
Exclusion Note: This class excludes: - manufacture of statues, other than artistic originals, see 23.70 - motion picture and video production, see 59.11, 59.12 - operation of cinemas, see 59.14 - photographic activities, see 74.20 - activities of personal theatrical or artistic agents or agencies, see 74.99 - casting activities, see 78.10 - intermediation service activities for theatrical, sport, amusement and entertainment tickets, see 82.40 - choreography activities, see 90.13 - creation and presentation of light and sound shows, see 93.29
broader: Arts creation activities
in scheme: Statistical Classification of Economic Activities in the European Community, Rev. 2.1 (NACE Rev. 2.1)
Notation: 90.12
top concept of: Statistical Classification of Economic Activities in the European Community, Rev. 2.1 (NACE Rev. 2.1)

Retail sale of watches and jewellery
type: Concept
Additional Content Note: This class also includes: - retail sale of silverware articles
Exclusion Note: This class excludes: - retail sale of imitation jewellery, see 47.78
broader: Retail sale of other goods, except motor vehicles and motorcycles
in scheme: Statistical Classification of Economic Activities in the European Community, Rev. 2.1 (NACE Rev. 2.1)
Notation: 47.77
top concept of: Statistical Classification of Economic Activities in the European Community, Rev. 2.1 (NACE Rev. 2.1)

Wholesale of china and glassware and cleaning materials
type: Concept
CoreContentNote: This class includes: - wholesale of china and glassware - wholesale of cleaning materials - wholesale of household utensils, crockery and pottery
Exclusion Note: This class excludes: - wholesale of saucepans and pans, see 46.49
broader: Wholesale of household goods
in scheme: Statistical Classification of Economic Activities in the European Community, Rev. 2.1 (NACE Rev. 2.1)
Notation: 46.44
top concept of: Statistical Classification of Economic Activities in the European Community, Rev. 2.1 (NACE Rev. 2.1)

ConceptNoneRandom0.9852791452721914
type: ConceptAssociation
description: NACE Rev. 2.1 class 77.31 is mapped to NACE Rev. 2 class 77.31
Type: 1:1
Source Concept: Rental and leasing of agricultural machinery and equipment
Target Concept: http://data.europa.eu/ux2/nace2/7731
in scheme: Statistical Classification of Economic Activities in the European Community, Rev. 2.1 (NACE Rev. 2.1)
scope note: the content of the NACE Rev 2.1 class is fully covered in the corresponding NACE Rev 2 class
top concept of: Statistical Classification of Economic Activities in the European Community, Rev. 2.1 (NACE Rev. 2.1)
Mapping Cardinality: 1 1

Support activities for transportation
type: Concept
CoreContentNote: This group includes activities supporting the transport of passengers or freight, including the operation of transport facilities and parts of the transport infrastructure and activities related to handling freight before, after or between transport segments.
Exclusion Note: This group excludes: - intermediation service activities for freight transport, see 52.31 - intermediation service activities for passenger transport, see 52.32
broader: Warehousing, storage and support activities for transportation
in scheme: Statistical Classification of Economic Activities in the European Community, Rev. 2.1 (NACE Rev. 2.1)
Notation: 52.2
top concept of: Statistical Classification of Economic Activities in the European Community, Rev. 2.1 (NACE Rev. 2.1)

ConceptNoneRandom0.829511432028938
type: ConceptAssociation
description: NACE Rev. 2.1 division 38 is mapped to NACE Rev. 2 division 38
Type: 2:2
Source Concept: Waste collection, recovery and disposal activities
Target Concept: http://data.europa.eu/ux2/nace2/38
in scheme: Statistical Classification of Economic Activities in the European Community, Rev. 2.1 (NACE Rev. 2.1)
top concept of: Statistical Classification of Economic Activities in the European Community, Rev. 2.1 (NACE Rev. 2.1)
Mapping Cardinality: n m

Retail sale of other new goods
type: Concept
Additional Content Note: This class also includes: - retail sale of artificial flowers and plants
CoreContentNote: This class includes: - retail sale of photographic and precision equipment - retail sale of optical equipment, excluding spectacles and lenses (e.g. telescopes, microscopes, binoculars) - retail sale of household fuel oil, bottled gas, coal and fuelwood, pellets of wood or biomass - retail sale of packaging articles - retail sale of funeral and cemetery articles (e.g. urns, tombstones) - retail sale of imitation jewellery - retail sale of cleaning products (e.g. detergents, sponges) - retail sale of souvenirs, craftwork and religious articles - retail sale of non-food products n.e.c.
Exclusion Note: This class excludes: - retail sale of fishing gear, see 47.63 - retail sale of weapons and ammunition, see 47.63 - retail sale of stamps and coins, see 47.69 - retail sale of glasses and lenses, see 47.74
broader: Retail sale of other goods, except motor vehicles and motorcycles
in scheme: Statistical Classification of Economic Activities in the European Community, Rev. 2.1 (NACE Rev. 2.1)
Notation: 47.78
top concept of: Statistical Classification of Economic Activities in the European Community, Rev. 2.1 (NACE Rev. 2.1)

Manufacture of other taps and valves
type: Concept
CoreContentNote: This class includes: - manufacture of industrial taps and valves, including regulating valves and intake taps - manufacture of taps and valves for sanitary fixtures - manufacture of central heating radiator taps and valves
Exclusion Note: This class excludes: - manufacture of valves of unhardened vulcanised rubber, glass or ceramic materials, see 22.12, 23.15 or 23.44 - manufacture of inlet and exhaust valves of internal combustion engines, see 28.11 - manufacture of valves for hydraulic or pneumatic transmission and air preparation equipment for use in pneumatic systems, see 28.12
broader: Manufacture of general-purpose machinery
in scheme: Statistical Classification of Economic Activities in the European Community, Rev. 2.1 (NACE Rev. 2.1)
Notation: 28.14
top concept of: Statistical Classification of Economic Activities in the European Community, Rev. 2.1 (NACE Rev. 2.1)

Manufacture of condiments and seasonings
type: Concept
Additional Content Note: This class also includes: - processing of salt into food-grade salt (e.g. iodised salt) - processing of condiments and herbs, including drying, sorting, cleaning and cutting
CoreContentNote: This class includes: - manufacture of spices, sauces and condiments: • mayonnaise • mustard flour and meal • prepared mustard, etc. - manufacture of vinegar
Exclusion Note: This class excludes: - growing of spice crops, see 01.28
broader: Manufacture of other food products
in scheme: Statistical Classification of Economic Activities in the European Community, Rev. 2.1 (NACE Rev. 2.1)
Notation: 10.84
top concept of: Statistical Classification of Economic Activities in the European Community, Rev. 2.1 (NACE Rev. 2.1)

ConceptNoneRandom0.535272506066077
type: ConceptAssociation
description: NACE Rev. 2.1 class 66.21 is mapped to NACE Rev. 2 class 66.21
Type: 1:1
Source Concept: Risk and damage evaluation
Target Concept: http://data.europa.eu/ux2/nace2/6621
in scheme: Statistical Classification of Economic Activities in the European Community, Rev. 2.1 (NACE Rev. 2.1)
scope note: the content of the NACE Rev 2.1 class is fully covered in the corresponding NACE Rev 2 class
top concept of: Statistical Classification of Economic Activities in the European Community, Rev. 2.1 (NACE Rev. 2.1)
Mapping Cardinality: 1 1

Patent brokering and marketing service activities
type: Concept
Additional Content Note: This class also includes: - management services for rights to industrial property (patents, licences, trademarks, franchises, etc.) - activities of collective rights management organisations - management of rights in intellectual property (e.g. copyrights and their revenues)
CoreContentNote: This class includes: - brokering and marketing activities for patents
Exclusion Note: This class excludes: - leasing of intellectual property and similar products, see 77.40
broader: Other professional, scientific and technical activities n.e.c.
in scheme: Statistical Classification of Economic Activities in the European Community, Rev. 2.1 (NACE Rev. 2.1)
Notation: 74.91
top concept of: Statistical Classification of Economic Activities in the European Community, Rev. 2.1 (NACE Rev. 2.1)

ConceptNoneRandom0.4148696770794601
type: ConceptAssociation
description: NACE Rev. 2.1 group 26.5 is mapped to NACE Rev. 2 groups 26.3, 26.5
Type: 2:2
Source Concept: Manufacture of measuring testing instruments, clocks and watches
Target Concept: http://data.europa.eu/ux2/nace2/263
Target Concept: http://data.europa.eu/ux2/nace2/265
in scheme: Statistical Classification of Economic Activities in the European Community, Rev. 2.1 (NACE Rev. 2.1)
top concept of: Statistical Classification of Economic Activities in the European Community, Rev. 2.1 (NACE Rev. 2.1)
Mapping Cardinality: n m

Intermediation service activities for transportation
type: Concept
CoreContentNote: This group includes the intermediation of freight and passenger transport.
broader: Warehousing, storage and support activities for transportation
in scheme: Statistical Classification of Economic Activities in the European Community, Rev. 2.1 (NACE Rev. 2.1)
Notation: 52.3
top concept of: Statistical Classification of Economic Activities in the European Community, Rev. 2.1 (NACE Rev. 2.1)

Other arts creation activities
type: Concept
CoreContentNote: This class includes: - choreography activities
Exclusion Note: This class excludes: - renovation, renewal, reconstruction and retrofitting of historical and archaeological sites and buildings, see 43.99 - operation of museums of all kinds, see 91.21 - repair of furniture not considered cultural heritage and non-historical, see 95.24
broader: Arts creation activities
in scheme: Statistical Classification of Economic Activities in the European Community, Rev. 2.1 (NACE Rev. 2.1)
Notation: 90.13
top concept of: Statistical Classification of Economic Activities in the European Community, Rev. 2.1 (NACE Rev. 2.1)

ConceptNoneRandom0.7381724918095106
type: ConceptAssociation
description: NACE Rev. 2.1 group 13.2 is mapped to NACE Rev. 2 group 13.2
Type: 3:3
Source Concept: Weaving of textiles
Target Concept: http://data.europa.eu/ux2/nace2/132
in scheme: Statistical Classification of Economic Activities in the European Community, Rev. 2.1 (NACE Rev. 2.1)
top concept of: Statistical Classification of Economic Activities in the European Community, Rev. 2.1 (NACE Rev. 2.1)
Mapping Cardinality: n m

Retail sale of automotive fuel
type: Concept
Additional Content Note: This class also includes: - retail sale of petrol in combination with electro fuels (e-fuels), if the sale of electro fuels is not predominant - retail sale of lubricating products and cooling products for motor vehicles - retail sale of hydrogen for motor vehicles and motorcycles - retail sale of fuel, in combination with food, beverages, products for the maintenance of vehicles, car washing services, etc. where the sale of fuel is predominant
CoreContentNote: This class includes: - retail sale of fuels, whether fossil or carbon-free fuels, for motor vehicles and motorcycles - operation of petrol stations
Exclusion Note: This class excludes: - operation of charging facilities for electric vehicles, e.g. electric cars, motorcycles, scooters, bicycles, see 35.15 - wholesale of fuels, see 46.81 - retail sale of liquefied petroleum gas (LPG) for cooking or heating, see 47.78 - retail sale of motor vehicle parts and accessories, see 47.82 - retail sale of motorcycles and motorcycle parts and accessories, see 47.83
broader: Retail sale of automotive fuel
in scheme: Statistical Classification of Economic Activities in the European Community, Rev. 2.1 (NACE Rev. 2.1)
Notation: 47.30
top concept of: Statistical Classification of Economic Activities in the European Community, Rev. 2.1 (NACE Rev. 2.1)

Other business support service activities n.e.c.
type: Concept
CoreContentNote: This class includes: - fundraising organisation services on a contract or fee basis - court reporting or stenotype recording services - public stenography services - real-time (i.e. simultaneous) closed captioning of meetings, conferences - barcoding services - barcode imprinting services - parking meter coin collection services - activities of handling visa and work permits - restaurant voucher handling service activities - providing assistance in motor vehicle registration - relocation service activities - administration of gift packages for leisure activities - voucher issuing and handling activities - charity crowdfunding activities - company domiciliation services - reading of consumption of heat and hot water, including cost allocation - administration of loyalty programmes - selling of deferred travel services: form of distribution of a service linked to travel, which can be of any nature (hotels, restaurants, personal care, leisure activities, etc.) - trading and brokerage of crypto-assets without liabilities
Exclusion Note: This class excludes: - activities of auctioning houses (wholesale) and online auction activities (wholesale), see 46.1 - activities of auctioning houses (retail sale) and online auction activities (retail sale), see 47.9 - providing film or tape captioning or subtitling services, see 59.12 - activities of shared service centres (SSC) with strategic and managerial activities/centralised activities, see 70.10 - business and other management consultancy activities, see 70.20 - activities of shared service centres (SSC) with two or more combined activities (set of administrative services) providing operational tasks for the whole enterprise or group (e.g. reception, financial planning, billing and record-keeping, personnel, postal and mailing services for the same enterprise group), see 82.10 - provision of document transcription services, see 82.10 - intermediation service activities for business support service activities n.e.c., see 82.40
broader: Business support service activities n.e.c.
in scheme: Statistical Classification of Economic Activities in the European Community, Rev. 2.1 (NACE Rev. 2.1)
Notation: 82.99
top concept of: Statistical Classification of Economic Activities in the European Community, Rev. 2.1 (NACE Rev. 2.1)

ConceptNoneRandom0.6528587240219388
type: ConceptAssociation
description: NACE Rev. 2.1 class 56.40 is mapped to NACE Rev. 2 class 79.90
Type: 78:65
Source Concept: Intermediation service activities for food and beverage services activities
Target Concept: http://data.europa.eu/ux2/nace2/7990
in scheme: Statistical Classification of Economic Activities in the European Community, Rev. 2.1 (NACE Rev. 2.1)
scope note: the content of the NACE Rev 2.1 class is fully covered in the corresponding NACE Rev 2 class
top concept of: Statistical Classification of Economic Activities in the European Community, Rev. 2.1 (NACE Rev. 2.1)
Mapping Cardinality: n m

Wholesale of perfume and cosmetics
type: Concept
CoreContentNote: This class includes: - wholesale of perfumes, cosmetics, soaps and toilet paper
broader: Wholesale of household goods
in scheme: Statistical Classification of Economic Activities in the European Community, Rev. 2.1 (NACE Rev. 2.1)
Notation: 46.45
top concept of: Statistical Classification of Economic Activities in the European Community, Rev. 2.1 (NACE Rev. 2.1)

ConceptNoneRandom0.6075475469400784
type: ConceptAssociation
description: NACE Rev. 2.1 class 77.32 is mapped to NACE Rev. 2 class 77.32
Type: 1:1
Source Concept: Rental and leasing of construction and civil engineering machinery and equipment
Target Concept: http://data.europa.eu/ux2/nace2/7732
in scheme: Statistical Classification of Economic Activities in the European Community, Rev. 2.1 (NACE Rev. 2.1)
scope note: the content of the NACE Rev 2.1 class is fully covered in the corresponding NACE Rev 2 class
top concept of: Statistical Classification of Economic Activities in the European Community, Rev. 2.1 (NACE Rev. 2.1)
Mapping Cardinality: 1 1

Specialised design activities
type: Concept
broader: Other professional, scientific and technical activities
in scheme: Statistical Classification of Economic Activities in the European Community, Rev. 2.1 (NACE Rev. 2.1)
Notation: 74.1
top concept of: Statistical Classification of Economic Activities in the European Community, Rev. 2.1 (NACE Rev. 2.1)

Mining of uranium and thorium ores
type: Concept
CoreContentNote: This class includes: - mining of ores chiefly valued for uranium and thorium content: pitchblende, etc. - concentration of such ores - manufacture of yellowcake
Exclusion Note: This class excludes: - enrichment of uranium and thorium ores, see 20.13 - production of uranium metal from pitchblende or other ores, see 24.46 - smelting and refining of uranium, see 24.46
broader: Mining of non-ferrous metal ores
in scheme: Statistical Classification of Economic Activities in the European Community, Rev. 2.1 (NACE Rev. 2.1)
Notation: 07.21
top concept of: Statistical Classification of Economic Activities in the European Community, Rev. 2.1 (NACE Rev. 2.1)

ConceptNoneRandom0.972887117577936
type: ConceptAssociation
description: NACE Rev. 2.1 division 37 is mapped to NACE Rev. 2 division 37
Type: 1:1
Source Concept: Sewerage
Target Concept: http://data.europa.eu/ux2/nace2/37
in scheme: Statistical Classification of Economic Activities in the European Community, Rev. 2.1 (NACE Rev. 2.1)
top concept of: Statistical Classification of Economic Activities in the European Community, Rev. 2.1 (NACE Rev. 2.1)
Mapping Cardinality: 1 1

Manufacture of other pumps and compressors
type: Concept
Additional Content Note: This class also includes: - manufacture of hand pumps
CoreContentNote: This class includes: - manufacture of air or vacuum pumps, air or other gas compressors - manufacture of pumps for liquids, whether or not fitted with a measuring device - manufacture of pumps for internal combustion engines (e.g. oil, water and fuel pumps for motor vehicles)
Exclusion Note: This class excludes: - manufacture of hydraulic fluid power pumps, see 28.12
broader: Manufacture of general-purpose machinery
in scheme: Statistical Classification of Economic Activities in the European Community, Rev. 2.1 (NACE Rev. 2.1)
Notation: 28.13
top concept of: Statistical Classification of Economic Activities in the European Community, Rev. 2.1 (NACE Rev. 2.1)

ConceptNoneRandom0.06617928632903003
type: ConceptAssociation
description: NACE Rev. 2.1 class 10.20 is mapped to NACE Rev. 2 class 10.20
Type: 1:1
Source Concept: Processing and preserving of fish, crustaceans and molluscs
Target Concept: http://data.europa.eu/ux2/nace2/1020
in scheme: Statistical Classification of Economic Activities in the European Community, Rev. 2.1 (NACE Rev. 2.1)
scope note: the content of the NACE Rev 2.1 class is fully covered in the corresponding NACE Rev 2 class
top concept of: Statistical Classification of Economic Activities in the European Community, Rev. 2.1 (NACE Rev. 2.1)
Mapping Cardinality: 1 1

Wholesale of pharmaceutical and medical goods
type: Concept
Additional Content Note: This class also includes: - wholesale of non-corrective sunglasses
CoreContentNote: This class includes: - wholesale of pharmaceutical, medical and orthopaedic goods - wholesale of veterinary medicines - wholesale of corrective glasses, lenses and sunglasses - wholesale of medical and surgical instruments - wholesale of hospital equipment
Exclusion Note: This class excludes: - wholesale of health foods and diet products, see 46.38 - wholesale of furniture for medical facilities and hospitals, see 46.47
broader: Wholesale of household goods
in scheme: Statistical Classification of Economic Activities in the European Community, Rev. 2.1 (NACE Rev. 2.1)
Notation: 46.46
top concept of: Statistical Classification of Economic Activities in the European Community, Rev. 2.1 (NACE Rev. 2.1)

Retail sale of second-hand goods
type: Concept
CoreContentNote: This class includes: - retail sale of second-hand books - retail sale of antiques - retail sale of second-hand clothes - retail sale of second-hand furniture - retail sale of second-hand household appliances - retail sale of other second-hand goods
Exclusion Note: This class excludes: - retail sale of second-hand motor vehicles, motorcycles, and related parts and accessories, see 47.8 - activities of retail auctioneering houses for both new and used third-party goods, including internet retail auctions, see 47.9 - activities of intermediaries in the retail sale of second-hand goods, see 47.9 - activities of space rental, including staff, for second-hand goods, see 47.91 - activities of pawnshops, see 64.92
broader: Retail sale of other goods, except motor vehicles and motorcycles
in scheme: Statistical Classification of Economic Activities in the European Community, Rev. 2.1 (NACE Rev. 2.1)
Notation: 47.79
top concept of: Statistical Classification of Economic Activities in the European Community, Rev. 2.1 (NACE Rev. 2.1)

Manufacture of prepared meals and dishes
type: Concept
CoreContentNote: This class includes the manufacture of ready-made (in other words, prepared, seasoned and cooked) meals and dishes. These dishes are processed and conserved (for example, in frozen or canned form) and are usually packaged and labelled for resale, in other words, this class excludes the preparation of meals for immediate consumption (for example, food prepared in restaurants or by caterers). To be considered a dish, these foods have to contain at least two distinct main ingredients (except seasonings, and so on). This class includes: - manufacture of meat or poultry dishes - manufacture of fish dishes, including fish and chips - manufacture of pasta and rice dishes - manufacture of vegetable dishes - manufacture of frozen or otherwise preserved pizza and croque-monsieur
Exclusion Note: This class excludes: - manufacture of fresh foods or foods with less than two ingredients, see corresponding class in division 10 - manufacture of perishable prepared foods of fruits and vegetables, see 10.39 - manufacture of perishable prepared foods, see 10.89 - wholesale of prepared meals and dishes, see 46.38 - retail sale of prepared meals and dishes, see 47.11, 47.27 - activities of event catering and contract catering services, see 56.2
broader: Manufacture of other food products
in scheme: Statistical Classification of Economic Activities in the European Community, Rev. 2.1 (NACE Rev. 2.1)
Notation: 10.85
top concept of: Statistical Classification of Economic Activities in the European Community, Rev. 2.1 (NACE Rev. 2.1)

ConceptNoneRandom0.5937407282225766
type: ConceptAssociation
description: NACE Rev. 2.1 class 46.61 is mapped to NACE Rev. 2 class 46.61
Type: 1:1
Source Concept: Wholesale of agricultural machinery, equipment and supplies
Target Concept: http://data.europa.eu/ux2/nace2/4661
in scheme: Statistical Classification of Economic Activities in the European Community, Rev. 2.1 (NACE Rev. 2.1)
scope note: the content of the NACE Rev 2.1 class is fully covered in the corresponding NACE Rev 2 class
top concept of: Statistical Classification of Economic Activities in the European Community, Rev. 2.1 (NACE Rev. 2.1)
Mapping Cardinality: 1 1

Activities of holding companies
type: Concept
CoreContentNote: This class includes the activities of holding companies, in other words, units that hold the assets (owning controlling levels of equity) of one or more subsidiaries and whose only purpose is owning subsidiaries. The holding companies in this class do not provide any other service to the enterprises in which the equity is held, in other words, they do not administer or manage other units.
Exclusion Note: This class excludes: - activities of shareholding companies, not owning controlling levels of equity, see 64.32 - dealing in financial markets on own account, see 64.99 - activities of asset management on a fee or contract basis, see 66.30 - provision of managerial services (e.g. strategic planning, decision-making and administrative services of a head office), see 70.10 - active management of companies and enterprises, strategic planning and decision-making of the company, see 70.10
broader: Activities of holding companies and financing conduits
in scheme: Statistical Classification of Economic Activities in the European Community, Rev. 2.1 (NACE Rev. 2.1)
Notation: 64.21
top concept of: Statistical Classification of Economic Activities in the European Community, Rev. 2.1 (NACE Rev. 2.1)

Specialised construction activities in civil engineering
type: Concept
broader: Specialised construction activities
in scheme: Statistical Classification of Economic Activities in the European Community, Rev. 2.1 (NACE Rev. 2.1)
Notation: 43.5
top concept of: Statistical Classification of Economic Activities in the European Community, Rev. 2.1 (NACE Rev. 2.1)

ConceptNoneRandom0.8758589305625507
type: ConceptAssociation
description: NACE Rev. 2.1 class 22.22 is mapped to NACE Rev. 2 class 22.22
Type: 17:12
Source Concept: Manufacture of plastic packing goods
Target Concept: http://data.europa.eu/ux2/nace2/2222
in scheme: Statistical Classification of Economic Activities in the European Community, Rev. 2.1 (NACE Rev. 2.1)
scope note: the content of the NACE Rev 2.1 class is fully covered in the corresponding NACE Rev 2 class
top concept of: Statistical Classification of Economic Activities in the European Community, Rev. 2.1 (NACE Rev. 2.1)
Mapping Cardinality: n m

Residential nursing care activities
type: Concept
broader: Residential care activities
in scheme: Statistical Classification of Economic Activities in the European Community, Rev. 2.1 (NACE Rev. 2.1)
Notation: 87.1
top concept of: Statistical Classification of Economic Activities in the European Community, Rev. 2.1 (NACE Rev. 2.1)

ConceptNoneRandom0.7911384226627148
type: ConceptAssociation
description: NACE Rev. 2.1 class 90.39 is mapped to NACE Rev. 2 class 90.02
Type: 1:1
Source Concept: Other support activities to arts and performing arts
Target Concept: http://data.europa.eu/ux2/nace2/9002
in scheme: Statistical Classification of Economic Activities in the European Community, Rev. 2.1 (NACE Rev. 2.1)
scope note: the content of the NACE Rev 2.1 class is fully covered in the corresponding NACE Rev 2 class
top concept of: Statistical Classification of Economic Activities in the European Community, Rev. 2.1 (NACE Rev. 2.1)
Mapping Cardinality: 1 1

Repair and maintenance of civilian ships and boats
type: Concept
CoreContentNote: This class includes the repair and maintenance of civilian ships and boats. This class includes: - repair and routine maintenance of civilian ships - repair and maintenance of pleasure boats - repair and maintenance of civilian ship and boat engines, including electric outboard motors - repair and maintenance of floating structures
Exclusion Note: This class excludes: - factory overhaul of engines for civilian and sport/recreational ships and boats, see 28.11 - factory overhaul and rebuilding of civilian ships and boats, see 30.11 - factory overhaul and rebuilding of sport/recreational ships and boats, see 30.12 - repair and maintenance of military ships and boats, see 33.18 - repair and maintenance of military ship and boat engines, see 33.18
broader: Repair and maintenance of fabricated metal products, machinery and equipment
in scheme: Statistical Classification of Economic Activities in the European Community, Rev. 2.1 (NACE Rev. 2.1)
Notation: 33.15
top concept of: Statistical Classification of Economic Activities in the European Community, Rev. 2.1 (NACE Rev. 2.1)

ConceptNoneRandom0.04529258102090905
type: ConceptAssociation
description: NACE Rev. 2.1 class 79.11 is mapped to NACE Rev. 2 class 79.11
Type: 78:65
Source Concept: Travel agency activities
Target Concept: http://data.europa.eu/ux2/nace2/7911
in scheme: Statistical Classification of Economic Activities in the European Community, Rev. 2.1 (NACE Rev. 2.1)
scope note: the content of the NACE Rev 2.1 class is fully covered in the corresponding NACE Rev 2 class
top concept of: Statistical Classification of Economic Activities in the European Community, Rev. 2.1 (NACE Rev. 2.1)
Mapping Cardinality: n m

Heat treatment of metals
type: Concept
CoreContentNote: This class includes: - general activities for the heat treatment of metals - thermomechanical heat treatment of metals (e.g. preheating, annealing, hardening, tempering, quenching, deep freezing of metal) - thermochemical heat treatment of metals (e.g. carburising, carbonitriding, nitrocarburising, nitriding, oxidising, sulphidising, boriding)
broader: Treatment and coating of metals; machining
in scheme: Statistical Classification of Economic Activities in the European Community, Rev. 2.1 (NACE Rev. 2.1)
Notation: 25.52
top concept of: Statistical Classification of Economic Activities in the European Community, Rev. 2.1 (NACE Rev. 2.1)

Manufacture of railway locomotives and rolling stock
type: Concept
broader: Manufacture of other transport equipment
in scheme: Statistical Classification of Economic Activities in the European Community, Rev. 2.1 (NACE Rev. 2.1)
Notation: 30.2
top concept of: Statistical Classification of Economic Activities in the European Community, Rev. 2.1 (NACE Rev. 2.1)

Pension funding
type: Concept
broader: Insurance, reinsurance and pension funding, except compulsory social security
in scheme: Statistical Classification of Economic Activities in the European Community, Rev. 2.1 (NACE Rev. 2.1)
Notation: 65.3
top concept of: Statistical Classification of Economic Activities in the European Community, Rev. 2.1 (NACE Rev. 2.1)

Service activities incidental to water transportation
type: Concept
Additional Content Note: This class also includes: - ensuring safety at waterway infrastructure maintenance work - liquefaction and regasification of natural gas for the purpose of water transport done off the mine site
CoreContentNote: This class includes: - activities related to the water transport of passengers, animals or freight: • operation of terminal facilities (e.g. harbours, piers) • operation of waterway locks, etc. • navigation, pilotage, tug and berthing activities • bunkering and reception of port waste • lighterage, salvage activities • lighthouse activities • marine cargo surveying activities - waterway information services - winter storage of ships and boats
Exclusion Note: This class excludes: - dredging and waterway maintenance, see 42.91 - cargo handling, see 52.24 - amusement and recreation activities related to the infrastructure of marinas, see 93.29
broader: Support activities for transportation
in scheme: Statistical Classification of Economic Activities in the European Community, Rev. 2.1 (NACE Rev. 2.1)
Notation: 52.22
top concept of: Statistical Classification of Economic Activities in the European Community, Rev. 2.1 (NACE Rev. 2.1)

Comment

Intermediation service activities for rental and leasing of other tangible goods and non-financial intangible assets
type: Concept
CoreContentNote: This class includes the intermediation of the rental and leasing of other tangible goods and non-financial intangible assets, by bringing clients and service providers together for a fee or commission, without the intermediary providing the rental and leasing services that are intermediated. These intermediation activities can be carried out on digital platforms or through non-digital channels (including face-to-face, door-to-door, telephone, mail, and so on). The fee or commission can be received from either the client or the provider of the rental and leasing service. Revenue for the intermediation activities can include other sources of income (for example, revenues from the sale of advertising space). This class includes: - providing intermediation between households that offer their goods for rental and households renting the goods (e.g. lawn mowers, ladders, bicycles)
Exclusion Note: This class excludes: - rental and leasing of personal and household goods, see 77.2 - units that have ownership of other machinery, equipment and tangible goods and/or non-financial intangible assets ultimately rented and leased, see 77.3, 77.40
broader: Intermediation service activities for rental and leasing of tangible goods and non-financial intangible assets
in scheme: Statistical Classification of Economic Activities in the European Community, Rev. 2.1 (NACE Rev. 2.1)
Notation: 77.52
top concept of: Statistical Classification of Economic Activities in the European Community, Rev. 2.1 (NACE Rev. 2.1)

Support services to forestry
type: Concept
CoreContentNote: This class includes carrying out part of the forestry operation on a fee or contract basis. This class includes: - forestry service activities: • forestry inventories • forest management consulting services • timber evaluation • forest fire fighting and prevention • forest pest control - logging service activities: • transport of logs within the forest
Exclusion Note: This class excludes: - operation of forest tree nurseries, see 02.10 - draining of forestry land, see 43.12 - clearing of building sites, see 43.12
broader: Support services to forestry
in scheme: Statistical Classification of Economic Activities in the European Community, Rev. 2.1 (NACE Rev. 2.1)
Notation: 02.40
top concept of: Statistical Classification of Economic Activities in the European Community, Rev. 2.1 (NACE Rev. 2.1)

Undifferentiated goods- and service-producing activities of private households for own use
type: Concept
CoreContentNote: This division includes the undifferentiated subsistence goods-producing and services-producing activities of households. Households should be classified here only if it is impossible to identify a primary activity for the subsistence activities of the household. If the household engages in market activities, it should be classified according to the primary market activity carried out.
broader: ACTIVITIES OF HOUSEHOLDS AS EMPLOYERS AND UNDIFFERENTIATED GOODS - AND SERVICE-PRODUCING ACTIVITIES OF HOUSEHOLDS FOR OWN USE
in scheme: Statistical Classification of Economic Activities in the European Community, Rev. 2.1 (NACE Rev. 2.1)
Notation: 98
top concept of: Statistical Classification of Economic Activities in the European Community, Rev. 2.1 (NACE Rev. 2.1)

ConceptNoneRandom0.4919419582619444
type: ConceptAssociation
description: NACE Rev. 2.1 class 79.12 is mapped to NACE Rev. 2 class 79.12
Type: 1:1
Source Concept: Tour operator activities
Target Concept: http://data.europa.eu/ux2/nace2/7912
in scheme: Statistical Classification of Economic Activities in the European Community, Rev. 2.1 (NACE Rev. 2.1)
scope note: the content of the NACE Rev 2.1 class is fully covered in the corresponding NACE Rev 2 class
top concept of: Statistical Classification of Economic Activities in the European Community, Rev. 2.1 (NACE Rev. 2.1)
Mapping Cardinality: 1 1

Water transport
type: Concept
CoreContentNote: This division includes the water transport of passengers or freight, whether scheduled or not, whether for professional, personal or recreational reasons. Also included are the operation of towing or pushing boats, excursion or sightseeing boats, cruise ships, ferries, water taxis, and so on. Although the location is an indicator for the separation between sea and inland water transport, the deciding factor is the type of vessel used. Transport on seagoing vessels is classified in groups 50.1 and 50.2, while transport using other vessels is classified in groups 50.3 and 50.4.
Exclusion Note: This division excludes restaurant and bar activities aboard ships, if carried out by separate units, see 56.11, 56.30.
broader: TRANSPORTATION AND STORAGE
in scheme: Statistical Classification of Economic Activities in the European Community, Rev. 2.1 (NACE Rev. 2.1)
Notation: 50
top concept of: Statistical Classification of Economic Activities in the European Community, Rev. 2.1 (NACE Rev. 2.1)

Repair and maintenance of electrical equipment
type: Concept
Additional Content Note: This class also includes: - repair and maintenance of charging facilities for cars
CoreContentNote: This class includes the repair and maintenance of goods of division 27. This class includes: - repair and maintenance of power, distribution, and specialty transformers - repair and maintenance of electric motors, generators and motor generator sets - repair and maintenance of switchgear and switchboard apparatus - repair and maintenance of relays and industrial controls - repair and maintenance of primary and storage batteries - repair and maintenance of electric lighting equipment - repair and maintenance of current-carrying wiring devices and non-current-carrying wiring devices for wiring electrical circuits
Exclusion Note: This class excludes: - repair and maintenance of electric motors for boats, motor vehicles and motorcycles, see 33.15, 95.31, 95.32 - repair and maintenance of computers and peripheral computer equipment, see 95.10 - repair and maintenance of telecommunication equipment, see 95.10 - repair and maintenance of consumer electronics, see 95.21 - repair and maintenance of domestic appliances, see 95.22 - repair of watches and clocks, see 95.25
broader: Repair and maintenance of fabricated metal products, machinery and equipment
in scheme: Statistical Classification of Economic Activities in the European Community, Rev. 2.1 (NACE Rev. 2.1)
Notation: 33.14
top concept of: Statistical Classification of Economic Activities in the European Community, Rev. 2.1 (NACE Rev. 2.1)

ConceptNoneRandom0.6887047660966742
type: ConceptAssociation
description: NACE Rev. 2.1 class 47.51 is mapped to NACE Rev. 2 classes 47.51, 47.82, 47.91, 47.99
Type: 78:65
Source Concept: Retail sale of textiles
Target Concept: http://data.europa.eu/ux2/nace2/4791
Target Concept: http://data.europa.eu/ux2/nace2/4782
Target Concept: http://data.europa.eu/ux2/nace2/4799
Target Concept: http://data.europa.eu/ux2/nace2/4751
in scheme: Statistical Classification of Economic Activities in the European Community, Rev. 2.1 (NACE Rev. 2.1)
scope note: 47.51: - retail sale of fabrics - retail sale of knitting yarn - retail sale of basic materials for rug, tapestry or embroidery making - retail sale of textiles - retail sale of haberdashery: needles, sewing thread etc. - retail sale of tarpaulins - retail sale of bedlinen 47.82: - retail sale via stalls and markets of fabrics - retail sale via stalls and markets of knitting yarn - retail sale via stalls and markets of basic materials for rug, tapestry or embroidery making - retail sale via stalls and markets of textiles - retail sale via stalls and markets of haberdashery: needles, sewing thread etc. - retail sale via stalls and markets of tarpaulins - retail sale via stalls and markets of bedlinen 47.91: - retail sale via mail order houses or via Internet of fabrics - retail sale via mail order houses or via Internet of knitting yarn - retail sale via mail order houses or via Internet of basic materials for rug, tapestry or embroidery making - retail sale via mail order houses or via Internet of textiles - retail sale via mail order houses or via Internet of haberdashery: needles, sewing thread etc. - retail sale via mail order houses or via Internet of tarpaulins - retail sale via mail order houses or via Internet of bedlinen 47.99: - retail sale not in stores, stalls or markets of fabrics - retail sale not in stores, stalls or markets of knitting yarn - retail sale not in stores, stalls or markets of basic materials for rug, tapestry or embroidery making - retail sale not in stores, stalls or markets of textiles - retail sale not in stores, stalls or markets of haberdashery: needles, sewing thread etc. - retail sale not in stores, stalls or markets of tarpaulins - retail sale not in stores, stalls or markets of bedlinen
top concept of: Statistical Classification of Economic Activities in the European Community, Rev. 2.1 (NACE Rev. 2.1)
Mapping Cardinality: n m

Statistical Classification of Economic Activities in the European Community, Rev. 2.1 (NACE Rev. 2.1)
type: ConceptScheme
description: NACE Rev.2.1 is the classification of economic activities corresponding to ISIC Rev. 4 at European level. Though more disaggregated than ISIC Rev. 4, NACE Rev. 2.1 is completely in line with it and can thus be regarded as its European version. Since the national economic structures vary considerably, there are economic activities appearing in NACE Rev. 2.1 which are not of importance or do not occur in all Member States (e.g. categories referring to agriculture, mining and quarrying, manufacture of spacecraft, etc). The NACE Rev. 2.1 Regulation allows the Member States to use a national version derived from NACE Rev. 2.1 for national purposes. Such national versions must, however, fit into the structural and hierarchical framework laid down by NACE Rev. 2.1.
Referenced By: NACE Rev. 2.1 – NACE Rev. 2 Correspondence Table
Relation: ks-gq-24-007
Relation: nace
Belongs To: nace
Covers: http://eurovoc.europa.eu/4006
Covers: http://eurovoc.europa.eu/4256
Covers: http://eurovoc.europa.eu/5992
Covers: http://eurovoc.europa.eu/2066
Follows: nace2
Levels: NACE - Level 2 - Divisions
Levels: NACE - Level 4 - Classes
Levels: NACE - Level 3 - Groups
Levels: NACE - Level 1 - Sections
Number Of Levels: 4
version info: 1.1
alternative label: NACE Rev. 2.1
has top concept: Manufacture of footwear
has top concept: ConceptNoneRandom0.5832384261841402
has top concept: ConceptNoneRandom0.408508542933557
has top concept: Landfilling or permanent storage
has top concept: ConceptNoneRandom0.6593574982681666
has top concept: ConceptNoneRandom0.9383993829266267
has top concept: Defence activities
has top concept: ConceptNoneRandom0.8278420058266468
has top concept: ConceptNoneRandom0.7117100645333494
has top concept: Manufacture of rubber products
has top concept: ConceptNoneRandom0.164907077601395
has top concept: ConceptNoneRandom0.04468651872263807
has top concept: Activities of brokers and agents for electric power and natural gas
has top concept: Motion picture, video and television programme production, sound recording and music publishing activities
has top concept: Wired, wireless, and satellite telecommunication activities
has top concept: ConceptNoneRandom0.02260577568165334
has top concept: Marine aquaculture
has top concept: Publishing activities
has top concept: PUBLIC ADMINISTRATION AND DEFENCE; COMPULSORY SOCIAL SECURITY
has top concept: Manufacture of food products
has top concept: ConceptNoneRandom0.5322982347501154
has top concept: Incineration without energy recovery
has top concept: ConceptNoneRandom0.7462938483168031
has top concept: ConceptNoneRandom0.3395638377441048
has top concept: ConceptNoneRandom0.42366199714143404
has top concept: ConceptNoneRandom0.523425368583103
has top concept: Justice and judicial activities
has top concept: ConceptNoneRandom0.7948352172072674
has top concept: ConceptNoneRandom0.2933619334587799
has top concept: ConceptNoneRandom0.7826106466106114
has top concept: ConceptNoneRandom0.1671501937003399
has top concept: Travel agency and tour operator activities
has top concept: ConceptNoneRandom0.646442817019237
has top concept: ConceptNoneRandom0.7623959989680076
has top concept: Manufacture of plastic products
has top concept: ConceptNoneRandom0.9814461328268329
has top concept: ConceptNoneRandom0.1595831686319944
has top concept: ConceptNoneRandom0.010357390645876818
has top concept: Mining of chemical and fertiliser minerals
has top concept: Freshwater aquaculture
has top concept: Manufacture of beverages
has top concept: Manufacture of other special-purpose machinery n.e.c.
has top concept: EDUCATION
has top concept: Hairdressing and barber activities
has top concept: ConceptNoneRandom0.36069656635656633
has top concept: ConceptNoneRandom0.7947813304969903
has top concept: ConceptNoneRandom0.9138462749058965
has top concept: ConceptNoneRandom0.46503484364943726
has top concept: ConceptNoneRandom0.04007362231905287
has top concept: ConceptNoneRandom0.9153294268185227
has top concept: ConceptNoneRandom0.6314155420208467
has top concept: ConceptNoneRandom0.3385874753919539
has top concept: Driving school activities
has top concept: ConceptNoneRandom0.7528261557018736
has top concept: Manufacture of gas, and distribution of gaseous fuels through mains
has top concept: Manufacture of optical instruments, magnetic and optical media and photographic equipment
has top concept: Manufacture of tobacco products
has top concept: HUMAN HEALTH AND SOCIAL WORK ACTIVITIES
has top concept: ConceptNoneRandom0.7900448416920656
has top concept: ConceptNoneRandom0.05024760281881657
has top concept: ConceptNoneRandom0.9502296257799997

Intermediation service activities for specialised construction services
type: Concept
broader: Specialised construction activities
in scheme: Statistical Classification of Economic Activities in the European Community, Rev. 2.1 (NACE Rev. 2.1)
Notation: 43.6
top concept of: Statistical Classification of Economic Activities in the European Community, Rev. 2.1 (NACE Rev. 2.1)

Manufacture of air and spacecraft and related machinery
type: Concept
broader: Manufacture of other transport equipment
in scheme: Statistical Classification of Economic Activities in the European Community, Rev. 2.1 (NACE Rev. 2.1)
Notation: 30.3
top concept of: Statistical Classification of Economic Activities in the European Community, Rev. 2.1 (NACE Rev. 2.1)

ConceptNoneRandom0.0762386433877883
type: ConceptAssociation
description: NACE Rev. 2.1 class 22.23 is mapped to NACE Rev. 2 class 22.23
Type: 17:12
Source Concept: Manufacture of doors and windows of plastic
Target Concept: http://data.europa.eu/ux2/nace2/2223
in scheme: Statistical Classification of Economic Activities in the European Community, Rev. 2.1 (NACE Rev. 2.1)
scope note: the content of the NACE Rev 2.1 class is fully covered in the corresponding NACE Rev 2 class
top concept of: Statistical Classification of Economic Activities in the European Community, Rev. 2.1 (NACE Rev. 2.1)
Mapping Cardinality: n m

ConceptNoneRandom0.2773140471253689
type: ConceptAssociation
description: NACE Rev. 2.1 class 24.41 is mapped to NACE Rev. 2 class 24.41
Type: 1:1
Source Concept: Precious metals production
Target Concept: http://data.europa.eu/ux2/nace2/2441
in scheme: Statistical Classification of Economic Activities in the European Community, Rev. 2.1 (NACE Rev. 2.1)
scope note: the content of the NACE Rev 2.1 class is fully covered in the corresponding NACE Rev 2 class
top concept of: Statistical Classification of Economic Activities in the European Community, Rev. 2.1 (NACE Rev. 2.1)
Mapping Cardinality: 1 1

Residential care activities for persons living with or having a diagnosis of a mental illness or substance abuse
type: Concept
broader: Residential care activities
in scheme: Statistical Classification of Economic Activities in the European Community, Rev. 2.1 (NACE Rev. 2.1)
Notation: 87.2
top concept of: Statistical Classification of Economic Activities in the European Community, Rev. 2.1 (NACE Rev. 2.1)

Coating of metals
type: Concept
CoreContentNote: This class includes: - galvanising, including general (batch) hot-dip galvanising - phosphate or chromate conversion coating - cladding, electroplating, anodising, etc., of metals - colouring of metals - non-metallic coating of metals, e.g.: • powder or plastic coating, enamelling, lacquering
Exclusion Note: This class excludes: - activities of farriers, see 01.62 - printing onto metals, see 18.12 - metal coating of plastics, see 22.25 - cladding of base metals with a covering of silver, gold or platinum, see 24.41 - heat treatment of metals, see 25.52 - hardening of metals, see 25.52 - painting of metals on buildings and civil engineering structures, see 43.34 - ‘while-you-wait’ engraving services, see 95.29
broader: Treatment and coating of metals; machining
in scheme: Statistical Classification of Economic Activities in the European Community, Rev. 2.1 (NACE Rev. 2.1)
Notation: 25.51
top concept of: Statistical Classification of Economic Activities in the European Community, Rev. 2.1 (NACE Rev. 2.1)

Manufacture of other fabricated metal products n.e.c.
type: Concept
CoreContentNote: This class includes: - manufacture of metal household articles: • flatware: plates, saucers, etc. • hollowware: pots, kettles, etc. • dinnerware: bowls, platters, etc. • saucepans, frying pans and other non-electrical utensils for use at the table or in the kitchen • small hand-operated kitchen appliances and accessories • metal scouring pads - manufacture of building components of zinc: gutters, roof capping, baths, sinks, washbasins and similar articles - manufacture of metal goods for office use, except furniture - manufacture of safes, strongboxes, armoured doors, etc. - manufacture of various metal articles: • ship propellers and blades thereof • anchors • bells • assembled railway track fixtures • clasps, buckles, hooks • metal ladders • metal signs, including road signs - manufacture of foil bags - manufacture of permanent metallic magnets - manufacture of metal badges and metal military insignia - manufacture of metal hair curlers, metal umbrella handles and frames, combs
Exclusion Note: This class excludes: - manufacture of swords, bayonets, see 25.61 - manufacture of shopping carts, see 30.99 - manufacture of metal furniture, see 31.00 - manufacture of sports goods, see 32.30 - manufacture of games and toys, see 32.40
broader: Manufacture of other fabricated metal products
in scheme: Statistical Classification of Economic Activities in the European Community, Rev. 2.1 (NACE Rev. 2.1)
Notation: 25.99
top concept of: Statistical Classification of Economic Activities in the European Community, Rev. 2.1 (NACE Rev. 2.1)

Warehousing and storage
type: Concept
broader: Warehousing, storage and support activities for transportation
in scheme: Statistical Classification of Economic Activities in the European Community, Rev. 2.1 (NACE Rev. 2.1)
Notation: 52.1
top concept of: Statistical Classification of Economic Activities in the European Community, Rev. 2.1 (NACE Rev. 2.1)

Activities of extraterritorial organisations and bodies
type: Concept
broader: ACTIVITIES OF EXTRATERRITORIAL ORGANISATIONS AND BODIES
in scheme: Statistical Classification of Economic Activities in the European Community, Rev. 2.1 (NACE Rev. 2.1)
Notation: 99
top concept of: Statistical Classification of Economic Activities in the European Community, Rev. 2.1 (NACE Rev. 2.1)

Service activities incidental to air transportation
type: Concept
Additional Content Note: This class also includes: - firefighting and fire-prevention services at airports
CoreContentNote: This class includes: - activities related to the air transport of passengers, animals or freight: • operation of terminal facilities (e.g. airway terminals) • airport and air traffic control activities • ground service activities on airfields, etc. - ensuring safety at airfield infrastructure maintenance work - storage of aircraft
Exclusion Note: This class excludes: - cargo handling, see 52.24 - luggage and passenger inspection at airports, not by public authorities, see 80.01 - luggage and passenger inspection at airports, by public authorities, see 84.24 - operation of flying schools for professional pilots, see 85.32 - operation of flying schools not issuing certificates and permits for professionals, see 85.53
broader: Support activities for transportation
in scheme: Statistical Classification of Economic Activities in the European Community, Rev. 2.1 (NACE Rev. 2.1)
Notation: 52.23
top concept of: Statistical Classification of Economic Activities in the European Community, Rev. 2.1 (NACE Rev. 2.1)

Intermediation service activities for rental and leasing of cars, motorhomes and trailers
type: Concept
Additional Content Note: This class also includes: - reservation services for car rentals
CoreContentNote: This class includes the intermediation of the rental and leasing of passenger cars, motorhomes, motorcycles, caravans, and so on by bringing clients and service providers together for a fee or commission, without the intermediary providing the rental and leasing services that are intermediated. These intermediation activities can be carried out on digital platforms or through non-digital channels (including face-to-face, door-to-door, telephone, mail, and so on). The fee or commission can be received from either the client or the provider of the rental and leasing service. Revenue for the intermediation activities can include other sources of income (for example, revenues from the sale of advertising space).
Exclusion Note: This class excludes: - rental of light motor vehicles, see 77.11 - rental of heavy motor vehicles (e.g. motorhomes), see 77.12 - rental of caravans, see 77.39
broader: Intermediation service activities for rental and leasing of tangible goods and non-financial intangible assets
in scheme: Statistical Classification of Economic Activities in the European Community, Rev. 2.1 (NACE Rev. 2.1)
Notation: 77.51
top concept of: Statistical Classification of Economic Activities in the European Community, Rev. 2.1 (NACE Rev. 2.1)

Air transport
type: Concept
CoreContentNote: This division includes the transport of passengers or freight by air or via space.
Exclusion Note: This division excludes: - crop spraying, see 01.61 - repair and maintenance of civilian aircraft or aircraft engines, see 33.16 - operation of airports, see 52.23 - aerial advertising (skywriting), see 73.11 - aerial photography, see 74.20 - civil aerial surveillance, see 80.09 - military aerial surveillance, see 84.22
broader: TRANSPORTATION AND STORAGE
in scheme: Statistical Classification of Economic Activities in the European Community, Rev. 2.1 (NACE Rev. 2.1)
Notation: 51
top concept of: Statistical Classification of Economic Activities in the European Community, Rev. 2.1 (NACE Rev. 2.1)

Repair and maintenance of electronic and optical equipment
type: Concept
CoreContentNote: This class includes the repair and maintenance of goods produced in groups 26.5, 26.6 and 26.7, except those that are considered household goods. This class includes: - repair and maintenance of the measuring, testing, navigating and control equipment of group 26.5, e.g.: • aircraft engine instruments • automotive emissions testing equipment • meteorological instruments • physical, electrical and chemical properties testing and inspection equipment • surveying instruments • radiation detection and monitoring instruments - repair and maintenance of irradiation, electromedical and electrotherapeutic equipment of class 26.60, e.g.: • magnetic resonance imaging (MRI) equipment • medical ultrasound equipment • pacemakers • hearing aids • electrocardiographs • electromedical endoscopic equipment • irradiation apparatus - repair and maintenance of optical instruments and equipment of class 26.70, if the use is mainly commercial, e.g.: • binoculars • microscopes (except electron and proton microscopes) • telescopes • prisms and lenses (except ophthalmic) • photographic equipment
Exclusion Note: This class excludes: - repair and maintenance of photocopy machines, see 33.12 - repair and maintenance of computers and peripheral equipment, see 95.10 - repair and maintenance of computer projectors, see 95.10 - repair and maintenance of communication equipment, see 95.10 - repair and maintenance of commercial television and video cameras, see 95.10 - repair of household-type video cameras, see 95.21 - repair of watches and clocks, see 95.25
broader: Repair and maintenance of fabricated metal products, machinery and equipment
in scheme: Statistical Classification of Economic Activities in the European Community, Rev. 2.1 (NACE Rev. 2.1)
Notation: 33.13
top concept of: Statistical Classification of Economic Activities in the European Community, Rev. 2.1 (NACE Rev. 2.1)

Covers

ConceptNoneRandom0.545258343659805
type: ConceptAssociation
description: NACE Rev. 2.1 class 47.52 is mapped to NACE Rev. 2 classes 47.52, 47.59, 47.89, 47.91, 47.99
Type: 78:65
Source Concept: Retail sale of hardware, building materials, paints and glass
Target Concept: http://data.europa.eu/ux2/nace2/4791
Target Concept: http://data.europa.eu/ux2/nace2/4759
Target Concept: http://data.europa.eu/ux2/nace2/4799
Target Concept: http://data.europa.eu/ux2/nace2/4789
Target Concept: http://data.europa.eu/ux2/nace2/4752
in scheme: Statistical Classification of Economic Activities in the European Community, Rev. 2.1 (NACE Rev. 2.1)
scope note: 47.52: - retail sale of hardware - retail sale of paints, varnishes and lacquers - retail sale of solvents, white spirit and other drugstore products - retail sale of flat glass - retail sale of other building material, e.g. bricks, tiles, breezeblock, wood, floor boards, insulation material - retail sale of sanitary and heating equipment - retail sale of do-it-yourself material, electrical and plumbing material and equipment - retail sale of tools, e.g. hammers, saws, screwdrivers and other hand tools, including power hand tools - retail sale of renewable energy materials, e.g. non-electric solar collectors and photovoltaic panels, without installation - retail sale of doors and windows and shutters of any material - retail sale of garden and landscaping equipment, e.g. lawnmowers - retail sale of saunas, swimming pools and spas, including in kits etc., without installation 47.59: - retail sale of electrical or electronic fire alarms, fire extinguishers, emergency blocks, smoke extraction system, safes, and vaults, without installation or maintenance services 47.89: Retail sale via stalls and markets of: - hardware - paints, varnishes and lacquers - solvents, white spirit and other drugstore products - flat glass - other building material, e.g. bricks, tiles, breezeblock, wood, floor boards, insulation material - sanitary and heating equipment - do-it-yourself material, electrical and plumbing material and equipment - tools, e.g. hammers, saws, screwdrivers and other hand tools, including power hand tools - renewable energy materials, e.g. non-electric solar collectors and photovoltaic panels, without installation - electrical or electronic fire alarms, fire extinguishers, emergency blocks, smoke extraction system, safes, and vaults, without installation or maintenance services - doors and windows and shutters of any material - garden and landscaping equipment, e.g. lawnmowers - saunas, swimming pools and spas, including in kits etc., without installation 47.91: - …
top concept of: Statistical Classification of Economic Activities in the European Community, Rev. 2.1 (NACE Rev. 2.1)
Mapping Cardinality: n m

ConceptNoneRandom0.37824917351746046
type: ConceptAssociation
description: NACE Rev. 2.1 group 96.3 is mapped to NACE Rev. 2 group 96.0
Type: 26:18
Source Concept: Funeral and related activities
Target Concept: http://data.europa.eu/ux2/nace2/960
in scheme: Statistical Classification of Economic Activities in the European Community, Rev. 2.1 (NACE Rev. 2.1)
top concept of: Statistical Classification of Economic Activities in the European Community, Rev. 2.1 (NACE Rev. 2.1)
Mapping Cardinality: n m

ConceptNoneRandom0.5947280525262777
type: ConceptAssociation
description: NACE Rev. 2.1 class 01.30 is mapped to NACE Rev. 2 class 01.30
Type: 1:1
Source Concept: Plant propagation
Target Concept: http://data.europa.eu/ux2/nace2/0130
in scheme: Statistical Classification of Economic Activities in the European Community, Rev. 2.1 (NACE Rev. 2.1)
scope note: the content of the NACE Rev 2.1 class is fully covered in the corresponding NACE Rev 2 class
top concept of: Statistical Classification of Economic Activities in the European Community, Rev. 2.1 (NACE Rev. 2.1)
Mapping Cardinality: 1 1

ConceptNoneRandom0.5370762785722869
type: ConceptAssociation
description: NACE Rev. 2.1 group 61.2 is mapped to NACE Rev. 2 groups 61.9, 82.9
Type: 42:34
Source Concept: Telecommunication reselling activities and intermediation service activities for telecommunication
Target Concept: http://data.europa.eu/ux2/nace2/619
Target Concept: http://data.europa.eu/ux2/nace2/829
in scheme: Statistical Classification of Economic Activities in the European Community, Rev. 2.1 (NACE Rev. 2.1)
top concept of: Statistical Classification of Economic Activities in the European Community, Rev. 2.1 (NACE Rev. 2.1)
Mapping Cardinality: n m

Insurance
type: Concept
Additional Content Note: This group also includes captive insurance activities.
CoreContentNote: This group includes life insurance with or without a substantial savings element and non-life insurance. This group includes: - life insurance and life reinsurance with or without a substantial savings element and other non-life insurance - activities of insurance providers on own account - pooling and assuming insurance risks
Exclusion Note: This group excludes: - selling of insurance as a broker, see 66.22
broader: Insurance, reinsurance and pension funding, except compulsory social security
in scheme: Statistical Classification of Economic Activities in the European Community, Rev. 2.1 (NACE Rev. 2.1)
Notation: 65.1
top concept of: Statistical Classification of Economic Activities in the European Community, Rev. 2.1 (NACE Rev. 2.1)

Manufacture of bricks, tiles and construction products, in baked clay
type: Concept
CoreContentNote: This class includes: - manufacture of structural non-refractory ceramic articles, obtained by firing clay building materials (e.g. ceramic bricks, roofing tiles, chimney pots, pipes, conduits) - manufacture of flooring blocks in baked clay
Exclusion Note: This class excludes: - manufacture of refractory ceramic products, see 23.20 - manufacture of non-structural non-refractory ceramic products, see 23.4
broader: Manufacture of clay building materials
in scheme: Statistical Classification of Economic Activities in the European Community, Rev. 2.1 (NACE Rev. 2.1)
Notation: 23.32
top concept of: Statistical Classification of Economic Activities in the European Community, Rev. 2.1 (NACE Rev. 2.1)

ConceptNoneRandom0.32229987698291196
type: ConceptAssociation
description: NACE Rev. 2.1 group 30.9 is mapped to NACE Rev. 2 groups 28.1, 30.9
Type: 18:19
Source Concept: Manufacture of transport equipment n.e.c.
Target Concept: http://data.europa.eu/ux2/nace2/309
Target Concept: http://data.europa.eu/ux2/nace2/281
in scheme: Statistical Classification of Economic Activities in the European Community, Rev. 2.1 (NACE Rev. 2.1)
top concept of: Statistical Classification of Economic Activities in the European Community, Rev. 2.1 (NACE Rev. 2.1)
Mapping Cardinality: n m

Building completion and finishing
type: Concept
broader: Specialised construction activities
in scheme: Statistical Classification of Economic Activities in the European Community, Rev. 2.1 (NACE Rev. 2.1)
Notation: 43.3
top concept of: Statistical Classification of Economic Activities in the European Community, Rev. 2.1 (NACE Rev. 2.1)

Cargo handling
type: Concept
Additional Content Note: This class also includes: - rental and leasing of transtainers or luffing cranes, with an operator, for cargo handling activities - moving cargos on industrial sites, typically with transport equipment that is not suitable for use on roads open to public traffic
CoreContentNote: This class includes: - loading and unloading of goods and luggage irrespective of the mode of transport used - stevedoring - loading and unloading of freight railway cars
Exclusion Note: This class excludes: - transport or moving of objects within an industrial plant, on a fee or contract basis, if a public road is used, see 49.41 - operation of terminal facilities, see 52.21, 52.22, 52.23 - intermediation service activities for freight transport, see 52.31
broader: Support activities for transportation
in scheme: Statistical Classification of Economic Activities in the European Community, Rev. 2.1 (NACE Rev. 2.1)
Notation: 52.24
top concept of: Statistical Classification of Economic Activities in the European Community, Rev. 2.1 (NACE Rev. 2.1)

Warehousing, storage and support activities for transportation
type: Concept
CoreContentNote: This division includes warehousing and support activities for transport, such as the operation of transport infrastructure (for example, airports, harbours, tunnels, bridges). It also includes the activities of transport agencies and cargo handling. The activities mentioned are carried out on behalf of third parties. If the related services are provided solely to support transport activities by the same unit, they are considered as ancillary activities to transport and this unit is classified elsewhere in section H.
broader: TRANSPORTATION AND STORAGE
in scheme: Statistical Classification of Economic Activities in the European Community, Rev. 2.1 (NACE Rev. 2.1)
Notation: 52
top concept of: Statistical Classification of Economic Activities in the European Community, Rev. 2.1 (NACE Rev. 2.1)

Steam and air conditioning supply
type: Concept
Additional Content Note: This class also includes: - storage of thermal energy
CoreContentNote: This class includes: - production, collection and distribution of steam and hot water for heating, power and other purposes - production and distribution of cooled air (e.g. for air conditioning supply) - production and distribution of chilled water for cooling purposes - production of ice from natural water for cooling purposes
Exclusion Note: This class excludes: - manufacturing of edible ice, see 10.52 - production of heat/steam by conversion of waste materials, see 38.22
broader: Steam and air conditioning supply
in scheme: Statistical Classification of Economic Activities in the European Community, Rev. 2.1 (NACE Rev. 2.1)
Notation: 35.30
top concept of: Statistical Classification of Economic Activities in the European Community, Rev. 2.1 (NACE Rev. 2.1)

Repair and maintenance of machinery
type: Concept
CoreContentNote: This class includes the repair and maintenance of industrial and commercial machinery and equipment (for example, sharpening or installing machinery blades and saws); the provision of welding (for example, automotive, general) repair services; the repair of agricultural and other heavy and industrial machinery and equipment (for example, forklifts and other materials handling equipment, machine tools, commercial refrigeration equipment, construction equipment and mining machinery), including machinery and equipment of division 28. This class includes: - repair and maintenance of engines, except for motor vehicles, ships, boats and aircraft - repair and maintenance of railway engines - repair and maintenance of pumps, compressors and related equipment - repair and maintenance of fluid power machinery - repair of valves - repair of gearing and driving elements - repair and maintenance of industrial process furnaces - repair and maintenance of lifting and handling equipment - repair and maintenance of industrial refrigeration equipment and air-purifying equipment - repair and maintenance of commercial-type general-purpose machinery - repair of power-driven hand tools - repair and maintenance of metal-cutting and metal-forming machine tools and accessories - repair and maintenance of other machine tools - repair and maintenance of agricultural and forestry tractors - repair and maintenance of agricultural machinery, forestry and logging machinery - repair and maintenance of metallurgy machinery - repair and maintenance of machinery for mining, construction, oilfields and gas fields - repair and maintenance of food, beverage and tobacco processing machinery - repair and maintenance of textile apparel and leather production machinery - repair and maintenance of papermaking machinery - repair and maintenance of plastic and rubber machinery - repair and maintenance of other special-purpose machinery of division 28 - repair and maintenance of weighing equipment - repair and …
Exclusion Note: This class excludes: - repair and maintenance of civilian ship and boat engines, see 33.15 - repair and maintenance of civilian aircraft engines, see 33.16 - repair and maintenance of engines for military fighting vehicles, ships, boats, air and spacecraft, see 33.18 - installation, repair and maintenance of furnaces and other heating equipment, see 43.22 - installation, repair and maintenance of elevators and escalators, see 43.24 - repair and maintenance of computers, see 95.10 - repair and maintenance of engines for motor vehicles, see 95.31
broader: Repair and maintenance of fabricated metal products, machinery and equipment
in scheme: Statistical Classification of Economic Activities in the European Community, Rev. 2.1 (NACE Rev. 2.1)
Notation: 33.12
top concept of: Statistical Classification of Economic Activities in the European Community, Rev. 2.1 (NACE Rev. 2.1)

ConceptNoneRandom0.16015739631669756
type: ConceptAssociation
description: NACE Rev. 2.1 class 46.64 is mapped to NACE Rev. 2 classes 46.43, 46.64, 46.69
Type: 3:4
Source Concept: Wholesale of other machinery and equipment
Target Concept: http://data.europa.eu/ux2/nace2/4669
Target Concept: http://data.europa.eu/ux2/nace2/4643
Target Concept: http://data.europa.eu/ux2/nace2/4664
in scheme: Statistical Classification of Economic Activities in the European Community, Rev. 2.1 (NACE Rev. 2.1)
scope note: 46.43: - wholesale of batteries and accumulators for domestic use 46.64: - wholesale of machinery for the textile industry and of sewing and knitting machines 46.69: - wholesale of robots for production lines - wholesale of machinery for food, beverages and tobacco industry - wholesale of transport equipment, e.g. locomotives, wagons, except motor vehicles, motorcycles and bicycles - wholesale of ships and boats - wholesale of armoured vehicles - wholesale of aircrafts, drones and unmanned aircraft systems - wholesale of equipment for fish farming - wholesale of attractions for amusement and theme parks, e.g. mechanical rides - wholesale of equipment for hairdressers, gyms, solariums and beauty centres - wholesale of event technology equipment for events, fairs and exhibitions - wholesale of other machinery n.e.c. for use in industry, trade and navigation and other services - wholesale of other electrical material, e.g. electrical motors, transformers - wholesale of wires and switches and other installation equipment - wholesale of photovoltaic panels - wholesale of weapons, weapon systems and ammunition - wholesale for box pallets - wholesale of reservoirs, tanks, vats and similar containers, capacity > 300 l, of plastics, for industrial use - wholesale of measuring instruments and equipment - wholesale of machines for additive manufacturing (3D printers etc.)
top concept of: Statistical Classification of Economic Activities in the European Community, Rev. 2.1 (NACE Rev. 2.1)
Mapping Cardinality: n m

ConceptNoneRandom0.5433799130723554
type: ConceptAssociation
description: NACE Rev. 2.1 class 43.13 is mapped to NACE Rev. 2 class 43.13
Type: 1:1
Source Concept: Test drilling and boring
Target Concept: http://data.europa.eu/ux2/nace2/4313
in scheme: Statistical Classification of Economic Activities in the European Community, Rev. 2.1 (NACE Rev. 2.1)
scope note: the content of the NACE Rev 2.1 class is fully covered in the corresponding NACE Rev 2 class
top concept of: Statistical Classification of Economic Activities in the European Community, Rev. 2.1 (NACE Rev. 2.1)
Mapping Cardinality: 1 1

Manufacture of other textiles n.e.c.
type: Concept
CoreContentNote: This class includes: - manufacture of felt - manufacture of tulles and other net fabrics, of lace and embroidery, in the piece, in strips or in motifs - manufacture of pressure-sensitive cloth-tape - manufacture of shoelaces, of textiles - manufacture of net and window furnishing type fabrics of lace
Exclusion Note: This class excludes: - manufacture of needle-loom felt floor coverings, see 13.93 - manufacture of textile wadding and articles of wadding: sanitary towels, tampons, etc., see 17.22
broader: Manufacture of other textiles
in scheme: Statistical Classification of Economic Activities in the European Community, Rev. 2.1 (NACE Rev. 2.1)
Notation: 13.99
top concept of: Statistical Classification of Economic Activities in the European Community, Rev. 2.1 (NACE Rev. 2.1)

ConceptNoneRandom0.09702785295611072
type: ConceptAssociation
description: NACE Rev. 2.1 class 82.30 is mapped to NACE Rev. 2 class 82.30
Type: 7:7
Source Concept: Organisation of conventions and trade shows
Target Concept: http://data.europa.eu/ux2/nace2/8230
in scheme: Statistical Classification of Economic Activities in the European Community, Rev. 2.1 (NACE Rev. 2.1)
scope note: the content of the NACE Rev 2.1 class is fully covered in the corresponding NACE Rev 2 class
top concept of: Statistical Classification of Economic Activities in the European Community, Rev. 2.1 (NACE Rev. 2.1)
Mapping Cardinality: n m

Activities of financing conduits
type: Concept
Additional Content Note: This class also includes: - activities of captive financial institutions involved in intragroup lending - brass plate companies engaged in raising funds and remitting those funds to their parent, i.e. units that are owned (directly or indirectly) by a non-resident unit, of which a large part of the balance sheet consists of claims and liabilities towards non-resident units, and that have few or no employees and little or no physical presence in the jurisdiction of incorporation
CoreContentNote: This class includes the activities of financing conduits, in other words, units created by a financial or non-financial group to raise or borrow funds (often on the open market) and to remit those funds to their parent or another entity within the group.
Exclusion Note: This class excludes: - management services of public funds and public debt, see 84.11
broader: Activities of holding companies and financing conduits
in scheme: Statistical Classification of Economic Activities in the European Community, Rev. 2.1 (NACE Rev. 2.1)
Notation: 64.22
top concept of: Statistical Classification of Economic Activities in the European Community, Rev. 2.1 (NACE Rev. 2.1)

Wholesale of solid, liquid and gaseous fuels and related products
type: Concept
CoreContentNote: This class includes: - wholesale of fossil, low-carbon or carbon-free fuels, greases, lubricants, oils, e.g.: • charcoal, coal, coke, fuelwood, pellets of wood or biomass, naphtha • crude petroleum, crude oil, diesel fuel, gasoline, fuel oil, heating oil, kerosene, biofuels, recycled carbon fuels, synthetic fuels, in blending or pure • liquefied petroleum gas (LPG), liquefied natural gas (LNG), butane and propane gas and their related bio and renewable forms, in blending or pure • lubricating oils and greases, refined petroleum products
Exclusion Note: This class excludes: - wholesale of hydrogen, see 46.85
broader: Other specialised wholesale
in scheme: Statistical Classification of Economic Activities in the European Community, Rev. 2.1 (NACE Rev. 2.1)
Notation: 46.81
top concept of: Statistical Classification of Economic Activities in the European Community, Rev. 2.1 (NACE Rev. 2.1)

ConceptNoneRandom0.5710211730665771
type: ConceptAssociation
description: NACE Rev. 2.1 class 22.21 is mapped to NACE Rev. 2 classes 22.21, 22.29
Type: 17:12
Source Concept: Manufacture of plastic plates, sheets, tubes and profiles
Target Concept: http://data.europa.eu/ux2/nace2/2229
Target Concept: http://data.europa.eu/ux2/nace2/2221
in scheme: Statistical Classification of Economic Activities in the European Community, Rev. 2.1 (NACE Rev. 2.1)
scope note: 22.21: - manufacture of semi-manufactures of plastic products: • plates, sheets, blocks, film, foil, strip, etc. - manufacture of finished plastic products: • tubes, pipes and hoses; hose and pipe fittings • cellophane film or sheet - manufacture of flexible or rigid plates and sheets of cellular polyurethane - manufacture of plastic plates, sheets, film, foil and strip, reinforced, laminated, supported or similarly combined with other materials - manufacture of self-adhesive plates, sheets, film, foil and strip of plastic 22.29: - manufacture of self-adhesive tapes of plastic
top concept of: Statistical Classification of Economic Activities in the European Community, Rev. 2.1 (NACE Rev. 2.1)
Mapping Cardinality: n m

ConceptNoneRandom0.7763687024333626
type: ConceptAssociation
description: NACE Rev. 2.1 class 27.90 is mapped to NACE Rev. 2 classes 27.90, 28.49
Type: 11:11
Source Concept: Manufacture of other electrical equipment
Target Concept: http://data.europa.eu/ux2/nace2/2849
Target Concept: http://data.europa.eu/ux2/nace2/2790
in scheme: Statistical Classification of Economic Activities in the European Community, Rev. 2.1 (NACE Rev. 2.1)
scope note: 27.90: - manufacture of miscellaneous electrical equipment other than motors, generators and transformers, batteries and accumulators, wires and wiring devices, lighting equipment or domestic appliances - manufacture of battery chargers, solid-state - manufacture of door opening and closing devices, electrical - manufacture of electric bells - manufacture of extension cords made from purchased insulated wire - manufacture of ultrasonic cleaning machines (except laboratory and dental) - manufacture of tanning beds - manufacture of fuel cells, regulated and unregulated power supplies - manufacture of uninterruptible power supplies (UPS) - manufacture of surge suppressors (except for distribution level voltage) - manufacture of appliance cords, extension cords, and other electrical cord sets with insulated wire and connectors - manufacture of carbon and graphite electrodes, contacts, and other electrical carbon and graphite products - manufacture of particle accelerators - manufacture of electrical capacitors, resistors, condensers and similar components - manufacture of electromagnets - manufacture of sirens - manufacture of electronic scoreboards - manufacture of electrical signs - manufacture of electrical signalling equipment such as traffic lights and pedestrian signalling equipment - manufacture of electrical insulators (except glass or porcelain) - manufacture of electrical welding and soldering equipment, including hand-held soldering irons - manufacture of on-board chargers for motor vehicles - manufacture of assembled cables, fitted with connectors - manufacture of charging facilities for cars 28.49: - manufacture of electroplating machinery
top concept of: Statistical Classification of Economic Activities in the European Community, Rev. 2.1 (NACE Rev. 2.1)
Mapping Cardinality: n m

ConceptNoneRandom0.4106227534155854
type: ConceptAssociation
description: NACE Rev. 2.1 group 96.4 is mapped to NACE Rev. 2 group 82.9
Type: 42:34
Source Concept: Intermediation service activities for personal services
Target Concept: http://data.europa.eu/ux2/nace2/829
in scheme: Statistical Classification of Economic Activities in the European Community, Rev. 2.1 (NACE Rev. 2.1)
top concept of: Statistical Classification of Economic Activities in the European Community, Rev. 2.1 (NACE Rev. 2.1)
Mapping Cardinality: n m

Manufacture of ceramic tiles and flags
type: Concept
CoreContentNote: This class includes: - manufacture of non-refractory ceramic hearth or wall tiles, mosaic cubes, etc. - manufacture of non-refractory ceramic flags and paving
Exclusion Note: This class excludes: - manufacture of refractory ceramic products, see 23.20 - manufacture of ceramic bricks and roofing tiles, see 23.32 - manufacture of artificial stone articles for use in construction, see 23.61
broader: Manufacture of clay building materials
in scheme: Statistical Classification of Economic Activities in the European Community, Rev. 2.1 (NACE Rev. 2.1)
Notation: 23.31
top concept of: Statistical Classification of Economic Activities in the European Community, Rev. 2.1 (NACE Rev. 2.1)

ConceptNoneRandom0.992192084963428
type: ConceptAssociation
description: NACE Rev. 2.1 group 87.9 is mapped to NACE Rev. 2 groups 82.9, 87.9
Type: 42:34
Source Concept: Other residential care activities
Target Concept: http://data.europa.eu/ux2/nace2/879
Target Concept: http://data.europa.eu/ux2/nace2/829
in scheme: Statistical Classification of Economic Activities in the European Community, Rev. 2.1 (NACE Rev. 2.1)
top concept of: Statistical Classification of Economic Activities in the European Community, Rev. 2.1 (NACE Rev. 2.1)
Mapping Cardinality: n m

Reinsurance
type: Concept
broader: Insurance, reinsurance and pension funding, except compulsory social security
in scheme: Statistical Classification of Economic Activities in the European Community, Rev. 2.1 (NACE Rev. 2.1)
Notation: 65.2
top concept of: Statistical Classification of Economic Activities in the European Community, Rev. 2.1 (NACE Rev. 2.1)

Specialised construction activities in construction of buildings
type: Concept
broader: Specialised construction activities
in scheme: Statistical Classification of Economic Activities in the European Community, Rev. 2.1 (NACE Rev. 2.1)
Notation: 43.4
top concept of: Statistical Classification of Economic Activities in the European Community, Rev. 2.1 (NACE Rev. 2.1)

Building of ships and boats
type: Concept
CoreContentNote: This group includes the building of ships, boats, yachts and other floating structures for transport and other commercial purposes, as well as for sport/recreational and military purposes.
broader: Manufacture of other transport equipment
in scheme: Statistical Classification of Economic Activities in the European Community, Rev. 2.1 (NACE Rev. 2.1)
Notation: 30.1
top concept of: Statistical Classification of Economic Activities in the European Community, Rev. 2.1 (NACE Rev. 2.1)

Postal activities under universal service obligation
type: Concept
CoreContentNote: This class includes the activities of postal services operating under a universal service obligation by one or more designated universal service providers. The activities include use of the universal service infrastructure, including retail sale locations, sorting and processing facilities, and carrier routes to pick up and deliver mail. The delivery can include letter post, in other words, letters, postcards, printed papers (newspapers, periodicals, advertising items, and so on), small packets, goods or documents. Also included are other services necessary to support the universal service obligation. This class includes: - pickup, sorting, transport and delivery (domestic (national) or international) of letter post and (mail-type) parcels and packages by postal services operating under a universal service obligation. One or more modes of transport may be involved and the activity may be carried out with either self-owned (private) transport or via public transport. - collection of letter-mail and parcels from public letter boxes or from post offices
Exclusion Note: This class excludes: - postal giro, postal savings activities and money order activities, see 64.19
broader: Postal activities under universal service obligation
in scheme: Statistical Classification of Economic Activities in the European Community, Rev. 2.1 (NACE Rev. 2.1)
Notation: 53.10
top concept of: Statistical Classification of Economic Activities in the European Community, Rev. 2.1 (NACE Rev. 2.1)

Logistics service activities
type: Concept
CoreContentNote: This class includes: - activities of distribution centres - pickup of goods and grouping for shipping - goods handling operations (e.g. temporary crating and packing goods into boxes for the purpose of warehousing or for protecting them during transport, unpacking, sampling, weighing of goods)
Exclusion Note: This class excludes: - freight forwarding, see 52.26 - ship brokerage – includes taking care of the entry and clearance of ships, as an intermediary between shipowners and shippers or receivers of goods, see 52.31 - courier activities, see 53.20 - provision of motor, marine, aviation and transport insurance, see 65.12 - management consultancy for companies’ logistics, see 70.20 - logistics consulting activities, i.e. planning, designing and supporting operations of transport, warehousing and distribution, see 70.20
broader: Support activities for transportation
in scheme: Statistical Classification of Economic Activities in the European Community, Rev. 2.1 (NACE Rev. 2.1)
Notation: 52.25
top concept of: Statistical Classification of Economic Activities in the European Community, Rev. 2.1 (NACE Rev. 2.1)

Postal and courier activities
type: Concept
broader: TRANSPORTATION AND STORAGE
in scheme: Statistical Classification of Economic Activities in the European Community, Rev. 2.1 (NACE Rev. 2.1)
Notation: 53
top concept of: Statistical Classification of Economic Activities in the European Community, Rev. 2.1 (NACE Rev. 2.1)

Repair and maintenance of fabricated metal products
type: Concept
CoreContentNote: This class includes the repair and maintenance of fabricated metal products of division 25. This class includes: - repair of metal tanks, reservoirs and containers - repair and maintenance for pipes and pipelines - mobile welding repair - repair of steel shipping drums - repair and maintenance of steam or other vapour generators - repair and maintenance of auxiliary plant for use with steam generators: • condensers, economisers, superheaters, steam collectors and accumulators - repair and maintenance of nuclear reactors, except isotope separators - repair and maintenance of parts for marine or power boilers - plate work repair of central heating boilers and radiators - repair and maintenance of firearms and ordnance, including repair of sporting and recreational guns
Exclusion Note: This class excludes: - sharpening of blades and saws, see 33.12 - repair and maintenance of shopping carts, see 33.17 - repair of central heating systems, etc., see 43.22 - repair of mechanical locking devices, safes, etc., see 80.09
broader: Repair and maintenance of fabricated metal products, machinery and equipment
in scheme: Statistical Classification of Economic Activities in the European Community, Rev. 2.1 (NACE Rev. 2.1)
Notation: 33.11
top concept of: Statistical Classification of Economic Activities in the European Community, Rev. 2.1 (NACE Rev. 2.1)

Intermediation service activities for retail sale
type: Concept
Additional Content Note: This group also includes: - activities of intermediaries in the retail sale of second-hand goods - activities of retail auctioneering houses for both new and used third-party goods, including internet retail auctions - activities of agents for the retail sale of motor vehicles and motorcycles
CoreContentNote: This group includes intermediation service activities for specialised and non-specialised retail sale that facilitate transactions between buyers and sellers of physical goods for a fee or commission, without supplying and taking ownership of the goods that are intermediated. These intermediation activities can be carried out on digital platforms or through non-digital channels (including face-to-face, door-to-door, telephone, mail, and so on). The fee or commission can be received from either the buyers or sellers. Revenue for intermediation service activities for retail sale can include other sources of income (for example, revenues from the sale of advertising space).
broader: Retail trade
in scheme: Statistical Classification of Economic Activities in the European Community, Rev. 2.1 (NACE Rev. 2.1)
Notation: 47.9
top concept of: Statistical Classification of Economic Activities in the European Community, Rev. 2.1 (NACE Rev. 2.1)

ConceptNoneRandom0.32881962442927015
type: ConceptAssociation
description: NACE Rev. 2.1 class 23.11 is mapped to NACE Rev. 2 class 23.11
Type: 1:1
Source Concept: Manufacture of flat glass
Target Concept: http://data.europa.eu/ux2/nace2/2311
in scheme: Statistical Classification of Economic Activities in the European Community, Rev. 2.1 (NACE Rev. 2.1)
scope note: the content of the NACE Rev 2.1 class is fully covered in the corresponding NACE Rev 2 class
top concept of: Statistical Classification of Economic Activities in the European Community, Rev. 2.1 (NACE Rev. 2.1)
Mapping Cardinality: 1 1

ConceptNoneRandom0.9626530458261845
type: ConceptAssociation
description: NACE Rev. 2.1 class 46.23 is mapped to NACE Rev. 2 class 46.23
Type: 1:1
Source Concept: Wholesale of live animals
Target Concept: http://data.europa.eu/ux2/nace2/4623
in scheme: Statistical Classification of Economic Activities in the European Community, Rev. 2.1 (NACE Rev. 2.1)
scope note: the content of the NACE Rev 2.1 class is fully covered in the corresponding NACE Rev 2 class
top concept of: Statistical Classification of Economic Activities in the European Community, Rev. 2.1 (NACE Rev. 2.1)
Mapping Cardinality: 1 1

ConceptNoneRandom0.14532896457679456
type: ConceptAssociation
description: NACE Rev. 2.1 class 24.44 is mapped to NACE Rev. 2 class 24.44
Type: 1:1
Source Concept: Copper production
Target Concept: http://data.europa.eu/ux2/nace2/2444
in scheme: Statistical Classification of Economic Activities in the European Community, Rev. 2.1 (NACE Rev. 2.1)
scope note: the content of the NACE Rev 2.1 class is fully covered in the corresponding NACE Rev 2 class
top concept of: Statistical Classification of Economic Activities in the European Community, Rev. 2.1 (NACE Rev. 2.1)
Mapping Cardinality: 1 1

Temporary employment agency activities and other human resource provisions
type: Concept
broader: Employment activities
in scheme: Statistical Classification of Economic Activities in the European Community, Rev. 2.1 (NACE Rev. 2.1)
Notation: 78.2
top concept of: Statistical Classification of Economic Activities in the European Community, Rev. 2.1 (NACE Rev. 2.1)

Wholesale of metals and metal ores
type: Concept
Additional Content Note: This class also includes: - wholesale of steel sheets on own account, including usual cutting operations associated with trade which do not include the production of new goods - wholesale of gold and other precious metals, purchased from households or enterprises and sold to retailers, to industrial, commercial, institutional or professional users, or to other wholesalers
CoreContentNote: This class includes: - wholesale of ferrous and non-ferrous metal ores - wholesale of ferrous and non-ferrous metals in primary forms - wholesale of gold and other precious metals - wholesale of semi-finished metal products and metal ores - wholesale of ferrous and non-ferrous semi-finished products n.e.c.
Exclusion Note: This class excludes: - wholesale of metal scrap, see 46.87 - gold bullion sales, see section L
broader: Other specialised wholesale
in scheme: Statistical Classification of Economic Activities in the European Community, Rev. 2.1 (NACE Rev. 2.1)
Notation: 46.82
top concept of: Statistical Classification of Economic Activities in the European Community, Rev. 2.1 (NACE Rev. 2.1)

Intermediation service activities for food and beverage services activities
type: Concept
broader: Food and beverage service activities
in scheme: Statistical Classification of Economic Activities in the European Community, Rev. 2.1 (NACE Rev. 2.1)
Notation: 56.4
top concept of: Statistical Classification of Economic Activities in the European Community, Rev. 2.1 (NACE Rev. 2.1)

ConceptNoneRandom0.8423578032716911
type: ConceptAssociation
description: NACE Rev. 2.1 group 96.9 is mapped to NACE Rev. 2 groups 81.2, 96.0
Type: 26:18
Source Concept: Other personal service activities
Target Concept: http://data.europa.eu/ux2/nace2/812
Target Concept: http://data.europa.eu/ux2/nace2/960
in scheme: Statistical Classification of Economic Activities in the European Community, Rev. 2.1 (NACE Rev. 2.1)
top concept of: Statistical Classification of Economic Activities in the European Community, Rev. 2.1 (NACE Rev. 2.1)
Mapping Cardinality: n m

Demolition and site preparation
type: Concept
CoreContentNote: This group includes activities of preparing a site for subsequent construction activities, including the removal of previously existing structures.
broader: Specialised construction activities
in scheme: Statistical Classification of Economic Activities in the European Community, Rev. 2.1 (NACE Rev. 2.1)
Notation: 43.1
top concept of: Statistical Classification of Economic Activities in the European Community, Rev. 2.1 (NACE Rev. 2.1)

ConceptNoneRandom0.7331957437457584
type: ConceptAssociation
description: NACE Rev. 2.1 class 58.21 is mapped to NACE Rev. 2 class 58.21
Type: 1:1
Source Concept: Publishing of video games
Target Concept: http://data.europa.eu/ux2/nace2/5821
in scheme: Statistical Classification of Economic Activities in the European Community, Rev. 2.1 (NACE Rev. 2.1)
scope note: the content of the NACE Rev 2.1 class is fully covered in the corresponding NACE Rev 2 class
top concept of: Statistical Classification of Economic Activities in the European Community, Rev. 2.1 (NACE Rev. 2.1)
Mapping Cardinality: 1 1

Plastering
type: Concept
CoreContentNote: This class includes: - application in buildings or other construction projects of interior and exterior plaster or stucco, including related lathing materials - dry-walling of walls and plastering of ceilings
broader: Building completion and finishing
in scheme: Statistical Classification of Economic Activities in the European Community, Rev. 2.1 (NACE Rev. 2.1)
Notation: 43.31
top concept of: Statistical Classification of Economic Activities in the European Community, Rev. 2.1 (NACE Rev. 2.1)

Packaging activities
type: Concept
CoreContentNote: This class includes: - packaging activities on a fee or contract basis, whether or not these involve an automated process: • bottling of liquid or gaseous goods, including beverages and food • packaging of solids (blister packaging, foil-covered, etc.) • security packaging of pharmaceutical preparations • labelling, stamping and imprinting • parcel packing and gift wrapping - product sterilisation associated with packaging
Exclusion Note: This class excludes: - manufacture of soft drinks and production of natural mineral waters, see 11.07 - packaging activities incidental to transport, see 52.26
broader: Business support service activities n.e.c.
in scheme: Statistical Classification of Economic Activities in the European Community, Rev. 2.1 (NACE Rev. 2.1)
Notation: 82.92
top concept of: Statistical Classification of Economic Activities in the European Community, Rev. 2.1 (NACE Rev. 2.1)

ConceptNoneRandom0.7365705174481154
type: ConceptAssociation
description: NACE Rev. 2.1 class 13.30 is mapped to NACE Rev. 2 classes 13.30, 18.12
Type: 4:5
Source Concept: Finishing of textiles
Target Concept: http://data.europa.eu/ux2/nace2/1330
Target Concept: http://data.europa.eu/ux2/nace2/1812
in scheme: Statistical Classification of Economic Activities in the European Community, Rev. 2.1 (NACE Rev. 2.1)
scope note: 13.30: - bleaching and dyeing of textile fibres, yarns, fabrics and textile articles, including wearing apparel - dressing, drying, steaming, shrinking, mending, sanforising, mercerising of textiles and textile articles, including wearing apparel - bleaching of jeans - pleating and similar work on textiles - waterproofing, coating, rubberising, or impregnating purchased garments 18.12: - printing of textile fabrics as an intermediate process in manufacture of textiles
top concept of: Statistical Classification of Economic Activities in the European Community, Rev. 2.1 (NACE Rev. 2.1)
Mapping Cardinality: n m

Other support activities for transportation
type: Concept
CoreContentNote: This class includes: - issue and procurement of transport documents and waybills - activities of customs agents - organisation of multimodal and combined transport activities by rail, road, water or air (intermodal transport) on behalf of the shipper or consignee - organisation and freight forwarding of group and individual consignments on behalf of the client
Exclusion Note: This class excludes: - rail, ship and aircraft freight brokerage, see 52.31 - operation of platforms for intermediation of freight transport, see 52.31 - brokerage for passenger seats for ship and aircraft space, see 52.32 - courier activities, see 53.20 - provision of motor, marine, aviation and transport insurance, see 65.12 - management consultancy for companies’ logistics, see 70.20 - activities of travel agencies, see 79.11 - activities of tour operators, see 79.12 - tourist assistance activities, see 79.90
broader: Support activities for transportation
in scheme: Statistical Classification of Economic Activities in the European Community, Rev. 2.1 (NACE Rev. 2.1)
Notation: 52.26
top concept of: Statistical Classification of Economic Activities in the European Community, Rev. 2.1 (NACE Rev. 2.1)

Activities of membership organisations
type: Concept
CoreContentNote: This division includes activities of organisations representing interests of special groups or promoting ideas to the general public. These organisations usually have a constituency of members, but their activities may involve and benefit non-members as well. The primary breakdown of this division is determined by the purpose that these organisations serve, namely interests of employers, self-employed individuals and professional groups (group 94.1), interests of employees (group 94.2) or the promotion of religious, political, cultural, educational or recreational ideas and activities (group 94.9).
broader: OTHER SERVICE ACTIVITIES
in scheme: Statistical Classification of Economic Activities in the European Community, Rev. 2.1 (NACE Rev. 2.1)
Notation: 94
top concept of: Statistical Classification of Economic Activities in the European Community, Rev. 2.1 (NACE Rev. 2.1)

ConceptNoneRandom0.1966914358533841
type: ConceptAssociation
description: NACE Rev. 2.1 class 46.22 is mapped to NACE Rev. 2 class 46.22
Type: 1:1
Source Concept: Wholesale of flowers and plants
Target Concept: http://data.europa.eu/ux2/nace2/4622
in scheme: Statistical Classification of Economic Activities in the European Community, Rev. 2.1 (NACE Rev. 2.1)
scope note: the content of the NACE Rev 2.1 class is fully covered in the corresponding NACE Rev 2 class
top concept of: Statistical Classification of Economic Activities in the European Community, Rev. 2.1 (NACE Rev. 2.1)
Mapping Cardinality: 1 1

ConceptNoneRandom0.9709133660332848
type: ConceptAssociation
description: NACE Rev. 2.1 class 24.45 is mapped to NACE Rev. 2 class 24.45
Type: 1:1
Source Concept: Other non-ferrous metal production
Target Concept: http://data.europa.eu/ux2/nace2/2445
in scheme: Statistical Classification of Economic Activities in the European Community, Rev. 2.1 (NACE Rev. 2.1)
scope note: the content of the NACE Rev 2.1 class is fully covered in the corresponding NACE Rev 2 class
top concept of: Statistical Classification of Economic Activities in the European Community, Rev. 2.1 (NACE Rev. 2.1)
Mapping Cardinality: 1 1

ConceptNoneRandom0.3315122020232578
type: ConceptAssociation
description: NACE Rev. 2.1 class 23.12 is mapped to NACE Rev. 2 class 23.12
Type: 8:9
Source Concept: Shaping and processing of flat glass
Target Concept: http://data.europa.eu/ux2/nace2/2312
in scheme: Statistical Classification of Economic Activities in the European Community, Rev. 2.1 (NACE Rev. 2.1)
scope note: the content of the NACE Rev 2.1 class is fully covered in the corresponding NACE Rev 2 class
top concept of: Statistical Classification of Economic Activities in the European Community, Rev. 2.1 (NACE Rev. 2.1)
Mapping Cardinality: n m

Activities of religious organisations
type: Concept
Additional Content Note: This class also includes: - religious funeral service activities
CoreContentNote: This class includes: - activities of religious organisations or individuals providing services directly to worshippers in churches, mosques, temples, synagogues or other places - activities of organisations furnishing monastery and convent services - religious retreat activities
Exclusion Note: This class excludes: - education provided by religious organisations, see division 85 - health activities by religious organisations, see division 86 - social work activities by religious organisations, see divisions 87, 88
broader: Activities of other membership organisations
in scheme: Statistical Classification of Economic Activities in the European Community, Rev. 2.1 (NACE Rev. 2.1)
Notation: 94.91
top concept of: Statistical Classification of Economic Activities in the European Community, Rev. 2.1 (NACE Rev. 2.1)

ConceptNoneRandom0.7424671242364379
type: ConceptAssociation
description: NACE Rev. 2.1 class 46.24 is mapped to NACE Rev. 2 class 46.24
Type: 1:1
Source Concept: Wholesale of hides, skins and leather
Target Concept: http://data.europa.eu/ux2/nace2/4624
in scheme: Statistical Classification of Economic Activities in the European Community, Rev. 2.1 (NACE Rev. 2.1)
scope note: the content of the NACE Rev 2.1 class is fully covered in the corresponding NACE Rev 2 class
top concept of: Statistical Classification of Economic Activities in the European Community, Rev. 2.1 (NACE Rev. 2.1)
Mapping Cardinality: 1 1

ConceptNoneRandom0.9714856849663784
type: ConceptAssociation
description: NACE Rev. 2.1 class 25.30 is mapped to NACE Rev. 2 class 25.40
Type: 1:1
Source Concept: Manufacture of weapons and ammunition
Target Concept: http://data.europa.eu/ux2/nace2/2540
in scheme: Statistical Classification of Economic Activities in the European Community, Rev. 2.1 (NACE Rev. 2.1)
scope note: the content of the NACE Rev 2.1 class is fully covered in the corresponding NACE Rev 2 class
top concept of: Statistical Classification of Economic Activities in the European Community, Rev. 2.1 (NACE Rev. 2.1)
Mapping Cardinality: 1 1

ConceptNoneRandom0.6172492532570341
type: ConceptAssociation
description: NACE Rev. 2.1 group 08.9 is mapped to NACE Rev. 2 group 08.9
Type: 1:1
Source Concept: Mining and quarrying n.e.c.
Target Concept: http://data.europa.eu/ux2/nace2/089
in scheme: Statistical Classification of Economic Activities in the European Community, Rev. 2.1 (NACE Rev. 2.1)
top concept of: Statistical Classification of Economic Activities in the European Community, Rev. 2.1 (NACE Rev. 2.1)
Mapping Cardinality: 1 1

Electrical, plumbing and other construction installation activities
type: Concept
CoreContentNote: This group includes installation activities that support the functioning of a building, including the installation of electrical systems, plumbing (water, gas and sewerage systems), heat and air-conditioning systems, elevators, and so on.
broader: Specialised construction activities
in scheme: Statistical Classification of Economic Activities in the European Community, Rev. 2.1 (NACE Rev. 2.1)
Notation: 43.2
top concept of: Statistical Classification of Economic Activities in the European Community, Rev. 2.1 (NACE Rev. 2.1)

Joinery installation
type: Concept
CoreContentNote: This class includes: - installation of doors (except automated and revolving), windows, door and window frames, of wood or other materials - installation of fitted kitchens, built-in cupboards, staircases, shopfittings, etc. - interior completion (e.g. of ceilings and movable partitions) - installation works for conservatories, verandas and balconies, of wood or other materials - assembly of stands and stalls (e.g. at markets, exhibitions, fairs)
Exclusion Note: This class excludes: - installation of automated and revolving doors, see 43.24 - rental and leasing of stands and stalls (e.g. for exhibitions or fairs), see 77.39
broader: Building completion and finishing
in scheme: Statistical Classification of Economic Activities in the European Community, Rev. 2.1 (NACE Rev. 2.1)
Notation: 43.32
top concept of: Statistical Classification of Economic Activities in the European Community, Rev. 2.1 (NACE Rev. 2.1)

Wholesale of wood, construction materials and sanitary equipment
type: Concept
Additional Content Note: This class also includes: - wholesale of used marble bricks, steps, roof tiles - wholesale of street furniture, i.e. benches, traffic barriers, bollards, streetlamps, traffic lights, traffic signs, bus and tram stops - wholesale of prefabricated buildings - wholesale of thermal insulation material - wholesale of reservoirs, tanks, vats and similar containers of plastics for construction
CoreContentNote: This class includes: - wholesale of wood in the rough - wholesale of products of primary processing of wood - wholesale of pallets, other load boards of wood, and barrels - wholesale of raw and assembled wood flooring - wholesale of construction materials: • sand, gravel, cement, bricks, etc. - wholesale of scaffolding - wholesale of paints, varnishes and lacquers - wholesale of wallpaper and floor coverings (e.g. laminate, tiles, vinyl flooring) - wholesale of flat glass - wholesale of sanitary equipment: • baths, washbasins, toilets and other sanitary porcelain - wholesale of doors, windows and shutters (of any material)
broader: Other specialised wholesale
in scheme: Statistical Classification of Economic Activities in the European Community, Rev. 2.1 (NACE Rev. 2.1)
Notation: 46.83
top concept of: Statistical Classification of Economic Activities in the European Community, Rev. 2.1 (NACE Rev. 2.1)

ConceptNoneRandom0.5403720623872009
type: ConceptAssociation
description: NACE Rev. 2.1 group 61.9 is mapped to NACE Rev. 2 groups 61.2, 61.9
Type: 42:34
Source Concept: Other telecommunication activities
Target Concept: http://data.europa.eu/ux2/nace2/612
Target Concept: http://data.europa.eu/ux2/nace2/619
in scheme: Statistical Classification of Economic Activities in the European Community, Rev. 2.1 (NACE Rev. 2.1)
top concept of: Statistical Classification of Economic Activities in the European Community, Rev. 2.1 (NACE Rev. 2.1)
Mapping Cardinality: n m

ConceptNoneRandom0.17902219928181107
type: ConceptAssociation
description: NACE Rev. 2.1 class 77.39 is mapped to NACE Rev. 2 class 77.39
Type: 3:3
Source Concept: Rental and leasing of other machinery, equipment and tangible goods n.e.c.
Target Concept: http://data.europa.eu/ux2/nace2/7739
in scheme: Statistical Classification of Economic Activities in the European Community, Rev. 2.1 (NACE Rev. 2.1)
scope note: the content of the NACE Rev 2.1 class is fully covered in the corresponding NACE Rev 2 class
top concept of: Statistical Classification of Economic Activities in the European Community, Rev. 2.1 (NACE Rev. 2.1)
Mapping Cardinality: n m

Repair and maintenance of computers, personal and household goods, and motor vehicles and motorcycles
type: Concept
CoreContentNote: This division includes the repair and maintenance of computers and computer peripheral equipment, communication equipment, consumer electronics, garden equipment, footwear and leather goods, furniture and home furnishings, clothing, sports goods, musical instruments and other personal and household goods, as well as the repair and maintenance of motor vehicles and motorcycles.
Exclusion Note: This division excludes specialised maintenance and repair of industrial, commercial and similar machinery and equipment not used by households, see division 33.
broader: OTHER SERVICE ACTIVITIES
in scheme: Statistical Classification of Economic Activities in the European Community, Rev. 2.1 (NACE Rev. 2.1)
Notation: 95
top concept of: Statistical Classification of Economic Activities in the European Community, Rev. 2.1 (NACE Rev. 2.1)

Camping grounds and recreational vehicle parks
type: Concept
Additional Content Note: This class also includes: - glamping accommodation - accommodation provided by protective shelters or plain bivouac facilities
CoreContentNote: This class includes: - provision of short-term accommodation in camping grounds (e.g. recreational camps, fishing and hunting camps) - provision of space and facilities for recreational vehicles
Exclusion Note: This class excludes: - intermediation service activities for accommodation, see 55.40
broader: Camping grounds and recreational vehicle parks
in scheme: Statistical Classification of Economic Activities in the European Community, Rev. 2.1 (NACE Rev. 2.1)
Notation: 55.30
top concept of: Statistical Classification of Economic Activities in the European Community, Rev. 2.1 (NACE Rev. 2.1)

ConceptNoneRandom0.8977378447637332
type: ConceptAssociation
description: NACE Rev. 2.1 class 23.13 is mapped to NACE Rev. 2 class 23.13
Type: 1:1
Source Concept: Manufacture of hollow glass
Target Concept: http://data.europa.eu/ux2/nace2/2313
in scheme: Statistical Classification of Economic Activities in the European Community, Rev. 2.1 (NACE Rev. 2.1)
scope note: the content of the NACE Rev 2.1 class is fully covered in the corresponding NACE Rev 2 class
top concept of: Statistical Classification of Economic Activities in the European Community, Rev. 2.1 (NACE Rev. 2.1)
Mapping Cardinality: 1 1

ConceptNoneRandom0.8615176373494946
type: ConceptAssociation
description: NACE Rev. 2.1 class 24.46 is mapped to NACE Rev. 2 class 24.46
Type: 1:1
Source Concept: Processing of nuclear fuel
Target Concept: http://data.europa.eu/ux2/nace2/2446
in scheme: Statistical Classification of Economic Activities in the European Community, Rev. 2.1 (NACE Rev. 2.1)
scope note: the content of the NACE Rev 2.1 class is fully covered in the corresponding NACE Rev 2 class
top concept of: Statistical Classification of Economic Activities in the European Community, Rev. 2.1 (NACE Rev. 2.1)
Mapping Cardinality: 1 1

ConceptNoneRandom0.5172702476785164
type: ConceptAssociation
description: NACE Rev. 2.1 class 22.24 is mapped to NACE Rev. 2 class 22.23
Type: 17:12
Source Concept: Manufacture of builders’ ware of plastic
Target Concept: http://data.europa.eu/ux2/nace2/2223
in scheme: Statistical Classification of Economic Activities in the European Community, Rev. 2.1 (NACE Rev. 2.1)
scope note: the content of the NACE Rev 2.1 class is fully covered in the corresponding NACE Rev 2 class
top concept of: Statistical Classification of Economic Activities in the European Community, Rev. 2.1 (NACE Rev. 2.1)
Mapping Cardinality: n m

Manufacture of other fabricated metal products
type: Concept
CoreContentNote: This group includes the manufacture of a variety of metal products (for example, cans, buckets; nails, bolts and nuts; metal household articles; metal fixtures; ships propellers and anchors; assembled railway track fixtures, etc.) for a variety of household and industrial uses.
broader: Manufacture of fabricated metal products, except machinery and equipment
in scheme: Statistical Classification of Economic Activities in the European Community, Rev. 2.1 (NACE Rev. 2.1)
Notation: 25.9
top concept of: Statistical Classification of Economic Activities in the European Community, Rev. 2.1 (NACE Rev. 2.1)

ConceptNoneRandom0.5288599068618752
type: ConceptAssociation
description: NACE Rev. 2.1 class 24.42 is mapped to NACE Rev. 2 class 24.42
Type: 1:1
Source Concept: Aluminium production
Target Concept: http://data.europa.eu/ux2/nace2/2442
in scheme: Statistical Classification of Economic Activities in the European Community, Rev. 2.1 (NACE Rev. 2.1)
scope note: the content of the NACE Rev 2.1 class is fully covered in the corresponding NACE Rev 2 class
top concept of: Statistical Classification of Economic Activities in the European Community, Rev. 2.1 (NACE Rev. 2.1)
Mapping Cardinality: 1 1

Non-life insurance
type: Concept
CoreContentNote: This class includes: - provision of insurance services other than life insurance: • accident insurance • medical and health insurance • travel insurance • fire and natural forces damage to property insurance • other damage to property insurance • motor vehicles, railway rolling stock, ships, aircraft and other transport insurance - freight insurance • financial loss and liability insurance - credit insurance - legal expenses insurance - income protection insurance - workers’ compensation insurance
Exclusion Note: This class excludes: - compulsory social security schemes, see 84.30
broader: Insurance
in scheme: Statistical Classification of Economic Activities in the European Community, Rev. 2.1 (NACE Rev. 2.1)
Notation: 65.12
top concept of: Statistical Classification of Economic Activities in the European Community, Rev. 2.1 (NACE Rev. 2.1)

ConceptNoneRandom0.8477359512753097
type: ConceptAssociation
description: NACE Rev. 2.1 class 26.60 is mapped to NACE Rev. 2 classes 26.60, 32.50
Type: 11:11
Source Concept: Manufacture of irradiation, electromedical and electrotherapeutic equipment
Target Concept: http://data.europa.eu/ux2/nace2/3250
Target Concept: http://data.europa.eu/ux2/nace2/2660
in scheme: Statistical Classification of Economic Activities in the European Community, Rev. 2.1 (NACE Rev. 2.1)
scope note: 26.60: - manufacture of irradiation apparatus and tubes, e.g. industrial, medical diagnostic, medical therapeutic, research, scientific: • alpha, beta-, gamma, X-ray or other radiation equipment - manufacture of CT scanners - manufacture of PET scanners - manufacture of magnetic resonance imaging (MRI) equipment - manufacture of medical ultrasound equipment - manufacture of electrocardiographs - manufacture of electromedical endoscopic equipment - manufacture of medical laser equipment - manufacture of artificial respiration or therapeutic respiration apparatus - manufacture of pacemakers - manufacture of hearing aids - manufacture of food and milk irradiation equipment 32.50: - manufacture of artificial respiration or therapeutic respiration apparatus - manufacture of electrical vibratory-massage apparatus
top concept of: Statistical Classification of Economic Activities in the European Community, Rev. 2.1 (NACE Rev. 2.1)
Mapping Cardinality: n m

ConceptNoneRandom0.35026020949535785
type: ConceptAssociation
description: NACE Rev. 2.1 class 91.22 is mapped to NACE Rev. 2 class 91.03
Type: 1:1
Source Concept: Historical site and monument activities
Target Concept: http://data.europa.eu/ux2/nace2/9103
in scheme: Statistical Classification of Economic Activities in the European Community, Rev. 2.1 (NACE Rev. 2.1)
scope note: the content of the NACE Rev 2.1 class is fully covered in the corresponding NACE Rev 2 class
top concept of: Statistical Classification of Economic Activities in the European Community, Rev. 2.1 (NACE Rev. 2.1)
Mapping Cardinality: 1 1

ConceptNoneRandom0.6512498455243226
type: ConceptAssociation
description: NACE Rev. 2.1 group 70.1 is mapped to NACE Rev. 2 group 70.1
Type: 1:1
Source Concept: Activities of head offices
Target Concept: http://data.europa.eu/ux2/nace2/701
in scheme: Statistical Classification of Economic Activities in the European Community, Rev. 2.1 (NACE Rev. 2.1)
top concept of: Statistical Classification of Economic Activities in the European Community, Rev. 2.1 (NACE Rev. 2.1)
Mapping Cardinality: 1 1

ConceptNoneRandom0.9956686130142783
type: ConceptAssociation
description: NACE Rev. 2.1 class 96.91 is mapped to NACE Rev. 2 classes 81.21, 96.01
Type: 4:3
Source Concept: Provision of domestic personal service activities
Target Concept: http://data.europa.eu/ux2/nace2/9601
Target Concept: http://data.europa.eu/ux2/nace2/8121
in scheme: Statistical Classification of Economic Activities in the European Community, Rev. 2.1 (NACE Rev. 2.1)
scope note: 81.21: - cleaning of houses or apartments at home for households if also other domestic personal service activities like cooking or washing are performed 96.01: - laundering and dry cleaning of all kinds of clothing and textiles at home for households if also other domestic personal service activities like cooking or cleaning of houses and apartments are performed
top concept of: Statistical Classification of Economic Activities in the European Community, Rev. 2.1 (NACE Rev. 2.1)
Mapping Cardinality: n m

Manufacture of basic pharmaceutical products
type: Concept
Additional Content Note: This class also includes: - manufacture of chemically pure sugars - manufacture of probiotics - processing of glands and manufacture of extracts of glands, etc.
CoreContentNote: This class includes: - manufacture of active pharmaceutical ingredients to be used for their pharmacological properties in the manufacture of medical products (e.g. antibiotics, basic vitamins, salicylic and O-acetylsalicylic acids) - processing of blood
Exclusion Note: This class excludes: - manufacture of advance cell and gene therapy pharmaceutical preparations, see 21.20
broader: Manufacture of basic pharmaceutical products
in scheme: Statistical Classification of Economic Activities in the European Community, Rev. 2.1 (NACE Rev. 2.1)
Notation: 21.10
top concept of: Statistical Classification of Economic Activities in the European Community, Rev. 2.1 (NACE Rev. 2.1)

Event catering, contract catering service activities and other food service activities
type: Concept
CoreContentNote: This group includes catering activities for individual events or for a specified period of time and the operation of food concessions (for example, at sports or similar facilities). The services are provided on a contract basis and offered to a limited clientele.
broader: Food and beverage service activities
in scheme: Statistical Classification of Economic Activities in the European Community, Rev. 2.1 (NACE Rev. 2.1)
Notation: 56.2
top concept of: Statistical Classification of Economic Activities in the European Community, Rev. 2.1 (NACE Rev. 2.1)

Manufacture of fasteners and screw machine products
type: Concept
CoreContentNote: This class includes: - manufacture of rivets, washers and similar non-threaded products - manufacture of screw machine products - manufacture of bolts, screws, nuts and similar threaded products
broader: Manufacture of other fabricated metal products
in scheme: Statistical Classification of Economic Activities in the European Community, Rev. 2.1 (NACE Rev. 2.1)
Notation: 25.94
top concept of: Statistical Classification of Economic Activities in the European Community, Rev. 2.1 (NACE Rev. 2.1)

ConceptNoneRandom0.5225838257995792
type: ConceptAssociation
description: NACE Rev. 2.1 group 74.9 is mapped to NACE Rev. 2 group 74.9
Type: 2:4
Source Concept: Other professional, scientific and technical activities n.e.c.
Target Concept: http://data.europa.eu/ux2/nace2/749
in scheme: Statistical Classification of Economic Activities in the European Community, Rev. 2.1 (NACE Rev. 2.1)
top concept of: Statistical Classification of Economic Activities in the European Community, Rev. 2.1 (NACE Rev. 2.1)
Mapping Cardinality: n m

Floor and wall covering
type: Concept
Additional Content Note: This class also includes: - sanding, polishing and sealing of parquet and other wooden floor coverings
CoreContentNote: This class includes: - laying, tiling, hanging or fitting in buildings or within other constructions of: • ceramic, concrete or cut stone wall or floor tiles, ceramic stove fitting • parquet and other wooden floor coverings, wooden wall coverings • carpets and linoleum floor coverings, including of rubber or plastic • terrazzo, marble, granite or slate floor or wall coverings • wallpaper
Exclusion Note: This class excludes: - wall cladding for exterior walls, see 43.35
broader: Building completion and finishing
in scheme: Statistical Classification of Economic Activities in the European Community, Rev. 2.1 (NACE Rev. 2.1)
Notation: 43.33
top concept of: Statistical Classification of Economic Activities in the European Community, Rev. 2.1 (NACE Rev. 2.1)

Wholesale of hardware, plumbing and heating equipment and supplies
type: Concept
CoreContentNote: This class includes: - wholesale of ironware and similar household hardware - wholesale of fittings - wholesale of hot water heaters, radiators and boilers - wholesale of sanitary installation equipment: • tubes, pipes, fittings, taps, T pieces, connections, rubber pipes, etc. - wholesale of tools (e.g. hammers, saws, screwdrivers and other hand tools), including power hand tools - wholesale of heating, ventilation and air-conditioning equipment, for non-domestic use
Exclusion Note: This class excludes: - wholesale of heating, ventilation and air-conditioning equipment, for domestic use, see 46.43 - wholesale of mining, construction and civil engineering machinery, see 46.63 - wholesale of sanitary equipment, see 46.83
broader: Other specialised wholesale
in scheme: Statistical Classification of Economic Activities in the European Community, Rev. 2.1 (NACE Rev. 2.1)
Notation: 46.84
top concept of: Statistical Classification of Economic Activities in the European Community, Rev. 2.1 (NACE Rev. 2.1)

Manufacture of basic pharmaceutical products
type: Concept
broader: Manufacture of basic pharmaceutical products and pharmaceutical preparations
in scheme: Statistical Classification of Economic Activities in the European Community, Rev. 2.1 (NACE Rev. 2.1)
Notation: 21.1
top concept of: Statistical Classification of Economic Activities in the European Community, Rev. 2.1 (NACE Rev. 2.1)

Retail sale of other goods, except motor vehicles and motorcycles
type: Concept
Additional Content Note: This group also includes: - retail sale of second-hand goods
CoreContentNote: This group includes the specialised retail sale of various goods not elsewhere classified (for example, clothing, footwear and leather articles, pharmaceutical and medical goods, watches, souvenirs, cleaning products, toiletries, flowers, pets).
broader: Retail trade
in scheme: Statistical Classification of Economic Activities in the European Community, Rev. 2.1 (NACE Rev. 2.1)
Notation: 47.7
top concept of: Statistical Classification of Economic Activities in the European Community, Rev. 2.1 (NACE Rev. 2.1)

Personal service activities
type: Concept
CoreContentNote: This division includes all personal service activities not mentioned elsewhere in the classification. Notably it includes types of services, such as washing and (dry-)cleaning of textiles and fur products, hairdressing, beauty treatment, day spa and similar activities, funeral and related activities.
broader: OTHER SERVICE ACTIVITIES
in scheme: Statistical Classification of Economic Activities in the European Community, Rev. 2.1 (NACE Rev. 2.1)
Notation: 96
top concept of: Statistical Classification of Economic Activities in the European Community, Rev. 2.1 (NACE Rev. 2.1)

Manufacture of non-wovens and non-woven articles
type: Concept
Additional Content Note: This class also includes: - manufacture of non-woven sheets used for production of wound care dressings - manufacture of non-woven fabric used for production of baby wipes
CoreContentNote: This class includes the manufacture of non-wovens, whether or not impregnated, coated, covered or laminated with plastics or rubber. It also includes the manufacture of non-wovens in which plastics or rubber forms the bonding substance.
Exclusion Note: This class excludes: - manufacture of made-up articles from non-wovens, e.g.: • bed linen, table linen, toilet linen and kitchen linen, of non-wovens, see 13.92 • curtains of non-wovens, see 13.92 • floorcloths, dishcloths, dusters and similar cleaning cloths, of non-wovens, see 13.92 • garments made up of non-wovens, see 14.29 • manufacture of napkins and napkin liners for babies, period panties, see 17.22 • manufacture of textile wallpaper, see 17.24 • single-use drapes used during surgical procedures made up of non-wovens, see 32.50 • manufacture of individual protective masks (e.g. FFP2, FFP3, surgical masks), see 32.50
broader: Manufacture of other textiles
in scheme: Statistical Classification of Economic Activities in the European Community, Rev. 2.1 (NACE Rev. 2.1)
Notation: 13.95
top concept of: Statistical Classification of Economic Activities in the European Community, Rev. 2.1 (NACE Rev. 2.1)

Number Of Levels

ConceptNoneRandom0.21626142021833383
type: ConceptAssociation
description: NACE Rev. 2.1 class 22.25 is mapped to NACE Rev. 2 classes 22.21, 22.22, 22.23, 22.29
Type: 17:12
Source Concept: Processing and finishing of plastic products
Target Concept: http://data.europa.eu/ux2/nace2/2229
Target Concept: http://data.europa.eu/ux2/nace2/2223
Target Concept: http://data.europa.eu/ux2/nace2/2222
Target Concept: http://data.europa.eu/ux2/nace2/2221
in scheme: Statistical Classification of Economic Activities in the European Community, Rev. 2.1 (NACE Rev. 2.1)
scope note: 22.21: - finishing of plastic products 22.22: - finishing of plastic products 22.23: - finishing of plastic products 22.29: - processing and finishing of plastic products, typically carried out on a fee or contract basis - metal coating of plastics
top concept of: Statistical Classification of Economic Activities in the European Community, Rev. 2.1 (NACE Rev. 2.1)
Mapping Cardinality: n m

ConceptNoneRandom0.6936531130660094
type: ConceptAssociation
description: NACE Rev. 2.1 group 17.1 is mapped to NACE Rev. 2 group 17.1
Type: 1:1
Source Concept: Manufacture of pulp, paper and paperboard
Target Concept: http://data.europa.eu/ux2/nace2/171
in scheme: Statistical Classification of Economic Activities in the European Community, Rev. 2.1 (NACE Rev. 2.1)
top concept of: Statistical Classification of Economic Activities in the European Community, Rev. 2.1 (NACE Rev. 2.1)
Mapping Cardinality: 1 1

ConceptNoneRandom0.5719251392887221
type: ConceptAssociation
description: NACE Rev. 2.1 class 47.53 is mapped to NACE Rev. 2 classes 47.53, 47.89, 47.91, 47.99
Type: 78:65
Source Concept: Retail sale of carpets, rugs, wall and floor coverings
Target Concept: http://data.europa.eu/ux2/nace2/4791
Target Concept: http://data.europa.eu/ux2/nace2/4799
Target Concept: http://data.europa.eu/ux2/nace2/4789
Target Concept: http://data.europa.eu/ux2/nace2/4753
in scheme: Statistical Classification of Economic Activities in the European Community, Rev. 2.1 (NACE Rev. 2.1)
scope note: 47.53: - retail sale of carpets and rugs - retail sale of curtains and net curtains - retail sale of wall or floor coverings, e.g. wallpaper, tiles, laminates and vinyl flooring 47.89: - retail sale via stalls and markets of carpets and rugs - retail sale via stalls and markets of curtains and net curtains - retail sale via stalls and markets of wall or floor coverings, e.g. wallpaper, tiles, laminates and vinyl flooring 47.91: - retail sale via mail order houses or via Internet of carpets and rugs - retail sale via mail order houses or via Internet of curtains and net curtains - retail sale via mail order houses or via Internet of wall or floor coverings, e.g. wallpaper, tiles, laminates and vinyl flooring 47.99: - retail sale not in stores, stalls or markets of carpets and rugs - retail sale not in stores, stalls or markets of curtains and net curtains - retail sale not in stores, stalls or markets of wall or floor coverings, e.g. wallpaper, tiles, laminates and vinyl flooring
top concept of: Statistical Classification of Economic Activities in the European Community, Rev. 2.1 (NACE Rev. 2.1)
Mapping Cardinality: n m

ConceptNoneRandom0.7679762112972409
type: ConceptAssociation
description: NACE Rev. 2.1 class 24.43 is mapped to NACE Rev. 2 class 24.43
Type: 1:1
Source Concept: Lead, zinc and tin production
Target Concept: http://data.europa.eu/ux2/nace2/2443
in scheme: Statistical Classification of Economic Activities in the European Community, Rev. 2.1 (NACE Rev. 2.1)
scope note: the content of the NACE Rev 2.1 class is fully covered in the corresponding NACE Rev 2 class
top concept of: Statistical Classification of Economic Activities in the European Community, Rev. 2.1 (NACE Rev. 2.1)
Mapping Cardinality: 1 1

ConceptNoneRandom0.9144824358950889
type: ConceptAssociation
description: NACE Rev. 2.1 class 66.29 is mapped to NACE Rev. 2 class 66.29
Type: 1:1
Source Concept: Activities auxiliary to insurance and pension funding n.e.c.
Target Concept: http://data.europa.eu/ux2/nace2/6629
in scheme: Statistical Classification of Economic Activities in the European Community, Rev. 2.1 (NACE Rev. 2.1)
scope note: the content of the NACE Rev 2.1 class is fully covered in the corresponding NACE Rev 2 class
top concept of: Statistical Classification of Economic Activities in the European Community, Rev. 2.1 (NACE Rev. 2.1)
Mapping Cardinality: 1 1

ConceptNoneRandom0.5868682256710807
type: ConceptAssociation
description: NACE Rev. 2.1 class 47.55 is mapped to NACE Rev. 2 classes 47.59, 47.78, 47.89, 47.91, 47.99
Type: 78:65
Source Concept: Retail sale of furniture, lighting equipment, tableware and other household goods
Target Concept: http://data.europa.eu/ux2/nace2/4791
Target Concept: http://data.europa.eu/ux2/nace2/4759
Target Concept: http://data.europa.eu/ux2/nace2/4799
Target Concept: http://data.europa.eu/ux2/nace2/4778
Target Concept: http://data.europa.eu/ux2/nace2/4789
in scheme: Statistical Classification of Economic Activities in the European Community, Rev. 2.1 (NACE Rev. 2.1)
scope note: 47.59: - retail sale of furniture, including mattresses and box springs - retail sale of articles for lighting - retail sale of household utensils and cutlery, crockery, glassware, tableware, china and pottery - retail sale of wooden, cork and wickerwork goods - retail sale of non-electrical household appliances, - retail sale of solar household appliances - retail sale of parasols - retail sale of household articles and equipment n.e.c. - retail sale of sails, except of boat sails 47.78: - retail sale of baby equipment, e.g. baby carriages, pushchairs, baby walkers, baby carries, baby car seats 47.89: Retail sale via stalls and markets of: - furniture, including mattresses and box springs - articles for lighting - household utensils and cutlery, crockery, glassware, tableware, china and pottery - wooden, cork and wickerwork goods - non-electrical household appliances, - solar household appliances - parasols - household articles and equipment n.e.c. - baby equipment, e.g. baby carriages, pushchairs, baby walkers, baby carries, baby car seats - sails 47.91: - retail sale via mail order houses or via Internet of furniture, including mattresses and box springs - retail sale via mail order houses or via Internet of articles for lighting - retail sale via mail order houses or via Internet of household utensils and cutlery, crockery, glassware, tableware, china and pottery - retail sale via mail order houses or via Internet of wooden, cork and wickerwork goods - retail sale via mail order houses or via Internet of non-electrical household appliances, - retail sale via mail order houses or via Internet of solar household appliances - retail sale via mail order houses or via Internet of parasols - retail sale via mail order houses or via Internet of household articles and equipment n.e.c. - retail sale via mail order houses or via Internet of baby equipment, e.g. baby carriages, pushchairs, baby walkers, baby carries, baby car seats - retail sale via mail order houses or vi…
top concept of: Statistical Classification of Economic Activities in the European Community, Rev. 2.1 (NACE Rev. 2.1)
Mapping Cardinality: n m

Life insurance
type: Concept
Additional Content Note: This class also includes: - supplementary insurance underwritten in addition to life insurance, in particular, insurance against personal injury, including incapacity for employment, insurance against death resulting from an accident, and insurance against disability resulting from an accident or sickness - types of permanent health insurance not subject to cancellation
CoreContentNote: This class includes: - term life insurance - permanent life insurance - underwriting annuities and life insurance policies, disability income insurance policies, accidental death, funeral and dismemberment insurance policies (with or without a substantial savings element)
broader: Insurance
in scheme: Statistical Classification of Economic Activities in the European Community, Rev. 2.1 (NACE Rev. 2.1)
Notation: 65.11
top concept of: Statistical Classification of Economic Activities in the European Community, Rev. 2.1 (NACE Rev. 2.1)

Mining of other non-ferrous metal ores
type: Concept
CoreContentNote: This class includes: - mining and preparation of ores chiefly valued for non-ferrous metal content: • aluminium (bauxite), copper, lead, zinc, tin, manganese, chrome, nickel, cobalt, molybdenum, tantalum, vanadium, lithium/spodumene, etc. • precious metals: gold, silver, platinum
Exclusion Note: This class excludes: - mining and preparation of uranium and thorium ores, see 07.21 - production of aluminium oxide, see 24.42 - production of mattes of copper, see 24.44 - production of mattes of nickel, see 24.45
broader: Mining of non-ferrous metal ores
in scheme: Statistical Classification of Economic Activities in the European Community, Rev. 2.1 (NACE Rev. 2.1)
Notation: 07.29
top concept of: Statistical Classification of Economic Activities in the European Community, Rev. 2.1 (NACE Rev. 2.1)

ConceptNoneRandom0.5586101550096222
type: ConceptAssociation
description: NACE Rev. 2.1 group 92.0 is mapped to NACE Rev. 2 group 92.0
Type: 1:1
Source Concept: Gambling and betting activities
Target Concept: http://data.europa.eu/ux2/nace2/920
in scheme: Statistical Classification of Economic Activities in the European Community, Rev. 2.1 (NACE Rev. 2.1)
top concept of: Statistical Classification of Economic Activities in the European Community, Rev. 2.1 (NACE Rev. 2.1)
Mapping Cardinality: 1 1

Manufacture of wire products, chain and springs
type: Concept
CoreContentNote: This class includes: - manufacture of metal cable, plaited bands and similar articles - manufacture of uninsulated metal cable or insulated cable not capable of being used as a conductor of electricity - manufacture of coated or cored wire - manufacture of articles made of wire (e.g. barbed wire, wire fencing, grill, netting, cloth) - coated electrodes for electric arc welding - manufacture of nails and pins - manufacture of springs (except watch springs), e.g.: • leaf springs, helical springs, torsion bar springs • leaves for springs - manufacture of chain, except power transmission chain
Exclusion Note: This class excludes: - manufacture of clock or watch springs, see 26.52 - manufacture of wire and cable for electricity transmission, see 27.32 - manufacture of power transmission chain, see 28.15
broader: Manufacture of other fabricated metal products
in scheme: Statistical Classification of Economic Activities in the European Community, Rev. 2.1 (NACE Rev. 2.1)
Notation: 25.93
top concept of: Statistical Classification of Economic Activities in the European Community, Rev. 2.1 (NACE Rev. 2.1)

ConceptNoneRandom0.5781824331905948
type: ConceptAssociation
description: NACE Rev. 2.1 class 91.21 is mapped to NACE Rev. 2 class 91.02
Type: 1:1
Source Concept: Museum and collection activities
Target Concept: http://data.europa.eu/ux2/nace2/9102
in scheme: Statistical Classification of Economic Activities in the European Community, Rev. 2.1 (NACE Rev. 2.1)
scope note: the content of the NACE Rev 2.1 class is fully covered in the corresponding NACE Rev 2 class
top concept of: Statistical Classification of Economic Activities in the European Community, Rev. 2.1 (NACE Rev. 2.1)
Mapping Cardinality: 1 1

Painting and glazing
type: Concept
Additional Content Note: This class also includes: - coating of metals on buildings and civil engineering structures
CoreContentNote: This class includes: - interior and exterior painting of buildings - painting of civil engineering structures - installation of glass, mirrors, etc.
Exclusion Note: This class excludes: - waterproofing of roofs, see 43.41 - installation of windows, see 43.32 - road painting and other marking of streets, see 43.50
broader: Building completion and finishing
in scheme: Statistical Classification of Economic Activities in the European Community, Rev. 2.1 (NACE Rev. 2.1)
Notation: 43.34
top concept of: Statistical Classification of Economic Activities in the European Community, Rev. 2.1 (NACE Rev. 2.1)

Activities of employment placement agencies
type: Concept
broader: Employment activities
in scheme: Statistical Classification of Economic Activities in the European Community, Rev. 2.1 (NACE Rev. 2.1)
Notation: 78.1
top concept of: Statistical Classification of Economic Activities in the European Community, Rev. 2.1 (NACE Rev. 2.1)

ConceptNoneRandom0.34116058928872073
type: ConceptAssociation
description: NACE Rev. 2.1 group 70.2 is mapped to NACE Rev. 2 group 70.2
Type: 2:1
Source Concept: Business and other management consultancy activities
Target Concept: http://data.europa.eu/ux2/nace2/702
in scheme: Statistical Classification of Economic Activities in the European Community, Rev. 2.1 (NACE Rev. 2.1)
top concept of: Statistical Classification of Economic Activities in the European Community, Rev. 2.1 (NACE Rev. 2.1)
Mapping Cardinality: n 1

Beverage serving activities
type: Concept
broader: Food and beverage service activities
in scheme: Statistical Classification of Economic Activities in the European Community, Rev. 2.1 (NACE Rev. 2.1)
Notation: 56.3
top concept of: Statistical Classification of Economic Activities in the European Community, Rev. 2.1 (NACE Rev. 2.1)

Retail sale of motor vehicles, motorcycles and related parts and accessories
type: Concept
Additional Content Note: This group also includes: - retail sale of used parts and accessories after dismantling cars or other motor vehicles - retail sale of parts and accessories for electric motor vehicles and motorcycles
CoreContentNote: This group includes the retail sale of new and second-hand motor vehicles and motorcycles, as well as all kinds of parts, components, supplies, tools and accessories for motor vehicles and motorcycles, for example: • rubber tyres and inner tubes for tyres • spark plugs, batteries, lighting equipment, vehicle charging equipment and electrical parts
Exclusion Note: This group excludes: - activities of agents involved in the wholesale of motor vehicles, motorcycles and related parts, see 46.18 - intermediation service activities for the retail sale of motor vehicles and motorcycles, see 47.9 - on-demand passenger transport service activities by vehicle with a driver, see 49.33 - rental and leasing of motor vehicles without a driver, see 77.1 - maintenance and repair of motor vehicles and motorcycles, see 95.3
broader: Retail trade
in scheme: Statistical Classification of Economic Activities in the European Community, Rev. 2.1 (NACE Rev. 2.1)
Notation: 47.8
top concept of: Statistical Classification of Economic Activities in the European Community, Rev. 2.1 (NACE Rev. 2.1)

Manufacture of pharmaceutical preparations
type: Concept
broader: Manufacture of basic pharmaceutical products and pharmaceutical preparations
in scheme: Statistical Classification of Economic Activities in the European Community, Rev. 2.1 (NACE Rev. 2.1)
Notation: 21.2
top concept of: Statistical Classification of Economic Activities in the European Community, Rev. 2.1 (NACE Rev. 2.1)

Wholesale of chemical products
type: Concept
Additional Content Note: This class also includes: - wholesale of e-liquids for electronic cigarettes
CoreContentNote: This class includes: - wholesale of industrial chemicals (e.g. aniline, essential oils, chemical glues, methanol, paraffin, scents and flavourings, soda, industrial salt, acids and sulphurs, starch derivates, industrial gases, dyes and pigments, other organic and inorganic basic chemicals, glazes, printing inks and adhesives) - wholesale of explosives and pyrotechnic products - wholesale of fertilisers and agrochemical products - wholesale of hydrogen
Exclusion Note: This class excludes: - sale of gaseous fuels through mains on the account of others, see 35.40
broader: Other specialised wholesale
in scheme: Statistical Classification of Economic Activities in the European Community, Rev. 2.1 (NACE Rev. 2.1)
Notation: 46.85
top concept of: Statistical Classification of Economic Activities in the European Community, Rev. 2.1 (NACE Rev. 2.1)

Activities of collection agencies and credit bureaus
type: Concept
Additional Content Note: This class also includes: - activities of rating agencies - repossession activities
CoreContentNote: This class includes: - collection of payments for claims and remittance of payments collected to the clients (e.g. bill or debt collection services) - compiling and the provision of information (e.g. credit or employment history) for financial institutions, retailers and others who have a need to evaluate the creditworthiness of individuals or businesses
Exclusion Note: This class excludes: - factoring activities, see 64.92
broader: Business support service activities n.e.c.
in scheme: Statistical Classification of Economic Activities in the European Community, Rev. 2.1 (NACE Rev. 2.1)
Notation: 82.91
top concept of: Statistical Classification of Economic Activities in the European Community, Rev. 2.1 (NACE Rev. 2.1)

Mixed farming
type: Concept
CoreContentNote: This class includes: - the combined production of crops and animals without a specialised production of crops or animals
Exclusion Note: This class excludes: - mixed crop farming, see 01.1, 01.2 - mixed animal farming, see 01.4
broader: Mixed farming
in scheme: Statistical Classification of Economic Activities in the European Community, Rev. 2.1 (NACE Rev. 2.1)
Notation: 01.50
scope note: IMPLEMENTATION RULE The size of the overall farming operation is not a determining factor. If either the production of crops or the production of animals in a given unit is 66 % or more of standard output, the combined activities should not be included here, but allocated to crop or animal farming.
top concept of: Statistical Classification of Economic Activities in the European Community, Rev. 2.1 (NACE Rev. 2.1)

Activities of households as employers of domestic personnel
type: Concept
CoreContentNote: This division only includes activities of private households as employers of domestic personnel. The output of these activities is considered production in the European system of accounts (ESA), and for this purpose and for certain surveys this division has been included in NACE Rev. 2.1. The same activities when carried out by independent service providers (as opposed to domestic staff employed and paid by the household) are not classified here (for example, babysitting activities (class 88.91), washing of textiles (class 96.10) and valet activities (class 96.99).
broader: ACTIVITIES OF HOUSEHOLDS AS EMPLOYERS AND UNDIFFERENTIATED GOODS - AND SERVICE-PRODUCING ACTIVITIES OF HOUSEHOLDS FOR OWN USE
in scheme: Statistical Classification of Economic Activities in the European Community, Rev. 2.1 (NACE Rev. 2.1)
Notation: 97
top concept of: Statistical Classification of Economic Activities in the European Community, Rev. 2.1 (NACE Rev. 2.1)

ConceptNoneRandom0.6785911142575822
type: ConceptAssociation
description: NACE Rev. 2.1 group 39.0 is mapped to NACE Rev. 2 group 39.0
Type: 1:1
Source Concept: Remediation activities and other waste management service activities
Target Concept: http://data.europa.eu/ux2/nace2/390
in scheme: Statistical Classification of Economic Activities in the European Community, Rev. 2.1 (NACE Rev. 2.1)
top concept of: Statistical Classification of Economic Activities in the European Community, Rev. 2.1 (NACE Rev. 2.1)
Mapping Cardinality: 1 1

Manufacture of other technical and industrial textiles
type: Concept
Additional Content Note: This class also includes: - manufacture of fabrics of glass fibres
CoreContentNote: This class includes: - manufacture of narrow woven fabrics, including fabrics consisting of warp without weft assembled by means of an adhesive - manufacture of labels, badges, etc. - manufacture of ornamental trimmings: braids, tassels, pompons, etc. - manufacture of textile fabrics impregnated, coated, covered or laminated with plastics - manufacture of metallised yarn, rubber thread and cord covered with textile material, textile yarn covered, impregnated, coated or sheathed with rubber or plastics - manufacture of tyre cord fabric of high-tenacity man-made yarn - manufacture of other treated or coated fabrics (e.g. buckram and similar stiffened textile fabrics, fabrics coated with gum or amylaceous substances) - manufacture of diverse textile articles (e.g. textile wicks, incandescent gas mantles, tubular gas) - manufacture of mantle fabric, hose piping, transmission or conveyor belts or belting (whether or not reinforced with metal or other material), bolting cloth, straining cloth - manufacture of automotive trimmings - manufacture of artists' canvas boards and tracing cloth - manufacture of tarpaulins, tents, pneumatic mattresses of textile materials, sails, parachutes, textiles for blinds and sunblinds, loose covers for cars, machines or furniture
Exclusion Note: This class excludes: - manufacture of napkins and napkin liners for babies and similar articles of textile materials, see 17.22 - manufacture of medical textiles impregnated or covered with pharmaceutical substances (e.g. gauze, bandages) see 21.20 - manufacture of transmission or conveyor belts of textile fabric, impregnated, coated, covered or laminated with rubber, see 22.12 - manufacture of pneumatic mattresses of vulcanised rubber, see 22.12 - manufacture of plates or sheets of cellular rubber or plastic combined with textiles for reinforcing purposes only, see 22.12, 22.21 - manufacture of cloth of woven metal wire, see 25.93 - manufacture of single-use surgical drapes used during surgical procedures made up of non-wovens, see 32.50
broader: Manufacture of other textiles
in scheme: Statistical Classification of Economic Activities in the European Community, Rev. 2.1 (NACE Rev. 2.1)
Notation: 13.96
top concept of: Statistical Classification of Economic Activities in the European Community, Rev. 2.1 (NACE Rev. 2.1)

ConceptNoneRandom0.23308396961160915
type: ConceptAssociation
description: NACE Rev. 2.1 group 17.2 is mapped to NACE Rev. 2 group 17.2
Type: 1:1
Source Concept: Manufacture of articles of paper and paperboard
Target Concept: http://data.europa.eu/ux2/nace2/172
in scheme: Statistical Classification of Economic Activities in the European Community, Rev. 2.1 (NACE Rev. 2.1)
top concept of: Statistical Classification of Economic Activities in the European Community, Rev. 2.1 (NACE Rev. 2.1)
Mapping Cardinality: 1 1

ConceptNoneRandom0.24803830361007406
type: ConceptAssociation
description: NACE Rev. 2.1 class 47.54 is mapped to NACE Rev. 2 classes 47.54, 47.89, 47.91, 47.99
Type: 78:65
Source Concept: Retail sale of electrical household appliances
Target Concept: http://data.europa.eu/ux2/nace2/4791
Target Concept: http://data.europa.eu/ux2/nace2/4799
Target Concept: http://data.europa.eu/ux2/nace2/4754
Target Concept: http://data.europa.eu/ux2/nace2/4789
in scheme: Statistical Classification of Economic Activities in the European Community, Rev. 2.1 (NACE Rev. 2.1)
scope note: 47.54: - retail sale of electrical household appliances 47.89: - retail sale via stalls and markets of electrical household appliances 47.91: - retail sale via mail order houses or via Internet of electrical household appliances 47.99: - retail sale not in stores, stalls or markets of electrical household appliances
top concept of: Statistical Classification of Economic Activities in the European Community, Rev. 2.1 (NACE Rev. 2.1)
Mapping Cardinality: n m

ConceptNoneRandom0.3806339000901131
type: ConceptAssociation
description: NACE Rev. 2.1 class 22.26 is mapped to NACE Rev. 2 class 22.29
Type: 17:12
Source Concept: Manufacture of other plastic products
Target Concept: http://data.europa.eu/ux2/nace2/2229
in scheme: Statistical Classification of Economic Activities in the European Community, Rev. 2.1 (NACE Rev. 2.1)
scope note: the content of the NACE Rev 2.1 class is fully covered in the corresponding NACE Rev 2 class
top concept of: Statistical Classification of Economic Activities in the European Community, Rev. 2.1 (NACE Rev. 2.1)
Mapping Cardinality: n m

ConceptNoneRandom0.5230143898581496
type: ConceptAssociation
description: NACE Rev. 2.1 class 46.21 is mapped to NACE Rev. 2 class 46.21
Type: 1:1
Source Concept: Wholesale of grain, unmanufactured tobacco, seeds and animal feeds
Target Concept: http://data.europa.eu/ux2/nace2/4621
in scheme: Statistical Classification of Economic Activities in the European Community, Rev. 2.1 (NACE Rev. 2.1)
scope note: the content of the NACE Rev 2.1 class is fully covered in the corresponding NACE Rev 2 class
top concept of: Statistical Classification of Economic Activities in the European Community, Rev. 2.1 (NACE Rev. 2.1)
Mapping Cardinality: 1 1

ConceptNoneRandom0.03770955741385695
type: ConceptAssociation
description: NACE Rev. 2.1 class 47.12 is mapped to NACE Rev. 2 classes 47.19, 47.82, 47.89, 47.91, 47.99
Type: 78:65
Source Concept: Other non-specialised retail sale
Target Concept: http://data.europa.eu/ux2/nace2/4719
Target Concept: http://data.europa.eu/ux2/nace2/4791
Target Concept: http://data.europa.eu/ux2/nace2/4782
Target Concept: http://data.europa.eu/ux2/nace2/4799
Target Concept: http://data.europa.eu/ux2/nace2/4789
in scheme: Statistical Classification of Economic Activities in the European Community, Rev. 2.1 (NACE Rev. 2.1)
scope note: 47.19: - retail sale of a large variety of goods (e.g. wearing apparel, furniture, appliances, hardware, cosmetics, jewellery, toys, sports goods) of which food products, beverages or tobacco are not predominant 47.82: - retail sale of a large variety of goods (e.g. wearing apparel, furniture, appliances, hardware, cosmetics, jewellery, toys, sports goods) of which food products, beverages or tobacco are not predominant 47.89: - retail sale via stalls and markets of a large variety of goods (e.g. wearing apparel, furniture, appliances, hardware, cosmetics, jewellery, toys, sports goods) of which food products, beverages or tobacco are not predominant 47.91: - retail sale via mail order houses or via Internet of a large variety of goods (e.g. wearing apparel, furniture, appliances, hardware, cosmetics, jewellery, toys, sports goods) of which food products, beverages or tobacco are not predominant 47.99: - retail sale not in stores, stalls or markets of a large variety of goods (e.g. wearing apparel, furniture, appliances, hardware, cosmetics, jewellery, toys, sports goods) of which food products, beverages or tobacco are not predominant
top concept of: Statistical Classification of Economic Activities in the European Community, Rev. 2.1 (NACE Rev. 2.1)
Mapping Cardinality: n m

Manufacture of workwear
type: Concept
Additional Content Note: This class also includes: - manufacture of uniforms and similar official clothing (e.g. judge’s gowns, church vestments)
Exclusion Note: This class excludes: - manufacture of footwear, see 15.20 - manufacture of fire-protective clothing, see 32.99
broader: Manufacture of other wearing apparel and accessories
in scheme: Statistical Classification of Economic Activities in the European Community, Rev. 2.1 (NACE Rev. 2.1)
Notation: 14.23
top concept of: Statistical Classification of Economic Activities in the European Community, Rev. 2.1 (NACE Rev. 2.1)

Other software publishing
type: Concept
Additional Content Note: This class also includes: - intermediation service activities for software publishing and software downloads
CoreContentNote: This class includes: - publishing of other software, including: • operating systems • business and other applications (e.g. distributed ledger technology (DLT), financial technologies software) • cybersecurity software • modelling software
Exclusion Note: This class excludes: - reproduction of software, see 18.20 - retail sale of non-customised software on physical media, see 47.40 - publishing of video games, see 58.21 - online provision of software, not associated with publishing, see 60.39 - operation of online gaming / video game sites, not associated with publishing, see 60.39 - development of software, not associated with publishing, see 62.10 - translation or adaptation of non-customised software for a particular market on a fee or contract basis, see 62.10 - application hosting, see 63.10 - use of published software for the provision of financial and insurance activities, see section L
broader: Software publishing
in scheme: Statistical Classification of Economic Activities in the European Community, Rev. 2.1 (NACE Rev. 2.1)
Notation: 58.29
top concept of: Statistical Classification of Economic Activities in the European Community, Rev. 2.1 (NACE Rev. 2.1)

ConceptNoneRandom0.9390814091716135
type: ConceptAssociation
description: NACE Rev. 2.1 class 27.51 is mapped to NACE Rev. 2 class 27.51
Type: 1:1
Source Concept: Manufacture of electric domestic appliances
Target Concept: http://data.europa.eu/ux2/nace2/2751
in scheme: Statistical Classification of Economic Activities in the European Community, Rev. 2.1 (NACE Rev. 2.1)
scope note: the content of the NACE Rev 2.1 class is fully covered in the corresponding NACE Rev 2 class
top concept of: Statistical Classification of Economic Activities in the European Community, Rev. 2.1 (NACE Rev. 2.1)
Mapping Cardinality: 1 1

ConceptNoneRandom0.7862105778479108
type: ConceptAssociation
description: NACE Rev. 2.1 group 53.3 is mapped to NACE Rev. 2 group 82.9
Type: 42:34
Source Concept: Intermediation service activities for postal and courier activities
Target Concept: http://data.europa.eu/ux2/nace2/829
in scheme: Statistical Classification of Economic Activities in the European Community, Rev. 2.1 (NACE Rev. 2.1)
top concept of: Statistical Classification of Economic Activities in the European Community, Rev. 2.1 (NACE Rev. 2.1)
Mapping Cardinality: n m

Motion picture projection activities
type: Concept
CoreContentNote: This class includes: - activities of motion picture or audiovisual projection in cinemas, in open air or other projection venues
broader: Motion picture, video and television programme activities
in scheme: Statistical Classification of Economic Activities in the European Community, Rev. 2.1 (NACE Rev. 2.1)
Notation: 59.14
top concept of: Statistical Classification of Economic Activities in the European Community, Rev. 2.1 (NACE Rev. 2.1)

ConceptNoneRandom0.8499033887341075
type: ConceptAssociation
description: NACE Rev. 2.1 group 79.9 is mapped to NACE Rev. 2 group 79.9
Type: 42:34
Source Concept: Other reservation service and related activities
Target Concept: http://data.europa.eu/ux2/nace2/799
in scheme: Statistical Classification of Economic Activities in the European Community, Rev. 2.1 (NACE Rev. 2.1)
top concept of: Statistical Classification of Economic Activities in the European Community, Rev. 2.1 (NACE Rev. 2.1)
Mapping Cardinality: n m

Mixed farming
type: Concept
broader: Crop and animal production, hunting and related service activities
in scheme: Statistical Classification of Economic Activities in the European Community, Rev. 2.1 (NACE Rev. 2.1)
Notation: 01.5
top concept of: Statistical Classification of Economic Activities in the European Community, Rev. 2.1 (NACE Rev. 2.1)

Manufacture of clay building materials
type: Concept
broader: Manufacture of other non-metallic mineral products
in scheme: Statistical Classification of Economic Activities in the European Community, Rev. 2.1 (NACE Rev. 2.1)
Notation: 23.3
top concept of: Statistical Classification of Economic Activities in the European Community, Rev. 2.1 (NACE Rev. 2.1)

Passenger transport by cableways and ski lifts
type: Concept
Additional Content Note: This class also includes: - freight transport by cableways
CoreContentNote: This class includes: - transport by cableways, ski lifts and chairlifts, which may include the preparation of ski slopes - passenger transport by lifts
Exclusion Note: This class excludes: - passenger rail transport for sightseeing, see 49.1 - passenger transport by funicular railway, see 49.12 - non-scheduled passenger road transport in vehicles of 10 or more persons, see 49.32 - operation of sports areas, which may include the operation of cableways, ski lifts and chairlifts, see 93.11
broader: Other passenger land transport
in scheme: Statistical Classification of Economic Activities in the European Community, Rev. 2.1 (NACE Rev. 2.1)
Notation: 49.34
top concept of: Statistical Classification of Economic Activities in the European Community, Rev. 2.1 (NACE Rev. 2.1)

ConceptNoneRandom0.8802733614699244
type: ConceptAssociation
description: NACE Rev. 2.1 class 35.14 is mapped to NACE Rev. 2 class 35.13
Type: 1:1
Source Concept: Distribution of electricity
Target Concept: http://data.europa.eu/ux2/nace2/3513
in scheme: Statistical Classification of Economic Activities in the European Community, Rev. 2.1 (NACE Rev. 2.1)
scope note: the content of the NACE Rev 2.1 class is fully covered in the corresponding NACE Rev 2 class
top concept of: Statistical Classification of Economic Activities in the European Community, Rev. 2.1 (NACE Rev. 2.1)
Mapping Cardinality: 1 1

ConceptNoneRandom0.05509884804923448
type: ConceptAssociation
description: NACE Rev. 2.1 class 59.11 is mapped to NACE Rev. 2 class 59.11
Type: 1:1
Source Concept: Motion picture, video and television programme production activities
Target Concept: http://data.europa.eu/ux2/nace2/5911
in scheme: Statistical Classification of Economic Activities in the European Community, Rev. 2.1 (NACE Rev. 2.1)
scope note: the content of the NACE Rev 2.1 class is fully covered in the corresponding NACE Rev 2 class
top concept of: Statistical Classification of Economic Activities in the European Community, Rev. 2.1 (NACE Rev. 2.1)
Mapping Cardinality: 1 1

Wholesale trade
type: Concept
Additional Content Note: This division also includes: - wholesale of motor vehicles and motorcycles, and related parts, equipment and accessories - transit trade activities
CoreContentNote: This division includes wholesale of physical goods on own account or on a fee or contract basis (commission trade) related to domestic (national) wholesale as well as international wholesale (import/export), including on the internet. Wholesale on own account means owning the goods traded until the ownership is transferred to the buyer. In the case of transit trade, the goods are commissioned by a buyer, but the agent owns the goods while they are in transit. However, both cases are classified the same way (groups 46.2 to 46.9). This division includes wholesale on a fee or contract basis (group 46.1), specialised wholesale (groups 46.2 to 46.8) and non-specialised wholesale (group 46.9); class 46.39 is an exception as it includes non-specialised wholesale of food, beverages and tobacco. The rules for defining specialised and non-specialised wholesale activities are described in paragraphs xx–xx of the introductory guidelines.
Exclusion Note: This division excludes: - trade of electricity, see 35.15 - trade of gaseous fuels for energy supply through mains, see 35.23 - rental and leasing of goods, see division 77 - packaging of solid goods and bottling of liquid or gaseous goods, including blending and filtering for third parties, see 82.92
broader: WHOLESALE AND RETAIL TRADE
in scheme: Statistical Classification of Economic Activities in the European Community, Rev. 2.1 (NACE Rev. 2.1)
Notation: 46
top concept of: Statistical Classification of Economic Activities in the European Community, Rev. 2.1 (NACE Rev. 2.1)

Repair and maintenance of footwear and leather goods
type: Concept
CoreContentNote: This class includes the repair and maintenance of footwear and leather goods: - repair of boots, shoes, luggage, etc. - fitting of heels
Exclusion Note: This class excludes: - activities of shoeshiners, see 96.99
broader: Repair and maintenance of personal and household goods
in scheme: Statistical Classification of Economic Activities in the European Community, Rev. 2.1 (NACE Rev. 2.1)
Notation: 95.23
top concept of: Statistical Classification of Economic Activities in the European Community, Rev. 2.1 (NACE Rev. 2.1)

Manufacture of underwear
type: Concept
Additional Content Note: This class also includes: - manufacture of brassieres and corsets of all types of textile materials
CoreContentNote: This class includes: - manufacture of woven underwear and nightwear, other than knitted or crocheted (e.g. underpants, briefs, pyjamas, nightdresses, dressing gowns, slips, swimwear, babies’ underwear garments)
broader: Manufacture of other wearing apparel and accessories
in scheme: Statistical Classification of Economic Activities in the European Community, Rev. 2.1 (NACE Rev. 2.1)
Notation: 14.22
top concept of: Statistical Classification of Economic Activities in the European Community, Rev. 2.1 (NACE Rev. 2.1)

Storage of electricity
type: Concept
CoreContentNote: This class includes: - conversion of electrical energy into a form of energy which can be stored, the storing of such energy, and the subsequent reconversion of such energy into electrical energy (e.g. operation of pump storage facilities, compressed air storage facilities, or battery storage facilities) - distribution of stored electricity into electricity mains/networks
Exclusion Note: This class excludes: - production of electricity not by storage, see 35.11, 35.12
broader: Electric power generation, transmission and distribution
in scheme: Statistical Classification of Economic Activities in the European Community, Rev. 2.1 (NACE Rev. 2.1)
Notation: 35.16
top concept of: Statistical Classification of Economic Activities in the European Community, Rev. 2.1 (NACE Rev. 2.1)

ConceptNoneRandom0.49837456870643493
type: ConceptAssociation
description: NACE Rev. 2.1 class 49.31 is mapped to NACE Rev. 2 classes 49.31, 49.39
Type: 6:3
Source Concept: Scheduled passenger transport by road
Target Concept: http://data.europa.eu/ux2/nace2/4939
Target Concept: http://data.europa.eu/ux2/nace2/4931
in scheme: Statistical Classification of Economic Activities in the European Community, Rev. 2.1 (NACE Rev. 2.1)
scope note: 49.31: - scheduled urban or suburban road transport of passengers by motor bus, coach, trolley bus or minibus. The transport is following a fixed time schedule, entailing the picking up and setting down of passengers at normally fixed stops 49.39: - scheduled long-distance road transport of passengers by e.g. motor bus, coach, trolley bus, minibus - operation of school buses and buses for transport of employees - scheduled passenger transport by road for sightseeing
top concept of: Statistical Classification of Economic Activities in the European Community, Rev. 2.1 (NACE Rev. 2.1)
Mapping Cardinality: n m

ConceptNoneRandom0.11032993547287295
type: ConceptAssociation
description: NACE Rev. 2.1 class 02.20 is mapped to NACE Rev. 2 class 02.20
Type: 1:1
Source Concept: Logging
Target Concept: http://data.europa.eu/ux2/nace2/0220
in scheme: Statistical Classification of Economic Activities in the European Community, Rev. 2.1 (NACE Rev. 2.1)
scope note: the content of the NACE Rev 2.1 class is fully covered in the corresponding NACE Rev 2 class
top concept of: Statistical Classification of Economic Activities in the European Community, Rev. 2.1 (NACE Rev. 2.1)
Mapping Cardinality: 1 1

Manufacture of leather clothes and fur apparel
type: Concept
CoreContentNote: This class includes: - manufacture of wearing apparel, including working clothes, made of leather or composition leather (e.g. coats, overcoats, jackets, trousers, aprons) - manufacture of articles made of fur skins: • fur wearing apparel and clothing accessories • assemblies of fur skins (e.g. ‘dropped’ fur skins, plates, mats, strips) • diverse articles of fur skins: rugs, unstuffed pouffes, industrial polishing cloths
Exclusion Note: This class excludes: - production of raw fur skins, see 01.48, 01.70 - production of raw hides and skins, see 10.11 - manufacture of imitation furs (long-hair cloth obtained by weaving or knitting), see 13.20, 13.91 - manufacture of synthetic leather outerwear, see 14.21 - manufacture of outwear trimmed with fur, see 14.21 - manufacture of working clothes not made of leather or composition of leather, see 14.23 - manufacture of fur hats, see 14.29 - dressing and dyeing of fur, see 15.11 - manufacture of boots or shoes containing fur parts, see 15.20 - manufacture of specially designed gloves of leather or composition leather for use in sport, see 32.30
broader: Manufacture of other wearing apparel and accessories
in scheme: Statistical Classification of Economic Activities in the European Community, Rev. 2.1 (NACE Rev. 2.1)
Notation: 14.24
top concept of: Statistical Classification of Economic Activities in the European Community, Rev. 2.1 (NACE Rev. 2.1)

ConceptNoneRandom0.6904080511821648
type: ConceptAssociation
description: NACE Rev. 2.1 class 27.52 is mapped to NACE Rev. 2 class 27.52
Type: 1:1
Source Concept: Manufacture of non-electric domestic appliances
Target Concept: http://data.europa.eu/ux2/nace2/2752
in scheme: Statistical Classification of Economic Activities in the European Community, Rev. 2.1 (NACE Rev. 2.1)
scope note: the content of the NACE Rev 2.1 class is fully covered in the corresponding NACE Rev 2 class
top concept of: Statistical Classification of Economic Activities in the European Community, Rev. 2.1 (NACE Rev. 2.1)
Mapping Cardinality: 1 1

ConceptNoneRandom0.6937456396097655
type: ConceptAssociation
description: NACE Rev. 2.1 group 97.0 is mapped to NACE Rev. 2 group 97.0
Type: 1:1
Source Concept: Activities of households as employers of domestic personnel
Target Concept: http://data.europa.eu/ux2/nace2/970
in scheme: Statistical Classification of Economic Activities in the European Community, Rev. 2.1 (NACE Rev. 2.1)
top concept of: Statistical Classification of Economic Activities in the European Community, Rev. 2.1 (NACE Rev. 2.1)
Mapping Cardinality: 1 1

General public administration activities
type: Concept
CoreContentNote: This class includes: - executive and legislative administration of central, regional and local bodies - activities of ministries at national and regional levels - administration and supervision of fiscal affairs: • operation of taxation schemes • duty/tax collection and tax violation investigation • customs administration - budget implementation and management of public funds and public debt: • raising and receiving of money and control of their disbursement - administration of overall (civil) research and development policy and associated funds - administration and operation of overall economic and social planning and statistical services at the various levels of government
Exclusion Note: This class excludes: - central banking, see 64.11 - operation of government-owned or government-occupied buildings, see 68.20, 68.3 - administration of research and development policies intended to increase personal well-being and of associated funds, see 84.12 - administration of research and development policies intended to improve economic performance and competitiveness, see 84.13 - administration of defence-related research and development policies and of associated funds, see 84.22 - operation of government archives, see 91.12
broader: Administration of the State and the economic, social and environmental policies of the community
in scheme: Statistical Classification of Economic Activities in the European Community, Rev. 2.1 (NACE Rev. 2.1)
Notation: 84.11
top concept of: Statistical Classification of Economic Activities in the European Community, Rev. 2.1 (NACE Rev. 2.1)

Mapping Cardinality

Support activities to agriculture and post-harvest crop activities
type: Concept
Additional Content Note: Also included are post-harvest crop activities, aimed at preparing agricultural products for the primary market.
CoreContentNote: This group includes activities incidental to agricultural production and activities similar to agriculture not undertaken for production purposes (in the sense of harvesting agricultural products), usually done on a fee or contract basis.
broader: Crop and animal production, hunting and related service activities
in scheme: Statistical Classification of Economic Activities in the European Community, Rev. 2.1 (NACE Rev. 2.1)
Notation: 01.6
top concept of: Statistical Classification of Economic Activities in the European Community, Rev. 2.1 (NACE Rev. 2.1)

Processing and preserving of meat and production of meat products
type: Concept
broader: Manufacture of food products
in scheme: Statistical Classification of Economic Activities in the European Community, Rev. 2.1 (NACE Rev. 2.1)
Notation: 10.1
top concept of: Statistical Classification of Economic Activities in the European Community, Rev. 2.1 (NACE Rev. 2.1)

Manufacture of computers and peripheral equipment
type: Concept
Additional Content Note: This class also includes: - manufacture of computer terminals, like automatic teller machines (ATMs) and point-of-sale (POS) terminals, not mechanically operated - manufacture of multifunction office equipment performing two or more of the following functions (e.g. printing, scanning, copying, telefaxing) - refilling of ink cartridges
CoreContentNote: This class includes the manufacture and/or assembly of electronic computers (for example, mainframes, desktop computers, laptops, computer servers); computer peripheral equipment (for example, storage devices, input/output devices, such as printers, monitors, keyboards). Computers can be analogue, digital, or hybrid. Digital computers, the most common type, are devices that do all of the following: (1) store the processing program or programs and the data immediately necessary for the execution of a program, (2) can be freely programmed in accordance with the requirements of the user, (3) perform arithmetical computations specified by the user and (4) execute, without human intervention, a processing program that requires the computer to modify its execution by logical decision during the processing run. Analogue computers are capable of simulating mathematical models and comprise at least analogue control and programming elements. This class includes: - manufacture of desktop computers - manufacture of laptop computers - manufacture of mainframe computers - manufacture of handheld computers - manufacture of magnetic disk drives, flash drives and other storage devices - manufacture of optical disc drives for computers - manufacture of printers - manufacture of monitors - manufacture of keyboards - manufacture of all types of mice, joysticks, and trackball accessories - manufacture of dedicated computer terminals - manufacture of computer servers - manufacture of scanners, including barcode scanners - manufacture of smart card readers - manufacture of computer projectors (video beamers) - manufacture of toner cartridges
Exclusion Note: This class excludes: - reproduction of recorded media (computer media, sound, video, etc.), see 18.20 - manufacture of electronic components and electronic assemblies used in computers and peripherals, see 26.1 - manufacture of computer modems, see 26.12 - manufacture of interface cards, modules and assemblies, see 26.12 - manufacture of printed circuit boards loaded with passive elements, see 26.12 - manufacture of modems, carrier equipment, see 26.30 - manufacture of digital communication switches, data communication equipment (e.g. bridges, routers, gateways), see 26.30 - manufacture of consumer electronic devices (e.g. CD players, DVD players, Blu-ray players), see 26.40 - manufacture of television monitors and displays, see 26.40 - manufacture of video game consoles, see 26.40 - manufacture of blank optical and magnetic media for use with computers or other devices, see 26.70 - refilling of ink and toner cartridges by retail sellers, see 47.40
broader: Manufacture of computers and peripheral equipment
in scheme: Statistical Classification of Economic Activities in the European Community, Rev. 2.1 (NACE Rev. 2.1)
Notation: 26.20
top concept of: Statistical Classification of Economic Activities in the European Community, Rev. 2.1 (NACE Rev. 2.1)

Manufacture of other porcelain and ceramic products
type: Concept
CoreContentNote: This group includes the manufacture of final products from mined or quarried non-metallic minerals (for example, sand, gravel, stone or clay).
broader: Manufacture of other non-metallic mineral products
in scheme: Statistical Classification of Economic Activities in the European Community, Rev. 2.1 (NACE Rev. 2.1)
Notation: 23.4
top concept of: Statistical Classification of Economic Activities in the European Community, Rev. 2.1 (NACE Rev. 2.1)

ConceptNoneRandom0.8225562064462324
type: ConceptAssociation
description: NACE Rev. 2.1 class 36.00 is mapped to NACE Rev. 2 class 36.00
Type: 1:1
Source Concept: Water collection, treatment and supply
Target Concept: http://data.europa.eu/ux2/nace2/3600
in scheme: Statistical Classification of Economic Activities in the European Community, Rev. 2.1 (NACE Rev. 2.1)
scope note: the content of the NACE Rev 2.1 class is fully covered in the corresponding NACE Rev 2 class
top concept of: Statistical Classification of Economic Activities in the European Community, Rev. 2.1 (NACE Rev. 2.1)
Mapping Cardinality: 1 1

Retail trade
type: Concept
Additional Content Note: This division also includes the retail sale of goods sold primarily to the general public from displayed merchandise (for example, personal computers, stationery, paint or timber), although these products may not be for personal or household use. Handling that is customary in trade does not affect the basic character of the merchandise and may include, for example, sorting, separating, mixing and packaging, delivery and installation of goods as well as sales promotion for their customers, if supplied by the same trader. This division also includes: - retail sale of automotive fuel and lubricating or cooling products - activities of retail auctioneering houses for both new and used third-party goods, including internet retail auctions - activities of units providing intermediation service activities for specialised or non-specialised retail sale (marketplaces) that facilitate transactions between buyers and sellers for the ordering and/or delivering of physical goods for a fee or commission, without taking ownership of the goods that are intermediated. These activities can be carried out on digital platforms or through non-digital channels (see group 47.9) - vending machines selling goods other than food and drinks - vending machines selling food and drinks prepared by the machine itself
CoreContentNote: This division includes the resale (sale without transformation or after minor alterations or usual handling, for example reconditioning) of new and used physical goods to the general public for personal or household consumption or use, by shops, department stores, consumer cooperative, stalls, mail order houses, the internet, door-to-door salespersons, hawkers, vending machines, and so on. This division includes the retail sale of new and used motor vehicles and motorcycles, including electric vehicles. The classification of retail sale activities is done based on traded goods and not according to the way of selling (in-store, online, via stalls and markets, and so on). Retail sale activities are divided into specialised retail sale activities (groups 47.2 to 47.8) and non-specialised retail sale activities (group 47.1). Retail sale includes the retail sale of second-hand goods (class 47.79). The above groups are further subdivided by the range of products sold. Activities of intermediation in retail sale, which facilitate transactions between buyers and sellers for the ordering and/or delivering of goods for a fee or commission, without taking ownership of the goods, are classified in group 47.9. All other retail sale activities, even if the retailer is acting on behalf of a third party, are classified in groups 47.1 to 47.8. The goods sold in this division are limited to goods usually referred to as consumer goods or retail goods. Therefore, goods not normally entering retail sale (for example, cereal grains, ores, industrial machinery) are excluded. Downloads (for example, books, videos) are also excluded. The rules for defining specialised and non-specialised retail sale activities are described in paragraphs xx–xx of the introductory guidelines.
Exclusion Note: This division excludes: - sale of farmers’ products by farmers, see division 01 - manufacture and sale of goods, which is generally classified as manufacturing in divisions 10 to 32 - trade in cereal grains, ores, crude petroleum, industrial chemicals, iron and steel, and industrial machinery and equipment, see division 46 - sale of food and drinks for consumption on the premises and sale of takeaway food, see division 56 - the commerce of digital goods, streaming and downloading of contents on digital platforms (e.g. e-books, audio) are included in section J - rental and leasing of motor vehicles or motorcycles, see 77.1 - rental and leasing of personal and household goods to the general public, see 77.2
broader: WHOLESALE AND RETAIL TRADE
in scheme: Statistical Classification of Economic Activities in the European Community, Rev. 2.1 (NACE Rev. 2.1)
Notation: 47
top concept of: Statistical Classification of Economic Activities in the European Community, Rev. 2.1 (NACE Rev. 2.1)

ConceptNoneRandom0.6368990509709203
type: ConceptAssociation
description: NACE Rev. 2.1 class 64.92 is mapped to NACE Rev. 2 classes 64.92, 64.99
Type: 4:3
Source Concept: Other credit granting
Target Concept: http://data.europa.eu/ux2/nace2/6499
Target Concept: http://data.europa.eu/ux2/nace2/6492
in scheme: Statistical Classification of Economic Activities in the European Community, Rev. 2.1 (NACE Rev. 2.1)
scope note: 64.92: - financial service activities primarily concerned with making intermediation by incurring liabilities, in forms other than currency, deposits or close substitutes for deposits, where the granting of credit can take a variety of forms, e.g. loans, mortgages, credit cards, providing the following types of services: • granting of consumer credit by non-depository institutions • international trade financing • provision of long-term finance to industry • provision of banking-like services without banking license, in co-operation with a licensed bank • money lending outside the banking system • credit granting by specialised non-depository institutions, e.g. for house purchases • loan securitisation • factoring and supply chain financing activities • activities of pawnbrokers 64.99: - factoring activities
top concept of: Statistical Classification of Economic Activities in the European Community, Rev. 2.1 (NACE Rev. 2.1)
Mapping Cardinality: n m

ConceptNoneRandom0.4551026380619919
type: ConceptAssociation
description: NACE Rev. 2.1 class 35.15 is mapped to NACE Rev. 2 class 35.14
Type: 3:2
Source Concept: Trade of electricity
Target Concept: http://data.europa.eu/ux2/nace2/3514
in scheme: Statistical Classification of Economic Activities in the European Community, Rev. 2.1 (NACE Rev. 2.1)
scope note: the content of the NACE Rev 2.1 class is fully covered in the corresponding NACE Rev 2 class
top concept of: Statistical Classification of Economic Activities in the European Community, Rev. 2.1 (NACE Rev. 2.1)
Mapping Cardinality: n m

ConceptNoneRandom0.45196906040632934
type: ConceptAssociation
description: NACE Rev. 2.1 class 12.00 is mapped to NACE Rev. 2 class 12.00
Type: 1:1
Source Concept: Manufacture of tobacco products
Target Concept: http://data.europa.eu/ux2/nace2/1200
in scheme: Statistical Classification of Economic Activities in the European Community, Rev. 2.1 (NACE Rev. 2.1)
scope note: the content of the NACE Rev 2.1 class is fully covered in the corresponding NACE Rev 2 class
top concept of: Statistical Classification of Economic Activities in the European Community, Rev. 2.1 (NACE Rev. 2.1)
Mapping Cardinality: 1 1

Repair and maintenance of furniture and home furnishings
type: Concept
CoreContentNote: This class includes: - reupholstering, refinishing and repairing of furniture and home furnishings, including office furniture - assembly of self-standing furniture
broader: Repair and maintenance of personal and household goods
in scheme: Statistical Classification of Economic Activities in the European Community, Rev. 2.1 (NACE Rev. 2.1)
Notation: 95.24
top concept of: Statistical Classification of Economic Activities in the European Community, Rev. 2.1 (NACE Rev. 2.1)

Research and experimental development on natural sciences and engineering
type: Concept
Additional Content Note: This class also includes: - DNA sequencing for general research on biological processes
CoreContentNote: This class includes: - research and experimental development on natural sciences and engineering: • research and development on natural sciences • research and development on engineering and technology • research and development on medical, health and life, and veterinary sciences • research and development on biotechnology • research and development on agricultural, forestry and fisheries sciences • interdisciplinary research and development, predominantly on natural sciences and engineering
Exclusion Note: This class excludes: - DNA sequencing for ruling out or curing a specific disease, see 86.91
broader: Research and experimental development on natural sciences and engineering
in scheme: Statistical Classification of Economic Activities in the European Community, Rev. 2.1 (NACE Rev. 2.1)
Notation: 72.10
top concept of: Statistical Classification of Economic Activities in the European Community, Rev. 2.1 (NACE Rev. 2.1)

Water collection, treatment and supply
type: Concept
Additional Content Note: This class also includes: - operation of irrigation canals - rental and leasing of water distribution networks
CoreContentNote: This class includes: - abstraction of water from rivers, lakes and groundwater - treatment of water for the water supply - desalting of sea or groundwater to produce water as the principal product of interest - distribution of water through mains, by trucks or other means - rainwater collection
Exclusion Note: This class excludes: - provision of irrigation services for agricultural purposes, see 01.61 - production of natural mineral waters and other bottled waters, see 11.07 - treatment of wastewater in order to prevent pollution, see 37.00 - installation of water meters, see 43.22 - transport of water via pipelines, not through mains, see 49.50 - water meter reading by third parties, see 82.99
broader: Water collection, treatment and supply
in scheme: Statistical Classification of Economic Activities in the European Community, Rev. 2.1 (NACE Rev. 2.1)
Notation: 36.00
top concept of: Statistical Classification of Economic Activities in the European Community, Rev. 2.1 (NACE Rev. 2.1)

ConceptNoneRandom0.8001351994972214
type: ConceptAssociation
description: NACE Rev. 2.1 class 88.91 is mapped to NACE Rev. 2 class 88.91
Type: 2:2
Source Concept: Child day-care activities
Target Concept: http://data.europa.eu/ux2/nace2/8891
in scheme: Statistical Classification of Economic Activities in the European Community, Rev. 2.1 (NACE Rev. 2.1)
scope note: the content of the NACE Rev 2.1 class is fully covered in the corresponding NACE Rev 2 class
top concept of: Statistical Classification of Economic Activities in the European Community, Rev. 2.1 (NACE Rev. 2.1)
Mapping Cardinality: n m

ConceptNoneRandom0.7642878192416852
type: ConceptAssociation
description: NACE Rev. 2.1 class 85.40 is mapped to NACE Rev. 2 class 85.42
Type: 1:1
Source Concept: Tertiary education
Target Concept: http://data.europa.eu/ux2/nace2/8542
in scheme: Statistical Classification of Economic Activities in the European Community, Rev. 2.1 (NACE Rev. 2.1)
scope note: the content of the NACE Rev 2.1 class is fully covered in the corresponding NACE Rev 2 class
top concept of: Statistical Classification of Economic Activities in the European Community, Rev. 2.1 (NACE Rev. 2.1)
Mapping Cardinality: 1 1

Trade of electricity
type: Concept
Additional Content Note: This class also includes: - operation of charging facilities for electric vehicles (e.g. electric cars, motorcycles, bicycles) - operation of charging facilities for electronic devices (e.g. mobile telephones, laptops)
CoreContentNote: This class includes: - sale of electricity on own account
Exclusion Note: This class excludes: - sale of electricity on the account of others, see 35.40
broader: Electric power generation, transmission and distribution
in scheme: Statistical Classification of Economic Activities in the European Community, Rev. 2.1 (NACE Rev. 2.1)
Notation: 35.15
top concept of: Statistical Classification of Economic Activities in the European Community, Rev. 2.1 (NACE Rev. 2.1)

ConceptNoneRandom0.20090557670320297
type: ConceptAssociation
description: NACE Rev. 2.1 class 95.22 is mapped to NACE Rev. 2 class 95.22
Type: 1:1
Source Concept: Repair and maintenance of household appliances and home and garden equipment
Target Concept: http://data.europa.eu/ux2/nace2/9522
in scheme: Statistical Classification of Economic Activities in the European Community, Rev. 2.1 (NACE Rev. 2.1)
scope note: the content of the NACE Rev 2.1 class is fully covered in the corresponding NACE Rev 2 class
top concept of: Statistical Classification of Economic Activities in the European Community, Rev. 2.1 (NACE Rev. 2.1)
Mapping Cardinality: 1 1

Other financial service activities, except insurance and pension funding n.e.c.
type: Concept
Additional Content Note: This class also includes: - dealing in financial markets on own account - trade of receivables on own account - security and derivate dealers (operating on own account) - activities of financial vehicle corporations other than securitisation - securitisation transactions of assets other than loans by issuing financial instruments - trade of swaps or options on own account - trade of commodity contracts on own account - issuing of crypto-assets with a corresponding liability (not by a monetary authority) - trading of crypto-assets with a corresponding liability on own account - exchange of currency on own account
CoreContentNote: This class includes: - other financial service activities primarily concerned with distributing funds other than by granting loans: • writing of swaps, options and other hedging arrangements • activities of viatical settlement companies - own account investment and trading activities (e.g. by venture capital companies, investment clubs) - acting as a counterparty for the clearing and settlement of transactions
Exclusion Note: This class excludes: - issuing of crypto-assets without a corresponding liability (not by a monetary authority), see 63.10 - financial leasing, see 64.91 - loan securitisation, see 64.92 - security and commodity contracts dealing on behalf of others (brokerage), see 66.12 - exchange of currency on a fee basis (e.g. bureaux de change), see 66.12 - brokerage of crypto-assets with liabilities that qualify as securities, see 66.12 - mortgage brokerage, see 66.19 - management of investment funds, see 66.30 - trade, leasing and rental of real estate property, see division 68 - bill collection without debt buying up, see 82.91 - grant-giving activities by membership organisations, see 94.99
broader: Other financial service activities, except insurance and pension funding
in scheme: Statistical Classification of Economic Activities in the European Community, Rev. 2.1 (NACE Rev. 2.1)
Notation: 64.99
top concept of: Statistical Classification of Economic Activities in the European Community, Rev. 2.1 (NACE Rev. 2.1)

ConceptNoneRandom0.5361150204279052
type: ConceptAssociation
description: NACE Rev. 2.1 group 53.1 is mapped to NACE Rev. 2 group 53.1
Type: 1:1
Source Concept: Postal activities under universal service obligation
Target Concept: http://data.europa.eu/ux2/nace2/531
in scheme: Statistical Classification of Economic Activities in the European Community, Rev. 2.1 (NACE Rev. 2.1)
top concept of: Statistical Classification of Economic Activities in the European Community, Rev. 2.1 (NACE Rev. 2.1)
Mapping Cardinality: 1 1

Manufacture of glass and glass products
type: Concept
CoreContentNote: This group includes glass in all its forms, made by any process, and articles of glass.
broader: Manufacture of other non-metallic mineral products
in scheme: Statistical Classification of Economic Activities in the European Community, Rev. 2.1 (NACE Rev. 2.1)
Notation: 23.1
top concept of: Statistical Classification of Economic Activities in the European Community, Rev. 2.1 (NACE Rev. 2.1)

ConceptNoneRandom0.6783713605927397
type: ConceptAssociation
description: NACE Rev. 2.1 division 61 is mapped to NACE Rev. 2 divisions 61, 82
Type: 48:49
Source Concept: Telecommunication
Target Concept: http://data.europa.eu/ux2/nace2/82
Target Concept: http://data.europa.eu/ux2/nace2/61
in scheme: Statistical Classification of Economic Activities in the European Community, Rev. 2.1 (NACE Rev. 2.1)
top concept of: Statistical Classification of Economic Activities in the European Community, Rev. 2.1 (NACE Rev. 2.1)
Mapping Cardinality: n m

Software publishing
type: Concept
Additional Content Note: This group also includes: - intermediation service activities for software publishing and operation of marketplaces for software downloads
CoreContentNote: This group includes the publishing of software (for example, operating systems, business and financial technologies software and applications, video games). Development and continuous updating of self-published video games and software are included here.
broader: Publishing activities
in scheme: Statistical Classification of Economic Activities in the European Community, Rev. 2.1 (NACE Rev. 2.1)
Notation: 58.2
top concept of: Statistical Classification of Economic Activities in the European Community, Rev. 2.1 (NACE Rev. 2.1)

Land transport and transport via pipelines
type: Concept
CoreContentNote: This division includes the transport of passengers and freight by road or rail. The activities include the transport of passengers, whether for personal, professional or recreational reasons. It also includes the transport of goods via road, rail or pipelines.
broader: TRANSPORTATION AND STORAGE
in scheme: Statistical Classification of Economic Activities in the European Community, Rev. 2.1 (NACE Rev. 2.1)
Notation: 49
top concept of: Statistical Classification of Economic Activities in the European Community, Rev. 2.1 (NACE Rev. 2.1)

Manufacture of other electrical equipment
type: Concept
broader: Manufacture of electrical equipment
in scheme: Statistical Classification of Economic Activities in the European Community, Rev. 2.1 (NACE Rev. 2.1)
Notation: 27.9
top concept of: Statistical Classification of Economic Activities in the European Community, Rev. 2.1 (NACE Rev. 2.1)

ConceptNoneRandom0.7117719209150892
type: ConceptAssociation
description: NACE Rev. 2.1 class 14.22 is mapped to NACE Rev. 2 classes 14.14, 14.19
Type: 4:5
Source Concept: Manufacture of underwear
Target Concept: http://data.europa.eu/ux2/nace2/1414
Target Concept: http://data.europa.eu/ux2/nace2/1419
in scheme: Statistical Classification of Economic Activities in the European Community, Rev. 2.1 (NACE Rev. 2.1)
scope note: 14.14: - manufacture of woven underwear and nightwear, other than knitted or crocheted (e.g. underpants, briefs, pyjamas, nightdresses, dressing gowns, slips, swimwear, babies’ underwear garments) - manufacture of brassieres and corsets of all types of textile materials, 14.19: - manufacture of babies' underwear garments, other than knitted or crocheted - manufacture of swimwear, other than knitted or crocheted
top concept of: Statistical Classification of Economic Activities in the European Community, Rev. 2.1 (NACE Rev. 2.1)
Mapping Cardinality: n m

Manufacture of non-electric domestic appliances
type: Concept
CoreContentNote: This class includes: - manufacture of domestic non-electric cooking and heating equipment: • non-electric space heaters, cooking ranges, grates, stoves, water heaters, cooking appliances, plate warmers, barbecues
Exclusion Note: This class excludes: - manufacture of central heating boilers and solar water heaters, see 28.21
broader: Manufacture of domestic appliances
in scheme: Statistical Classification of Economic Activities in the European Community, Rev. 2.1 (NACE Rev. 2.1)
Notation: 27.52
top concept of: Statistical Classification of Economic Activities in the European Community, Rev. 2.1 (NACE Rev. 2.1)

ConceptNoneRandom0.4577038003396118
type: ConceptAssociation
description: NACE Rev. 2.1 class 72.10 is mapped to NACE Rev. 2 classes 72.11, 72.19
Type: 1:2
Source Concept: Research and experimental development on natural sciences and engineering
Target Concept: http://data.europa.eu/ux2/nace2/7219
Target Concept: http://data.europa.eu/ux2/nace2/7211
in scheme: Statistical Classification of Economic Activities in the European Community, Rev. 2.1 (NACE Rev. 2.1)
scope note: 72.11: - research and experimental development on natural sciences and engineering: • research and development on biotechnology - DNA sequencing for general research on biological processes 72.19: - research and experimental development on natural sciences and engineering: • research and development on natural sciences • research and development on engineering and technology • research and development on medical, health and life, and veterinary sciences • research and development on agricultural, forestry and fisheries sciences • interdisciplinary research and development, predominantly on natural sciences and engineering
top concept of: Statistical Classification of Economic Activities in the European Community, Rev. 2.1 (NACE Rev. 2.1)
Mapping Cardinality: 1 m

Plant propagation
type: Concept
broader: Crop and animal production, hunting and related service activities
in scheme: Statistical Classification of Economic Activities in the European Community, Rev. 2.1 (NACE Rev. 2.1)
Notation: 01.3
top concept of: Statistical Classification of Economic Activities in the European Community, Rev. 2.1 (NACE Rev. 2.1)

ConceptNoneRandom0.7508443325373698
type: ConceptAssociation
description: NACE Rev. 2.1 class 35.11 is mapped to NACE Rev. 2 class 35.11
Type: 3:1
Source Concept: Production of electricity from non-renewable sources
Target Concept: http://data.europa.eu/ux2/nace2/3511
in scheme: Statistical Classification of Economic Activities in the European Community, Rev. 2.1 (NACE Rev. 2.1)
scope note: the content of the NACE Rev 2.1 class is fully covered in the corresponding NACE Rev 2 class
top concept of: Statistical Classification of Economic Activities in the European Community, Rev. 2.1 (NACE Rev. 2.1)
Mapping Cardinality: n 1

ConceptNoneRandom0.8002089169920877
type: ConceptAssociation
description: NACE Rev. 2.1 class 35.12 is mapped to NACE Rev. 2 class 35.11
Type: 3:1
Source Concept: Production of electricity from renewable sources
Target Concept: http://data.europa.eu/ux2/nace2/3511
in scheme: Statistical Classification of Economic Activities in the European Community, Rev. 2.1 (NACE Rev. 2.1)
scope note: the content of the NACE Rev 2.1 class is fully covered in the corresponding NACE Rev 2 class
top concept of: Statistical Classification of Economic Activities in the European Community, Rev. 2.1 (NACE Rev. 2.1)
Mapping Cardinality: n 1

ConceptNoneRandom0.9296951059758443
type: ConceptAssociation
description: NACE Rev. 2.1 class 14.21 is mapped to NACE Rev. 2 classes 14.13, 14.14, 14.19
Type: 4:5
Source Concept: Manufacture of outerwear
Target Concept: http://data.europa.eu/ux2/nace2/1414
Target Concept: http://data.europa.eu/ux2/nace2/1419
Target Concept: http://data.europa.eu/ux2/nace2/1413
in scheme: Statistical Classification of Economic Activities in the European Community, Rev. 2.1 (NACE Rev. 2.1)
scope note: 14.13: - manufacture of outerwear, other than knitted or crocheted e.g. coats, suits, ensembles, jackets, trousers, skirts - bridal dresses and other clothes for ceremony - custom tailoring 14.14: - manufacture of shirts, T-shirts, blouses, other than knitted or crocheted 14.19: - manufacture of babies' garments other than knitted or crocheted, only outerwear
top concept of: Statistical Classification of Economic Activities in the European Community, Rev. 2.1 (NACE Rev. 2.1)
Mapping Cardinality: n m

ConceptNoneRandom0.14517504932428205
type: ConceptAssociation
description: NACE Rev. 2.1 class 64.91 is mapped to NACE Rev. 2 class 64.91
Type: 1:1
Source Concept: Financial leasing
Target Concept: http://data.europa.eu/ux2/nace2/6491
in scheme: Statistical Classification of Economic Activities in the European Community, Rev. 2.1 (NACE Rev. 2.1)
scope note: the content of the NACE Rev 2.1 class is fully covered in the corresponding NACE Rev 2 class
top concept of: Statistical Classification of Economic Activities in the European Community, Rev. 2.1 (NACE Rev. 2.1)
Mapping Cardinality: 1 1

Repair and maintenance of consumer electronics
type: Concept
CoreContentNote: This class includes the repair and maintenance of consumer electronics: - repair of consumer electronics: • television, radio receivers • audio and video players • household-type video cameras and photographic equipment • video game devices
broader: Repair and maintenance of personal and household goods
in scheme: Statistical Classification of Economic Activities in the European Community, Rev. 2.1 (NACE Rev. 2.1)
Notation: 95.21
top concept of: Statistical Classification of Economic Activities in the European Community, Rev. 2.1 (NACE Rev. 2.1)

ConceptNoneRandom0.218098091117769
type: ConceptAssociation
description: NACE Rev. 2.1 class 23.14 is mapped to NACE Rev. 2 class 23.14
Type: 1:1
Source Concept: Manufacture of glass fibres
Target Concept: http://data.europa.eu/ux2/nace2/2314
in scheme: Statistical Classification of Economic Activities in the European Community, Rev. 2.1 (NACE Rev. 2.1)
scope note: the content of the NACE Rev 2.1 class is fully covered in the corresponding NACE Rev 2 class
top concept of: Statistical Classification of Economic Activities in the European Community, Rev. 2.1 (NACE Rev. 2.1)
Mapping Cardinality: 1 1

ConceptNoneRandom0.6339831558082009
type: ConceptAssociation
description: NACE Rev. 2.1 class 47.11 is mapped to NACE Rev. 2 classes 47.11, 47.81, 47.91, 47.99
Type: 78:65
Source Concept: Non-specialised retail sale of predominately food, beverages or tobacco
Target Concept: http://data.europa.eu/ux2/nace2/4791
Target Concept: http://data.europa.eu/ux2/nace2/4781
Target Concept: http://data.europa.eu/ux2/nace2/4711
Target Concept: http://data.europa.eu/ux2/nace2/4799
in scheme: Statistical Classification of Economic Activities in the European Community, Rev. 2.1 (NACE Rev. 2.1)
scope note: 47.11: - retail sale of a large variety of goods (e.g. wearing apparel, furniture, appliances, hardware, cosmetics) among which, however, food products, beverages or tobacco should be predominant 47.81: - retail sale via stalls and markets of a large variety of goods (e.g. wearing apparel, furniture, appliances, hardware, cosmetics) among which, however, food products, beverages or tobacco should be predominant 47.91: - retail sale via mail order houses or via Internet of a large variety of goods (e.g. wearing apparel, furniture, appliances, hardware, cosmetics) among which, however, food products, beverages or tobacco should be predominant 47.99: - retail sale not in stores, stalls or markets of a large variety of goods (e.g. wearing apparel, furniture, appliances, hardware, cosmetics) among which, however, food products, beverages or tobacco should be predominant
top concept of: Statistical Classification of Economic Activities in the European Community, Rev. 2.1 (NACE Rev. 2.1)
Mapping Cardinality: n m

Distribution of electricity
type: Concept
CoreContentNote: This class includes: - operation of high-voltage, medium-voltage and low-voltage distribution systems (e.g. lines, poles, meters and wiring), which convey electric power received from the generation facility or the transmission system to the end user - rental and leasing of electricity distribution networks - distribution of electricity into electricity mains/networks
broader: Electric power generation, transmission and distribution
in scheme: Statistical Classification of Economic Activities in the European Community, Rev. 2.1 (NACE Rev. 2.1)
Notation: 35.14
top concept of: Statistical Classification of Economic Activities in the European Community, Rev. 2.1 (NACE Rev. 2.1)

ConceptNoneRandom0.5724534887565084
type: ConceptAssociation
description: NACE Rev. 2.1 group 75.0 is mapped to NACE Rev. 2 group 75.0
Type: 1:1
Source Concept: Veterinary activities
Target Concept: http://data.europa.eu/ux2/nace2/750
in scheme: Statistical Classification of Economic Activities in the European Community, Rev. 2.1 (NACE Rev. 2.1)
top concept of: Statistical Classification of Economic Activities in the European Community, Rev. 2.1 (NACE Rev. 2.1)
Mapping Cardinality: 1 1

ConceptNoneRandom0.9469028670536925
type: ConceptAssociation
description: NACE Rev. 2.1 class 95.21 is mapped to NACE Rev. 2 class 95.21
Type: 1:1
Source Concept: Repair and maintenance of consumer electronics
Target Concept: http://data.europa.eu/ux2/nace2/9521
in scheme: Statistical Classification of Economic Activities in the European Community, Rev. 2.1 (NACE Rev. 2.1)
scope note: the content of the NACE Rev 2.1 class is fully covered in the corresponding NACE Rev 2 class
top concept of: Statistical Classification of Economic Activities in the European Community, Rev. 2.1 (NACE Rev. 2.1)
Mapping Cardinality: 1 1

ConceptNoneRandom0.9038507113291184
type: ConceptAssociation
description: NACE Rev. 2.1 division 60 is mapped to NACE Rev. 2 divisions 47, 60, 63
Type: 48:49
Source Concept: Programming, broadcasting, news agency and other content distribution activities
Target Concept: http://data.europa.eu/ux2/nace2/63
Target Concept: http://data.europa.eu/ux2/nace2/60
Target Concept: http://data.europa.eu/ux2/nace2/47
in scheme: Statistical Classification of Economic Activities in the European Community, Rev. 2.1 (NACE Rev. 2.1)
top concept of: Statistical Classification of Economic Activities in the European Community, Rev. 2.1 (NACE Rev. 2.1)
Mapping Cardinality: n m

ConceptNoneRandom0.4137347573516047
type: ConceptAssociation
description: NACE Rev. 2.1 group 53.2 is mapped to NACE Rev. 2 groups 53.2, 96.0
Type: 26:18
Source Concept: Other postal and courier activities
Target Concept: http://data.europa.eu/ux2/nace2/532
Target Concept: http://data.europa.eu/ux2/nace2/960
in scheme: Statistical Classification of Economic Activities in the European Community, Rev. 2.1 (NACE Rev. 2.1)
top concept of: Statistical Classification of Economic Activities in the European Community, Rev. 2.1 (NACE Rev. 2.1)
Mapping Cardinality: n m

Manufacture of refractory products
type: Concept
broader: Manufacture of other non-metallic mineral products
in scheme: Statistical Classification of Economic Activities in the European Community, Rev. 2.1 (NACE Rev. 2.1)
Notation: 23.2
top concept of: Statistical Classification of Economic Activities in the European Community, Rev. 2.1 (NACE Rev. 2.1)

Manufacture of electric domestic appliances
type: Concept
CoreContentNote: This class includes: - manufacture of domestic electric appliances: • refrigerators • freezers • dishwashers • washing and drying machines • vacuum cleaners • floor polishers • waste disposal units • grinders, blenders, juice squeezers • tin openers • electric shavers, electric toothbrushes and other electric personal care devices • knife sharpeners • ventilating or recycling hoods - manufacture of domestic electrothermic appliances: • electric water heaters • electric blankets • electric hairdryers, combs, brushes, curlers • electric smoothing irons • space heaters and household-type fans, portable • electric ovens • microwave ovens • cookers, hotplates • toasters • electric barbecues • coffee or tea makers • frying pans, roasters, hoods • electric heating resistors, etc. • table, floor, wall, window, ceiling or roof fans
Exclusion Note: This class excludes: - manufacture of non-electric space heaters, see 27.52 - manufacture of commercial and industrial refrigerators and freezers, room air conditioners, attic fans, permanently mounted space heaters, commercial ventilation and exhaust fans, commercial-type cooking equipment; commercial-type laundry, dry-cleaning and pressing equipment; commercial, industrial and institutional vacuum cleaners, see division 28 - manufacture of permanently mounted central heating equipment, see 28.21 - manufacture of household-type sewing machines, see 28.94 - installation of central vacuum cleaning systems, see 43.24
broader: Manufacture of domestic appliances
in scheme: Statistical Classification of Economic Activities in the European Community, Rev. 2.1 (NACE Rev. 2.1)
Notation: 27.51
top concept of: Statistical Classification of Economic Activities in the European Community, Rev. 2.1 (NACE Rev. 2.1)

Animal production
type: Concept
CoreContentNote: This group includes: - farming (husbandry, raising) and breeding of all animals, except aquatic animals
Exclusion Note: This group excludes: - farm animal boarding and care, see 01.62 - production of hides and skins from slaughterhouses, see 10.11
broader: Crop and animal production, hunting and related service activities
in scheme: Statistical Classification of Economic Activities in the European Community, Rev. 2.1 (NACE Rev. 2.1)
Notation: 01.4
top concept of: Statistical Classification of Economic Activities in the European Community, Rev. 2.1 (NACE Rev. 2.1)

Crop and animal production, hunting and related service activities
type: Concept
Additional Content Note: This division also includes service activities incidental to agriculture, as well as hunting, trapping and related activities.
CoreContentNote: This division includes two basic activities, namely the production of crop products and the production of animal products. Mixed farming (group 01.5) breaks with the usual principles for identifying the main activity. It accepts that many agricultural units have a reasonably balanced production of crops and animals, and that it would be arbitrary to classify them in one category or the other. This division includes the soilless cultivation of crops, such as using hydroponic and aquaponic methods.
Exclusion Note: Agricultural activities exclude any subsequent processing of the agricultural products (classified under divisions 10, 11 and 12), beyond that needed to prepare them for the primary markets. The preparation of products for the primary markets is included here. This division excludes field construction (for example, agricultural land terracing, drainage, preparing rice paddies) classified in section F and buyers and cooperative associations engaged in the marketing of farm products classified in section G. Also excluded are landscape service activities, which are classified in class 81.30.
broader: AGRICULTURE, FORESTRY AND FISHING
in scheme: Statistical Classification of Economic Activities in the European Community, Rev. 2.1 (NACE Rev. 2.1)
Notation: 01
scope note: IMPLEMENTATION RULE In agriculture, one frequent situation where the breakdown of the value added presents difficulties is when a unit manufactures a product from its own agricultural output. For example, when a unit produces grapes and manufactures wine from the own-produced grapes, or when it produces olives and manufactures oil from the own-produced olives. In these cases, the most suitable proxy variable is the number of hours worked. Applying this variable to these vertically integrated activities would generally lead to the classification of the units under agriculture. In the same case for other agricultural products, units will be classified in agriculture by convention, in order to guarantee harmonised treatment.
top concept of: Statistical Classification of Economic Activities in the European Community, Rev. 2.1 (NACE Rev. 2.1)

ConceptNoneRandom0.35338716922808744
type: ConceptAssociation
description: NACE Rev. 2.1 class 35.13 is mapped to NACE Rev. 2 class 35.12
Type: 1:1
Source Concept: Transmission of electricity
Target Concept: http://data.europa.eu/ux2/nace2/3512
in scheme: Statistical Classification of Economic Activities in the European Community, Rev. 2.1 (NACE Rev. 2.1)
scope note: the content of the NACE Rev 2.1 class is fully covered in the corresponding NACE Rev 2 class
top concept of: Statistical Classification of Economic Activities in the European Community, Rev. 2.1 (NACE Rev. 2.1)
Mapping Cardinality: 1 1

Notation Pattern

Repair and maintenance of household appliances and home and garden equipment
type: Concept
CoreContentNote: This class includes the repair and servicing of household appliances and home and garden equipment: - repair and servicing of household appliances: • refrigerators, stoves, washing machines, clothes/tumble dryers, room air conditioners, etc. - repair and servicing of home and garden equipment: • lawnmowers, edgers, snowblowers, leaf blowers, trimmers, etc.
Exclusion Note: This class excludes: - repair of handheld power tools and commercial refrigeration, see 33.12 - repair of central air-conditioning systems, see 43.22
broader: Repair and maintenance of personal and household goods
in scheme: Statistical Classification of Economic Activities in the European Community, Rev. 2.1 (NACE Rev. 2.1)
Notation: 95.22
top concept of: Statistical Classification of Economic Activities in the European Community, Rev. 2.1 (NACE Rev. 2.1)

Translation and interpretation activities
type: Concept
CoreContentNote: This class includes: - translation and interpretation of all languages, including sign language, whether spoken or written
Exclusion Note: This class excludes: - publishing translation software, see 58.29 - development of translation tools and training translation engines, see 62.10 - language teaching activities, see 85.59
broader: Translation and interpretation activities
in scheme: Statistical Classification of Economic Activities in the European Community, Rev. 2.1 (NACE Rev. 2.1)
Notation: 74.30
top concept of: Statistical Classification of Economic Activities in the European Community, Rev. 2.1 (NACE Rev. 2.1)

ConceptNoneRandom0.7888421704879474
type: ConceptAssociation
description: NACE Rev. 2.1 class 23.15 is mapped to NACE Rev. 2 class 23.19
Type: 1:1
Source Concept: Manufacture and processing of other glass, including technical glassware
Target Concept: http://data.europa.eu/ux2/nace2/2319
in scheme: Statistical Classification of Economic Activities in the European Community, Rev. 2.1 (NACE Rev. 2.1)
scope note: the content of the NACE Rev 2.1 class is fully covered in the corresponding NACE Rev 2 class
top concept of: Statistical Classification of Economic Activities in the European Community, Rev. 2.1 (NACE Rev. 2.1)
Mapping Cardinality: 1 1

Manufacture of outerwear
type: Concept
Additional Content Note: This class also includes: - bridal dresses and other clothes for ceremony - custom tailoring
CoreContentNote: This class includes: - manufacture of outerwear, other than knitted or crocheted (e.g. pullovers, cardigans, jerseys, coats, suits, ensembles, jackets, trousers, skirts, shirts, T-shirts, blouses, babies’ outerwear garments)
Exclusion Note: This class excludes: - manufacture of knitted or crocheted wearing apparel (e.g. pullovers, cardigans, jerseys, shirts, T-shirts, blouses, waistcoats, nightwear, underwear, including babies’ wear), see 14.10 - uniforms and similar official clothing, see 14.23 - manufacture of wearing apparel of rubber or plastics, see 22.12, 22.26
broader: Manufacture of other wearing apparel and accessories
in scheme: Statistical Classification of Economic Activities in the European Community, Rev. 2.1 (NACE Rev. 2.1)
Notation: 14.21
top concept of: Statistical Classification of Economic Activities in the European Community, Rev. 2.1 (NACE Rev. 2.1)

ConceptNoneRandom0.154526461254908
type: ConceptAssociation
description: NACE Rev. 2.1 class 49.34 is mapped to NACE Rev. 2 classes 49.31, 49.39
Type: 6:3
Source Concept: Passenger transport by cableways and ski lifts
Target Concept: http://data.europa.eu/ux2/nace2/4939
Target Concept: http://data.europa.eu/ux2/nace2/4931
in scheme: Statistical Classification of Economic Activities in the European Community, Rev. 2.1 (NACE Rev. 2.1)
scope note: 49.31: - transport by cableways if part of a urban or suburban transit system 49.39: - transport by cableways, ski lifts and chairlifts - passenger transport by lifts - freight transport by cableways
top concept of: Statistical Classification of Economic Activities in the European Community, Rev. 2.1 (NACE Rev. 2.1)
Mapping Cardinality: n m

Transmission of electricity
type: Concept
CoreContentNote: This class includes: - operation of high-voltage transmission systems that convey electricity from the generation facility to the distribution system
broader: Electric power generation, transmission and distribution
in scheme: Statistical Classification of Economic Activities in the European Community, Rev. 2.1 (NACE Rev. 2.1)
Notation: 35.13
top concept of: Statistical Classification of Economic Activities in the European Community, Rev. 2.1 (NACE Rev. 2.1)

ConceptNoneRandom0.14427938322196465
type: ConceptAssociation
description: NACE Rev. 2.1 group 62.2 is mapped to NACE Rev. 2 group 62.0
Type: 3:1
Source Concept: Computer consultancy and computer facilities management activities
Target Concept: http://data.europa.eu/ux2/nace2/620
in scheme: Statistical Classification of Economic Activities in the European Community, Rev. 2.1 (NACE Rev. 2.1)
top concept of: Statistical Classification of Economic Activities in the European Community, Rev. 2.1 (NACE Rev. 2.1)
Mapping Cardinality: n 1

Growing of non-perennial crops
type: Concept
CoreContentNote: This group includes the growing of non-perennial crops, in other words, plants that do not last for more than two growing seasons. Further included is the growing of these plants for the purpose of seed production.
broader: Crop and animal production, hunting and related service activities
in scheme: Statistical Classification of Economic Activities in the European Community, Rev. 2.1 (NACE Rev. 2.1)
Notation: 01.1
top concept of: Statistical Classification of Economic Activities in the European Community, Rev. 2.1 (NACE Rev. 2.1)

Transport via pipeline
type: Concept
broader: Land transport and transport via pipelines
in scheme: Statistical Classification of Economic Activities in the European Community, Rev. 2.1 (NACE Rev. 2.1)
Notation: 49.5
top concept of: Statistical Classification of Economic Activities in the European Community, Rev. 2.1 (NACE Rev. 2.1)

ConceptNoneRandom0.05636984165285941
type: ConceptAssociation
description: NACE Rev. 2.1 class 38.21 is mapped to NACE Rev. 2 classes 38.21, 38.31, 38.32
Type: 7:5
Source Concept: Materials recovery
Target Concept: http://data.europa.eu/ux2/nace2/3832
Target Concept: http://data.europa.eu/ux2/nace2/3821
Target Concept: http://data.europa.eu/ux2/nace2/3831
in scheme: Statistical Classification of Economic Activities in the European Community, Rev. 2.1 (NACE Rev. 2.1)
scope note: 38.21: - production of waste compost - production of biogas from waste, not for the purpose of gas or energy supply 38.31: - dismantling of wrecks of any type (automobiles, ships, computers, televisions and other equipment) for materials recovery 38.32: - mechanical crushing and shredding of metal waste, e.g. from used cars, washing machines or bikes - mechanical reduction of large iron pieces, e.g. railway wagons - recovery of iron from clinker - reclaiming metals out of photographic waste, e.g. fixer solution or photographic films and paper - producing of rubber powder from rubber waste and scrap, including decontamination, division (elimination) of fractions and devulcanising - sorting and mechanical processing (e.g. cleaning, grinding) of plastics to produce secondary raw material - processing (aging, cleaning, sorting) of incineration bottom ash into secondary raw materials (metals, aggregates) - crushing, cleaning and sorting of glass - crushing, cleaning and sorting of other waste, e.g. demolition waste to obtain secondary raw material - processing of food, beverage and tobacco waste and residual substances into secondary raw materials - recovery of waste oil, processing of used cooking oils and fats into secondary raw materials - extraction of silver from waste chemicals, other than by electrolytic refining - recovery of phosphorus from the incineration of sewage sludge - recovery of textile and clothing products by mechanical, thermal or chemical processes
top concept of: Statistical Classification of Economic Activities in the European Community, Rev. 2.1 (NACE Rev. 2.1)
Mapping Cardinality: n m

ConceptNoneRandom0.7520704935673068
type: ConceptAssociation
description: NACE Rev. 2.1 class 14.24 is mapped to NACE Rev. 2 classes 14.11, 14.20
Type: 1:2
Source Concept: Manufacture of leather clothes and fur apparel
Target Concept: http://data.europa.eu/ux2/nace2/1420
Target Concept: http://data.europa.eu/ux2/nace2/1411
in scheme: Statistical Classification of Economic Activities in the European Community, Rev. 2.1 (NACE Rev. 2.1)
scope note: 14.11: - manufacture of wearing apparel, including working clothes, made of leather or composition leather, e.g. coats, overcoats, jackets, trousers, aprons 14.20: - manufacture of articles made of fur skins: • fur wearing apparel and clothing accessories • assemblies of fur skins e.g. 'dropped' fur skins, plates, mats, strips • diverse articles of fur skins: rugs, unstuffed pouffes, industrial polishing cloths
top concept of: Statistical Classification of Economic Activities in the European Community, Rev. 2.1 (NACE Rev. 2.1)
Mapping Cardinality: 1 m

Manufacture and processing of other glass, including technical glassware
type: Concept
Additional Content Note: This class also includes: - manufacture of glass doors, walls, etc. - finishing of other glass, including technical glass (e.g. cutting or mechanically polishing glassware)
CoreContentNote: This class includes: - manufacture of laboratory, hygienic or pharmaceutical glassware - manufacture of clock or watch glass, optical glass and optical elements not optically worked - manufacture of glassware used in imitation jewellery - manufacture of glass insulators and glass insulating fittings - manufacture of glass envelopes for lamps - manufacture of glass figurines - manufacture of glass blocks and bricks, slabs, squares and tiles, of a kind used for building or construction purposes, and multicellular or foam glass in blocks, panels, plates, shells or similar forms - manufacture of glass in rods or tubes
Exclusion Note: This class excludes: - manufacture of optical elements optically worked, see 26.70 - manufacture of syringes and other medical laboratory equipment, see 32.50
broader: Manufacture of glass and glass products
in scheme: Statistical Classification of Economic Activities in the European Community, Rev. 2.1 (NACE Rev. 2.1)
Notation: 23.15
top concept of: Statistical Classification of Economic Activities in the European Community, Rev. 2.1 (NACE Rev. 2.1)

Logging
type: Concept
Additional Content Note: This class also includes: - gathering and production of forest harvesting residues (e.g. brushwood, stumps, wood chips from logging, other forest waste for energy) - production of charcoal in the forest (using traditional methods)
CoreContentNote: This class includes: - production of roundwood for forest-based manufacturing industries - production of roundwood used in an unprocessed form (e.g. pit-props, fence posts, utility poles)
Exclusion Note: This class excludes: - growing of Christmas trees, see 01.29 - growing of standing timber: planting, replanting, transplanting, thinning and conserving of forests, and timber tracts, see 02.10 - gathering of wild growing non-wood forest products, see 02.30 - production of wood chips and particles, not associated with forestry activities, see 16.11 - production of charcoal through distillation of wood, see 20.14
broader: Logging
in scheme: Statistical Classification of Economic Activities in the European Community, Rev. 2.1 (NACE Rev. 2.1)
Notation: 02.20
top concept of: Statistical Classification of Economic Activities in the European Community, Rev. 2.1 (NACE Rev. 2.1)

Civil engineering
type: Concept
CoreContentNote: This division includes general construction for civil engineering objects. It includes new work, repair, additions and alterations, the erection of prefabricated objects on site and also those of a temporary nature. Further included is the construction of heavy constructions (for example, motorways, roads, power plants, bridges, tunnels, railways, airfields, harbours and other water projects, irrigation systems, sewerage systems, industrial facilities, pipelines and electric lines, outdoor sports facilities). This work can be carried out on own account or on a fee or contract basis. Portions of the work and sometimes even the whole practical work can be subcontracted out.
broader: CONSTRUCTION
in scheme: Statistical Classification of Economic Activities in the European Community, Rev. 2.1 (NACE Rev. 2.1)
Notation: 42
top concept of: Statistical Classification of Economic Activities in the European Community, Rev. 2.1 (NACE Rev. 2.1)

ConceptNoneRandom0.8059930388264467
type: ConceptAssociation
description: NACE Rev. 2.1 class 03.11 is mapped to NACE Rev. 2 class 03.11
Type: 10:9
Source Concept: Marine fishing
Target Concept: http://data.europa.eu/ux2/nace2/0311
in scheme: Statistical Classification of Economic Activities in the European Community, Rev. 2.1 (NACE Rev. 2.1)
scope note: the content of the NACE Rev 2.1 class is fully covered in the corresponding NACE Rev 2 class
top concept of: Statistical Classification of Economic Activities in the European Community, Rev. 2.1 (NACE Rev. 2.1)
Mapping Cardinality: n m

Manufacture of tobacco products
type: Concept
Additional Content Note: This class also includes: - stemming and redrying of tobacco
CoreContentNote: This class includes: - manufacture of tobacco products and products of tobacco substitutes: cigarettes, fine-cut tobacco, cigars, pipe tobacco, chewing tobacco, snuff - manufacture of homogenised or reconstituted tobacco
Exclusion Note: This class excludes: - growing or preliminary processing of tobacco, see 01.15, 01.63 - manufacture of electronic cigarette vapour liquids, including closed refills, see 20.59 - manufacture of electronic cigarettes (vapes), see 32.99
broader: Manufacture of tobacco products
in scheme: Statistical Classification of Economic Activities in the European Community, Rev. 2.1 (NACE Rev. 2.1)
Notation: 12.00
top concept of: Statistical Classification of Economic Activities in the European Community, Rev. 2.1 (NACE Rev. 2.1)

Production of electricity from renewable sources
type: Concept
CoreContentNote: This class includes: - operation of generation facilities that produce electricity from renewable sources (e.g. gaseous biofuels, hydropower, on-shore and off-shore wind power, photovoltaic solar energy, thermal solar energy, geothermal energy, and tide, wave and ocean energy)
Exclusion Note: This class excludes: - production of electricity from non-renewable sources, see 35.11 - production of electricity as part of the storage of electricity activities, see 35.16 - pretreatment of waste for energy recovery, see 38.22
broader: Electric power generation, transmission and distribution
in scheme: Statistical Classification of Economic Activities in the European Community, Rev. 2.1 (NACE Rev. 2.1)
Notation: 35.12
top concept of: Statistical Classification of Economic Activities in the European Community, Rev. 2.1 (NACE Rev. 2.1)

ConceptNoneRandom0.7862076669926726
type: ConceptAssociation
description: NACE Rev. 2.1 class 28.41 is mapped to NACE Rev. 2 classes 28.41, 28.49
Type: 11:11
Source Concept: Manufacture of metal forming machinery and machine tools for metal work
Target Concept: http://data.europa.eu/ux2/nace2/2849
Target Concept: http://data.europa.eu/ux2/nace2/2841
in scheme: Statistical Classification of Economic Activities in the European Community, Rev. 2.1 (NACE Rev. 2.1)
scope note: 28.41: - manufacture of machine tools for working metals, including those using a laser beam, ultrasonic waves, plasma arc, magnetic pulse etc. - manufacture of machine tools for turning, drilling, boring, threading or tapping for working metal - manufacture of machine tools for deburring, sharpening, grinding, honing, lapping, polishing or otherwise finishing metal or cermet by means of grinding stones, abrasives or polishing products - manufacture of machining centres and multi-station machines for working metal - manufacture of machine tools for planing, shaping, slotting, broaching, gear cutting, gear grinding or gear finishing, sawing, cutting-off and of other machine tools working by removing metal or cermets - manufacture of metal stamping or pressing machine tools - manufacture of punch presses, hydraulic presses, hydraulic brakes, drop hammers, forging machines etc. - manufacture of draw-benches, thread rolling machines for working wires 28.49: - manufacture of filing machines, riveters, sheet metal cutters
top concept of: Statistical Classification of Economic Activities in the European Community, Rev. 2.1 (NACE Rev. 2.1)
Mapping Cardinality: n m

Freight air transport
type: Concept
Additional Content Note: This class also includes: - rental of air transport equipment with an operator for the purpose of freight transport
CoreContentNote: This class includes: - air transport of freight, whether scheduled or not
broader: Freight air transport and space transport
in scheme: Statistical Classification of Economic Activities in the European Community, Rev. 2.1 (NACE Rev. 2.1)
Notation: 51.21
top concept of: Statistical Classification of Economic Activities in the European Community, Rev. 2.1 (NACE Rev. 2.1)

Intermediation service activities for specialised construction services
type: Concept
CoreContentNote: This class includes the intermediation for specialised construction services by bringing clients and service providers together for a fee or commission, without the intermediary providing the specialised construction services that are intermediated. These intermediation activities can be carried out on digital platforms or through non-digital channels (including face-to-face, door-to-door, telephone, post, and so on). The fee or commission can be received from either the client or the provider of the specialised construction service. Revenue for the intermediation activities can include other sources of income (for example, revenues from the sale of advertising space).
broader: Intermediation service activities for specialised construction services
in scheme: Statistical Classification of Economic Activities in the European Community, Rev. 2.1 (NACE Rev. 2.1)
Notation: 43.60
top concept of: Statistical Classification of Economic Activities in the European Community, Rev. 2.1 (NACE Rev. 2.1)

ConceptNoneRandom0.44051018158598865
type: ConceptAssociation
description: NACE Rev. 2.1 class 32.91 is mapped to NACE Rev. 2 class 32.91
Type: 1:1
Source Concept: Manufacture of brooms and brushes
Target Concept: http://data.europa.eu/ux2/nace2/3291
in scheme: Statistical Classification of Economic Activities in the European Community, Rev. 2.1 (NACE Rev. 2.1)
scope note: the content of the NACE Rev 2.1 class is fully covered in the corresponding NACE Rev 2 class
top concept of: Statistical Classification of Economic Activities in the European Community, Rev. 2.1 (NACE Rev. 2.1)
Mapping Cardinality: 1 1

ConceptNoneRandom0.7116004371827993
type: ConceptAssociation
description: NACE Rev. 2.1 group 84.1 is mapped to NACE Rev. 2 group 84.1
Type: 1:1
Source Concept: Administration of the State and the economic, social and environmental policies of the community
Target Concept: http://data.europa.eu/ux2/nace2/841
in scheme: Statistical Classification of Economic Activities in the European Community, Rev. 2.1 (NACE Rev. 2.1)
top concept of: Statistical Classification of Economic Activities in the European Community, Rev. 2.1 (NACE Rev. 2.1)
Mapping Cardinality: 1 1

Other social work activities without accommodation n.e.c.
type: Concept
CoreContentNote: This class includes: - social, counselling, welfare, refugee, referral and similar services which are delivered to individuals and families in their homes or elsewhere and carried out by government offices or by private organisations, disaster relief organisations, national or local self-help organisations and by specialists providing counselling services: • child and youth support activities • adoption service activities, activities for the prevention of cruelty to children and others • household budget counselling, marriage and family guidance, credit and debt counselling services • community and neighbourhood activities • activities for disaster victims, refugees, immigrants, etc. • vocational rehabilitation and habilitation activities for unemployed persons provided that the education component is limited • eligibility determination in connection with welfare benefits, rent supplements or food stamps • day facilities for homeless persons and other socially vulnerable groups • fundraising or other support activities aimed at social work • cultural and intercultural mediation activities aimed at: preventing the distress of adults experiencing difficulties in social and labour market integration; removing the social marginalisation of children and adolescents; rehabilitating adults and minors in prison, on probation and out of prison; and reintegrating adults into active life • refugee resettlement activities
Exclusion Note: This class excludes: - legal mediation activities, see 69.10 - funding and administration of compulsory social security programmes, see 84.30 - activities similar to those described in this class, but including accommodation, see 87.99
broader: Other social work activities without accommodation
in scheme: Statistical Classification of Economic Activities in the European Community, Rev. 2.1 (NACE Rev. 2.1)
Notation: 88.99
top concept of: Statistical Classification of Economic Activities in the European Community, Rev. 2.1 (NACE Rev. 2.1)

Growing of perennial crops
type: Concept
CoreContentNote: This group includes the growing of perennial crops, in other words, plants that last for more than two growing seasons, either dying back after each season or growing continuously. Further included is the growing of these plants for the purpose of seed production.
Exclusion Note: This group excludes: - growing of perennial flowers and other ornamental plants, see 01.19
broader: Crop and animal production, hunting and related service activities
in scheme: Statistical Classification of Economic Activities in the European Community, Rev. 2.1 (NACE Rev. 2.1)
Notation: 01.2
top concept of: Statistical Classification of Economic Activities in the European Community, Rev. 2.1 (NACE Rev. 2.1)

Publishing of books, newspapers and other publishing activities, except software publishing
type: Concept
CoreContentNote: This group includes activities of publishing books, newspapers, magazines and other periodicals, directories, compilations, mailing lists and other works (for example, catalogues, photographs, calendars, greeting cards, postcards, forms, posters, reproductions of works of art). These works are characterised by the intellectual creativity required in their development and are usually protected by copyright. All the feasible forms of publishing (in print, digital, analogue, or any other form) are included.
broader: Publishing activities
in scheme: Statistical Classification of Economic Activities in the European Community, Rev. 2.1 (NACE Rev. 2.1)
Notation: 58.1
top concept of: Statistical Classification of Economic Activities in the European Community, Rev. 2.1 (NACE Rev. 2.1)

ConceptNoneRandom0.28679745969529846
type: ConceptAssociation
description: NACE Rev. 2.1 group 88.9 is mapped to NACE Rev. 2 group 88.9
Type: 2:2
Source Concept: Other social work activities without accommodation
Target Concept: http://data.europa.eu/ux2/nace2/889
in scheme: Statistical Classification of Economic Activities in the European Community, Rev. 2.1 (NACE Rev. 2.1)
top concept of: Statistical Classification of Economic Activities in the European Community, Rev. 2.1 (NACE Rev. 2.1)
Mapping Cardinality: n m

ConceptNoneRandom0.5998735901112162
type: ConceptAssociation
description: NACE Rev. 2.1 class 14.23 is mapped to NACE Rev. 2 class 14.12
Type: 1:1
Source Concept: Manufacture of workwear
Target Concept: http://data.europa.eu/ux2/nace2/1412
in scheme: Statistical Classification of Economic Activities in the European Community, Rev. 2.1 (NACE Rev. 2.1)
scope note: the content of the NACE Rev 2.1 class is fully covered in the corresponding NACE Rev 2 class
top concept of: Statistical Classification of Economic Activities in the European Community, Rev. 2.1 (NACE Rev. 2.1)
Mapping Cardinality: 1 1

ConceptNoneRandom0.09079489256836948
type: ConceptAssociation
description: NACE Rev. 2.1 class 71.20 is mapped to NACE Rev. 2 class 71.20
Type: 1:1
Source Concept: Technical testing and analysis
Target Concept: http://data.europa.eu/ux2/nace2/7120
in scheme: Statistical Classification of Economic Activities in the European Community, Rev. 2.1 (NACE Rev. 2.1)
scope note: the content of the NACE Rev 2.1 class is fully covered in the corresponding NACE Rev 2 class
top concept of: Statistical Classification of Economic Activities in the European Community, Rev. 2.1 (NACE Rev. 2.1)
Mapping Cardinality: 1 1

Manufacture of hollow glass
type: Concept
Additional Content Note: This class also includes: - manufacture of glass inners for vacuum vessels - cutting or otherwise decorating drinking glasses
CoreContentNote: This class includes: - manufacture of bottles and other containers of glass or crystal - manufacture of drinking glasses, glassware for table or kitchen purposes and other domestic glass or crystal articles
Exclusion Note: This class excludes: - printing onto glass, see 18.12 - manufacture of glass toys, see 32.40
broader: Manufacture of glass and glass products
in scheme: Statistical Classification of Economic Activities in the European Community, Rev. 2.1 (NACE Rev. 2.1)
Notation: 23.13
top concept of: Statistical Classification of Economic Activities in the European Community, Rev. 2.1 (NACE Rev. 2.1)

ConceptNoneRandom0.15169041354337176
type: ConceptAssociation
description: NACE Rev. 2.1 class 38.22 is mapped to NACE Rev. 2 classes 38.21, 38.22
Type: 7:5
Source Concept: Energy recovery
Target Concept: http://data.europa.eu/ux2/nace2/3821
Target Concept: http://data.europa.eu/ux2/nace2/3822
in scheme: Statistical Classification of Economic Activities in the European Community, Rev. 2.1 (NACE Rev. 2.1)
scope note: 38.21: - pre-treatment of waste for energy recovery, conversion of waste materials into e.g. usable heat or electricity, through a variety of processes, which include thermal treatment - activities of waste-to-energy plants 38.22: - pre-treatment of hazardous waste for energy recovery, conversion of waste materials into e.g. usable heat or electricity, through a variety of processes, which include thermal treatment - activities of waste-to-energy plants
top concept of: Statistical Classification of Economic Activities in the European Community, Rev. 2.1 (NACE Rev. 2.1)
Mapping Cardinality: n m

Space transport
type: Concept
CoreContentNote: This class includes: - launching of satellites and space vehicles - space transport of freight and passengers
broader: Freight air transport and space transport
in scheme: Statistical Classification of Economic Activities in the European Community, Rev. 2.1 (NACE Rev. 2.1)
Notation: 51.22
top concept of: Statistical Classification of Economic Activities in the European Community, Rev. 2.1 (NACE Rev. 2.1)

Manufacture of glass fibres
type: Concept
CoreContentNote: This class includes: - manufacture of glass fibres, including glass wool and non-woven products thereof - manufacture of products from glass fibres
Exclusion Note: This class excludes: - manufacture of woven fabrics of glass yarn, see 13.96 - manufacture of slag wool, rock wool and similar mineral wools, see 23.99 - manufacture of fibre-optic cables for data transmission or live transmission of images, see 27.31
broader: Manufacture of glass and glass products
in scheme: Statistical Classification of Economic Activities in the European Community, Rev. 2.1 (NACE Rev. 2.1)
Notation: 23.14
top concept of: Statistical Classification of Economic Activities in the European Community, Rev. 2.1 (NACE Rev. 2.1)

Other passenger land transport n.e.c.
type: Concept
CoreContentNote: This class includes: - bicycle taxi services - passenger road transport by vehicles drawn by humans or animals
Exclusion Note: This class excludes: - patient transport by ambulance, see 86.92 - transport of human remains, see 96.30
broader: Other passenger land transport
in scheme: Statistical Classification of Economic Activities in the European Community, Rev. 2.1 (NACE Rev. 2.1)
Notation: 49.39
top concept of: Statistical Classification of Economic Activities in the European Community, Rev. 2.1 (NACE Rev. 2.1)

ConceptNoneRandom0.3234759075412277
type: ConceptAssociation
description: NACE Rev. 2.1 class 58.29 is mapped to NACE Rev. 2 class 58.29
Type: 1:1
Source Concept: Other software publishing
Target Concept: http://data.europa.eu/ux2/nace2/5829
in scheme: Statistical Classification of Economic Activities in the European Community, Rev. 2.1 (NACE Rev. 2.1)
scope note: the content of the NACE Rev 2.1 class is fully covered in the corresponding NACE Rev 2 class
top concept of: Statistical Classification of Economic Activities in the European Community, Rev. 2.1 (NACE Rev. 2.1)
Mapping Cardinality: 1 1

Specialised construction activities
type: Concept
Additional Content Note: This division also includes: - specialised construction activities carried out as repair and maintenance - completion or finishing of buildings and other constructions
CoreContentNote: This division includes specialised activities (special trades) in the construction of buildings and civil engineering objects or preparation of same. These activities are usually specialised in one aspect common to different structures, requiring specialised skills or equipment. Specialised construction works are generally performed by subcontractors on behalf of a contractor whose activities fall under divisions 41 or 42. Repair is usually performed without subcontracting. Further included is the installation of all types of utilities that make the construction function as such. These activities are usually performed at the site of the construction, although parts of the job may be carried out off site. This division includes electrical, plumbing and other offshore construction installation on floating platforms. The rental of equipment with an operator is classified under the associated construction activity.
broader: CONSTRUCTION
in scheme: Statistical Classification of Economic Activities in the European Community, Rev. 2.1 (NACE Rev. 2.1)
Notation: 43
top concept of: Statistical Classification of Economic Activities in the European Community, Rev. 2.1 (NACE Rev. 2.1)

ConceptNoneRandom0.29356072244774656
type: ConceptAssociation
description: NACE Rev. 2.1 class 59.14 is mapped to NACE Rev. 2 class 59.14
Type: 1:1
Source Concept: Motion picture projection activities
Target Concept: http://data.europa.eu/ux2/nace2/5914
in scheme: Statistical Classification of Economic Activities in the European Community, Rev. 2.1 (NACE Rev. 2.1)
scope note: the content of the NACE Rev 2.1 class is fully covered in the corresponding NACE Rev 2 class
top concept of: Statistical Classification of Economic Activities in the European Community, Rev. 2.1 (NACE Rev. 2.1)
Mapping Cardinality: 1 1

ConceptNoneRandom0.0340167844492677
type: ConceptAssociation
description: NACE Rev. 2.1 class 28.42 is mapped to NACE Rev. 2 class 28.49
Type: 11:11
Source Concept: Manufacture of other machine tools
Target Concept: http://data.europa.eu/ux2/nace2/2849
in scheme: Statistical Classification of Economic Activities in the European Community, Rev. 2.1 (NACE Rev. 2.1)
scope note: the content of the NACE Rev 2.1 class is fully covered in the corresponding NACE Rev 2 class
top concept of: Statistical Classification of Economic Activities in the European Community, Rev. 2.1 (NACE Rev. 2.1)
Mapping Cardinality: n m

Production of electricity from non-renewable sources
type: Concept
CoreContentNote: This class includes: - operation of generation facilities that produce electricity from non-renewable sources (e.g. natural gas, coal and other fossil fuels), and from emission-free non-renewable sources (e.g. nuclear)
Exclusion Note: This class excludes: - production of electricity from renewable sources, see 35.12 - production of electricity as part of the storage of electricity, see 35.16 - pretreatment of waste for energy recovery, see 38.22
broader: Electric power generation, transmission and distribution
in scheme: Statistical Classification of Economic Activities in the European Community, Rev. 2.1 (NACE Rev. 2.1)
Notation: 35.11
top concept of: Statistical Classification of Economic Activities in the European Community, Rev. 2.1 (NACE Rev. 2.1)

ConceptNoneRandom0.5071461152319047
type: ConceptAssociation
description: NACE Rev. 2.1 class 26.20 is mapped to NACE Rev. 2 classes 26.20, 28.23
Type: 3:3
Source Concept: Manufacture of computers and peripheral equipment
Target Concept: http://data.europa.eu/ux2/nace2/2823
Target Concept: http://data.europa.eu/ux2/nace2/2620
in scheme: Statistical Classification of Economic Activities in the European Community, Rev. 2.1 (NACE Rev. 2.1)
scope note: 26.20: - manufacture of desktop computers - manufacture of laptop computers - manufacture of main frame computers - manufacture of hand-held computers - manufacture of magnetic disk drives, flash drives and other storage devices - manufacture of optical disc drives for computers - manufacture of printers - manufacture of monitors - manufacture of keyboards - manufacture of all types of mice, joysticks, and trackball accessories - manufacture of dedicated computer terminals - manufacture of computer servers - manufacture of scanners, including bar code scanners - manufacture of smart card readers - manufacture of computer projectors (video beamers) - manufacture of computer terminals, like automatic teller machines (ATMs) and point-of-sale (POS) terminals, not mechanically operated - manufacture of multi-function office equipment performing two or more of following functions, e.g. printing, scanning, copying, telefaxing - refilling of ink cartridges 28.23: - manufacture of toner cartridges
top concept of: Statistical Classification of Economic Activities in the European Community, Rev. 2.1 (NACE Rev. 2.1)
Mapping Cardinality: n m

ConceptNoneRandom0.13747574374043914
type: ConceptAssociation
description: NACE Rev. 2.1 class 49.32 is mapped to NACE Rev. 2 class 49.39
Type: 6:3
Source Concept: Non-scheduled passenger transport by road
Target Concept: http://data.europa.eu/ux2/nace2/4939
in scheme: Statistical Classification of Economic Activities in the European Community, Rev. 2.1 (NACE Rev. 2.1)
scope note: the content of the NACE Rev 2.1 class is fully covered in the corresponding NACE Rev 2 class
top concept of: Statistical Classification of Economic Activities in the European Community, Rev. 2.1 (NACE Rev. 2.1)
Mapping Cardinality: n m

ConceptNoneRandom0.28988683789714365
type: ConceptAssociation
description: NACE Rev. 2.1 class 96.99 is mapped to NACE Rev. 2 class 96.09
Type: 1:1
Source Concept: Other personal service activities n.e.c.
Target Concept: http://data.europa.eu/ux2/nace2/9609
in scheme: Statistical Classification of Economic Activities in the European Community, Rev. 2.1 (NACE Rev. 2.1)
scope note: the content of the NACE Rev 2.1 class is fully covered in the corresponding NACE Rev 2 class
top concept of: Statistical Classification of Economic Activities in the European Community, Rev. 2.1 (NACE Rev. 2.1)
Mapping Cardinality: 1 1

Regulation of health care, education, cultural services and other social services
type: Concept
Additional Content Note: This class also includes: - public sponsoring of recreational and cultural activities - distribution of public grants to artists - administration of potable water supply programmes - administration of waste collection and disposal operations - administration of environmental protection programmes - administration of housing programmes
CoreContentNote: This class includes: - public administration of programmes aimed to increase personal well-being, e.g.: • health • education • culture • sport • recreation • environment • housing • social services - public administration of research and development policies and associated funds for these areas
Exclusion Note: This class excludes: - sewerage, refuse disposal and remediation activities, see divisions 37, 38, 39 - compulsory social security activities, see 84.30 - education activities, see section Q - human health-related activities, see division 86 - museums and other cultural institutions, see division 91 - activities of government-operated libraries and archives, see 91.1 - sporting or other recreational activities, see division 93
broader: Administration of the State and the economic, social and environmental policies of the community
in scheme: Statistical Classification of Economic Activities in the European Community, Rev. 2.1 (NACE Rev. 2.1)
Notation: 84.12
top concept of: Statistical Classification of Economic Activities in the European Community, Rev. 2.1 (NACE Rev. 2.1)

Follows

Manufacture of domestic appliances
type: Concept
CoreContentNote: This group includes the manufacture of small electric appliances and electric housewares, household-type fans, household-type vacuum cleaners, electric household-type floor care machines, household-type cooking appliances, household-type laundry equipment, household-type refrigerators, upright and chest freezers, and other electrical and non-electrical household appliances (for example, dishwashers, water heaters, garbage disposal units). This group includes the manufacture of appliances with electric, gas or other fuel sources.
broader: Manufacture of electrical equipment
in scheme: Statistical Classification of Economic Activities in the European Community, Rev. 2.1 (NACE Rev. 2.1)
Notation: 27.5
top concept of: Statistical Classification of Economic Activities in the European Community, Rev. 2.1 (NACE Rev. 2.1)

Other passenger land transport
type: Concept
CoreContentNote: This group includes all land-based passenger transport activities other than rail transport.
broader: Land transport and transport via pipelines
in scheme: Statistical Classification of Economic Activities in the European Community, Rev. 2.1 (NACE Rev. 2.1)
Notation: 49.3
top concept of: Statistical Classification of Economic Activities in the European Community, Rev. 2.1 (NACE Rev. 2.1)

Manufacture of other wearing apparel and accessories
type: Concept
CoreContentNote: This group includes the manufacture of wearing apparel, other than knitted or crocheted. The material used may be of any kind and may be coated, impregnated or rubberised.
Exclusion Note: This group excludes: - repair of wearing apparel, see 95.29
broader: Manufacture of wearing apparel
in scheme: Statistical Classification of Economic Activities in the European Community, Rev. 2.1 (NACE Rev. 2.1)
Notation: 14.2
top concept of: Statistical Classification of Economic Activities in the European Community, Rev. 2.1 (NACE Rev. 2.1)

Shaping and processing of flat glass
type: Concept
CoreContentNote: This class includes: - manufacture of bent, edgeworked, engraved, drilled or enamelled glass sheets or profiles - manufacture of toughened or laminated safety glass - manufacture of glass mirrors - manufacture of multiple-walled insulating glass and units of glass - manufacture of coated glass - surface treatment of flat glass
Exclusion Note: This class excludes: - printing onto glass, see 18.12 - manufacture of vehicle mirrors, see 29.32
broader: Manufacture of glass and glass products
in scheme: Statistical Classification of Economic Activities in the European Community, Rev. 2.1 (NACE Rev. 2.1)
Notation: 23.12
top concept of: Statistical Classification of Economic Activities in the European Community, Rev. 2.1 (NACE Rev. 2.1)

Other non-ferrous metal production
type: Concept
CoreContentNote: This class includes: - production of unwrought chrome, manganese, nickel, etc., alloyed or not alloyed, from ores or oxides or from electrolytic and aluminothermic refining of chrome, manganese, nickel, etc., waste and scrap - manufacture of bars, rods, profiles and wire of chrome, manganese, nickel, etc. - manufacture of plates, sheets, strip and foil of chrome, manganese, nickel, etc. - production of mattes of nickel - production of other non-ferrous metals
Exclusion Note: This class excludes: - casting of non-ferrous metals, see 24.53, 24.54 - shredding of non-ferrous metal waste and scrap, see 38.21
broader: Manufacture of basic precious and other non-ferrous metals
in scheme: Statistical Classification of Economic Activities in the European Community, Rev. 2.1 (NACE Rev. 2.1)
Notation: 24.45
top concept of: Statistical Classification of Economic Activities in the European Community, Rev. 2.1 (NACE Rev. 2.1)

ConceptNoneRandom0.7950051415203304
type: ConceptAssociation
description: NACE Rev. 2.1 class 15.11 is mapped to NACE Rev. 2 class 15.11
Type: 1:1
Source Concept: Tanning, dressing, dyeing of leather and fur
Target Concept: http://data.europa.eu/ux2/nace2/1511
in scheme: Statistical Classification of Economic Activities in the European Community, Rev. 2.1 (NACE Rev. 2.1)
scope note: the content of the NACE Rev 2.1 class is fully covered in the corresponding NACE Rev 2 class
top concept of: Statistical Classification of Economic Activities in the European Community, Rev. 2.1 (NACE Rev. 2.1)
Mapping Cardinality: 1 1

Manufacture of weapons and ammunition
type: Concept
Additional Content Note: This class also includes: - manufacture of hunting, sporting or protective firearms and ammunition
CoreContentNote: This class includes: - manufacture of military weapons (e.g. artillery weapons, rocket launchers, flame-throwers, grenade launchers, torpedo tubes and similar projectors, machine guns) - manufacture of pistols, shotguns and rifles - manufacture of spring, air or gas guns and pistols, etc. - manufacture of war ammunition - manufacture of cartridges for shotguns, revolvers and pistols - manufacture of bombs, grenades, torpedoes, mines, missiles and similar munitions of war
Exclusion Note: This class excludes: - manufacture of percussion caps, detonators or signalling flares, see 20.59 - manufacture of cutlasses, swords, bayonets, etc., see 25.61 - manufacture of optical gun-sighting equipment, see 26.70 - manufacture of bodies for armoured vehicles, see 29.20 - building of military ships and vessels, see 30.13 - manufacture of military air and spacecraft, see 30.32 - manufacture of tanks and other armoured and motorised fighting vehicles, see 30.40
broader: Manufacture of weapons and ammunition
in scheme: Statistical Classification of Economic Activities in the European Community, Rev. 2.1 (NACE Rev. 2.1)
Notation: 25.30
top concept of: Statistical Classification of Economic Activities in the European Community, Rev. 2.1 (NACE Rev. 2.1)

ConceptNoneRandom0.8143304085676397
type: ConceptAssociation
description: NACE Rev. 2.1 class 59.13 is mapped to NACE Rev. 2 class 59.13
Type: 1:1
Source Concept: Motion picture and video distribution activities
Target Concept: http://data.europa.eu/ux2/nace2/5913
in scheme: Statistical Classification of Economic Activities in the European Community, Rev. 2.1 (NACE Rev. 2.1)
scope note: the content of the NACE Rev 2.1 class is fully covered in the corresponding NACE Rev 2 class
top concept of: Statistical Classification of Economic Activities in the European Community, Rev. 2.1 (NACE Rev. 2.1)
Mapping Cardinality: 1 1

Processing of nuclear fuel
type: Concept
CoreContentNote: This class includes: - production of natural uranium metal and its compounds from pitchblende or other ores - manufacture of alloys of natural uranium, dispersions (including cermets), ceramic products and mixtures containing natural uranium or natural uranium compounds - smelting and refining of natural uranium
Exclusion Note: This class excludes: - enrichment of uranium and thorium ores, see 20.13
broader: Manufacture of basic precious and other non-ferrous metals
in scheme: Statistical Classification of Economic Activities in the European Community, Rev. 2.1 (NACE Rev. 2.1)
Notation: 24.46
top concept of: Statistical Classification of Economic Activities in the European Community, Rev. 2.1 (NACE Rev. 2.1)

Repair and maintenance of watches, clocks and jewellery
type: Concept
CoreContentNote: This class includes: - repair of watches, clocks and their parts (e.g. watch cases and housings of any material) - repair of jewellery
Exclusion Note: This class excludes: - repair of time clocks, time/date stamps, time locks and similar time-recording devices, see 33.13
broader: Repair and maintenance of personal and household goods
in scheme: Statistical Classification of Economic Activities in the European Community, Rev. 2.1 (NACE Rev. 2.1)
Notation: 95.25
top concept of: Statistical Classification of Economic Activities in the European Community, Rev. 2.1 (NACE Rev. 2.1)

ConceptNoneRandom0.8402862273690913
type: ConceptAssociation
description: NACE Rev. 2.1 class 35.16 is mapped to NACE Rev. 2 class 35.11
Type: 3:1
Source Concept: Storage of electricity
Target Concept: http://data.europa.eu/ux2/nace2/3511
in scheme: Statistical Classification of Economic Activities in the European Community, Rev. 2.1 (NACE Rev. 2.1)
scope note: the content of the NACE Rev 2.1 class is fully covered in the corresponding NACE Rev 2 class
top concept of: Statistical Classification of Economic Activities in the European Community, Rev. 2.1 (NACE Rev. 2.1)
Mapping Cardinality: n 1

Washing and cleaning of textile and fur products
type: Concept
CoreContentNote: This class includes: - laundering and dry-cleaning, pressing, etc., of all kinds of clothing (including fur) and textiles, provided by mechanical equipment, by hand or by self-service coin-operated machines, whether for the general public or for industrial or commercial clients - carpet and rug shampooing, drapery and curtain cleaning, whether on clients’ premises or not - provision of combined rental and care services, including washing and cleaning of textiles (e.g. linen, work uniforms and related items) - reusable diaper supply services
Exclusion Note: This class excludes: - repair and alteration of clothing, see 95.29
broader: Washing and cleaning of textile and fur products
in scheme: Statistical Classification of Economic Activities in the European Community, Rev. 2.1 (NACE Rev. 2.1)
Notation: 96.10
top concept of: Statistical Classification of Economic Activities in the European Community, Rev. 2.1 (NACE Rev. 2.1)

Water collection, treatment and supply
type: Concept
broader: Water collection, treatment and supply
in scheme: Statistical Classification of Economic Activities in the European Community, Rev. 2.1 (NACE Rev. 2.1)
Notation: 36.0
top concept of: Statistical Classification of Economic Activities in the European Community, Rev. 2.1 (NACE Rev. 2.1)

ID SDMX

ConceptNoneRandom0.0036101322064518993
type: ConceptAssociation
description: NACE Rev. 2.1 class 49.33 is mapped to NACE Rev. 2 class 49.32
Type: 78:65
Source Concept: On-demand passenger transport service activities by vehicle with driver
Target Concept: http://data.europa.eu/ux2/nace2/4932
in scheme: Statistical Classification of Economic Activities in the European Community, Rev. 2.1 (NACE Rev. 2.1)
scope note: the content of the NACE Rev 2.1 class is fully covered in the corresponding NACE Rev 2 class
top concept of: Statistical Classification of Economic Activities in the European Community, Rev. 2.1 (NACE Rev. 2.1)
Mapping Cardinality: n m

ConceptNoneRandom0.42157735149411646
type: ConceptAssociation
description: NACE Rev. 2.1 class 50.30 is mapped to NACE Rev. 2 class 50.30
Type: 1:1
Source Concept: Inland passenger water transport
Target Concept: http://data.europa.eu/ux2/nace2/5030
in scheme: Statistical Classification of Economic Activities in the European Community, Rev. 2.1 (NACE Rev. 2.1)
scope note: the content of the NACE Rev 2.1 class is fully covered in the corresponding NACE Rev 2 class
top concept of: Statistical Classification of Economic Activities in the European Community, Rev. 2.1 (NACE Rev. 2.1)
Mapping Cardinality: 1 1

Regulation of and contribution to more efficient operation of businesses
type: Concept
Additional Content Note: This class also includes: - activities of the national cybersecurity agencies - financial regulation relating to the conduct of business and consumer protection and other wider financial regulatory activities
CoreContentNote: This class includes: - public administration and regulation, including subsidy allocation for different economic sectors, e.g.: • agriculture • land use • energy and mining resources • infrastructure • transport • communication • hotels and tourism • wholesale and retail sale - administration of research and development policies and associated funds to improve economic performance - administration of general labour affairs - implementation of regional development policy measures (e.g. to reduce unemployment)
Exclusion Note: This class excludes: - activities of the monetary supervisory authority by the central bank, see 64.11 - financial supervisory authority of financial service activities, except insurance and pension funding (not by the central bank), see 66.11 - financial supervisory authority of insurance and pension funding (not by the central bank), see 66.29 - research and experimental development activities, see division 72
broader: Administration of the State and the economic, social and environmental policies of the community
in scheme: Statistical Classification of Economic Activities in the European Community, Rev. 2.1 (NACE Rev. 2.1)
Notation: 84.13
top concept of: Statistical Classification of Economic Activities in the European Community, Rev. 2.1 (NACE Rev. 2.1)

ConceptNoneRandom0.6562275535089838
type: ConceptAssociation
description: NACE Rev. 2.1 group 62.1 is mapped to NACE Rev. 2 group 62.0
Type: 3:1
Source Concept: Computer programming activities
Target Concept: http://data.europa.eu/ux2/nace2/620
in scheme: Statistical Classification of Economic Activities in the European Community, Rev. 2.1 (NACE Rev. 2.1)
top concept of: Statistical Classification of Economic Activities in the European Community, Rev. 2.1 (NACE Rev. 2.1)
Mapping Cardinality: n 1

Freight transport by road and removal services
type: Concept
CoreContentNote: This group includes all land-based freight transport activities other than rail transport.
broader: Land transport and transport via pipelines
in scheme: Statistical Classification of Economic Activities in the European Community, Rev. 2.1 (NACE Rev. 2.1)
Notation: 49.4
top concept of: Statistical Classification of Economic Activities in the European Community, Rev. 2.1 (NACE Rev. 2.1)

Copper production
type: Concept
Additional Content Note: This class also includes: - manufacture of bars, rods, profiles, plates, sheets, strip, wire, tubes and pipes of brass
CoreContentNote: This class includes: - manufacture of unrefined or refined unwrought copper, alloyed or not alloyed, from ores or from copper waste and scrap - manufacture of bars, rods, profiles, plates, sheets and strip of copper and copper alloys - manufacture of wire of copper and copper alloys - manufacture of tubes, pipes, tube and pipe fittings of copper and copper alloys - manufacture of copper foil, whether or not printed or backed with paper, paperboard, plastics or similar backing materials
Exclusion Note: This class excludes: - casting of copper, see 24.54 - shredding of copper waste and scrap, see 38.21
broader: Manufacture of basic precious and other non-ferrous metals
in scheme: Statistical Classification of Economic Activities in the European Community, Rev. 2.1 (NACE Rev. 2.1)
Notation: 24.44
top concept of: Statistical Classification of Economic Activities in the European Community, Rev. 2.1 (NACE Rev. 2.1)

Manufacture of flat glass
type: Concept
Additional Content Note: This class also includes: - shaping and processing done as part of the manufacturing process
CoreContentNote: This class includes: - manufacture of flat glass (e.g. cast, rolled, drawn or blown), surface ground or polished glass in sheets and sheets of float glass, opacified, flashed or having an absorbent, reflecting or non-reflecting layer, including wired, coloured throughout the mass, or tinted flat glass
Exclusion Note: This class excludes: - shaping and processing of flat glass sheets (e.g. bending, engraving, laminating, tempering), see 23.12
broader: Manufacture of glass and glass products
in scheme: Statistical Classification of Economic Activities in the European Community, Rev. 2.1 (NACE Rev. 2.1)
Notation: 23.11
top concept of: Statistical Classification of Economic Activities in the European Community, Rev. 2.1 (NACE Rev. 2.1)

ConceptNoneRandom0.03772692676716527
type: ConceptAssociation
description: NACE Rev. 2.1 class 59.12 is mapped to NACE Rev. 2 class 59.12
Type: 1:1
Source Concept: Motion picture, video and television programme post-production activities
Target Concept: http://data.europa.eu/ux2/nace2/5912
in scheme: Statistical Classification of Economic Activities in the European Community, Rev. 2.1 (NACE Rev. 2.1)
scope note: the content of the NACE Rev 2.1 class is fully covered in the corresponding NACE Rev 2 class
top concept of: Statistical Classification of Economic Activities in the European Community, Rev. 2.1 (NACE Rev. 2.1)
Mapping Cardinality: 1 1

ConceptNoneRandom0.635840538758194
type: ConceptAssociation
description: NACE Rev. 2.1 class 03.12 is mapped to NACE Rev. 2 class 03.12
Type: 10:9
Source Concept: Freshwater fishing
Target Concept: http://data.europa.eu/ux2/nace2/0312
in scheme: Statistical Classification of Economic Activities in the European Community, Rev. 2.1 (NACE Rev. 2.1)
scope note: the content of the NACE Rev 2.1 class is fully covered in the corresponding NACE Rev 2 class
top concept of: Statistical Classification of Economic Activities in the European Community, Rev. 2.1 (NACE Rev. 2.1)
Mapping Cardinality: n m

ConceptNoneRandom0.9516808535169284
type: ConceptAssociation
description: NACE Rev. 2.1 group 09.1 is mapped to NACE Rev. 2 group 09.1
Type: 1:1
Source Concept: Support activities for petroleum and natural gas extraction
Target Concept: http://data.europa.eu/ux2/nace2/091
in scheme: Statistical Classification of Economic Activities in the European Community, Rev. 2.1 (NACE Rev. 2.1)
top concept of: Statistical Classification of Economic Activities in the European Community, Rev. 2.1 (NACE Rev. 2.1)
Mapping Cardinality: 1 1

ConceptNoneRandom0.4715004281493351
type: ConceptAssociation
description: NACE Rev. 2.1 class 60.10 is mapped to NACE Rev. 2 class 60.10
Type: 1:1
Source Concept: Radio broadcasting and audio distribution activities
Target Concept: http://data.europa.eu/ux2/nace2/6010
in scheme: Statistical Classification of Economic Activities in the European Community, Rev. 2.1 (NACE Rev. 2.1)
scope note: the content of the NACE Rev 2.1 class is fully covered in the corresponding NACE Rev 2 class
top concept of: Statistical Classification of Economic Activities in the European Community, Rev. 2.1 (NACE Rev. 2.1)
Mapping Cardinality: 1 1

ConceptNoneRandom0.041209752161833535
type: ConceptAssociation
description: NACE Rev. 2.1 group 22.2 is mapped to NACE Rev. 2 group 22.2
Type: 5:5
Source Concept: Manufacture of plastic products
Target Concept: http://data.europa.eu/ux2/nace2/222
in scheme: Statistical Classification of Economic Activities in the European Community, Rev. 2.1 (NACE Rev. 2.1)
top concept of: Statistical Classification of Economic Activities in the European Community, Rev. 2.1 (NACE Rev. 2.1)
Mapping Cardinality: n m

ConceptNoneRandom0.7516744627803305
type: ConceptAssociation
description: NACE Rev. 2.1 group 79.1 is mapped to NACE Rev. 2 group 79.1
Type: 42:34
Source Concept: Travel agency and tour operator activities
Target Concept: http://data.europa.eu/ux2/nace2/791
in scheme: Statistical Classification of Economic Activities in the European Community, Rev. 2.1 (NACE Rev. 2.1)
top concept of: Statistical Classification of Economic Activities in the European Community, Rev. 2.1 (NACE Rev. 2.1)
Mapping Cardinality: n m

Manufacture of liquid biofuels
type: Concept
CoreContentNote: This class includes: - manufacture of biodiesel - manufacture of ethanol from biomass - manufacture of mixtures of bioethanol and ethers partially derived from biomass - manufacture of liquid biofuels even if processes use waste as an input
Exclusion Note: This class excludes: - manufacture of solid fuels from vegetable biomass, see 16.26 - manufacture of ethyl alcohol other than for bioethanol biofuels, see 20.14 - manufacture of explosives, see 20.59
broader: Manufacture of other chemical products
in scheme: Statistical Classification of Economic Activities in the European Community, Rev. 2.1 (NACE Rev. 2.1)
Notation: 20.51
top concept of: Statistical Classification of Economic Activities in the European Community, Rev. 2.1 (NACE Rev. 2.1)

Manufacture of wiring and wiring devices
type: Concept
Additional Content Note: This group also includes the insulating of wire and the manufacture of fibre-optic cables.
CoreContentNote: This group includes the manufacture of current-carrying wiring devices and non-current-carrying wiring devices for wiring electrical circuits regardless of material.
broader: Manufacture of electrical equipment
in scheme: Statistical Classification of Economic Activities in the European Community, Rev. 2.1 (NACE Rev. 2.1)
Notation: 27.3
top concept of: Statistical Classification of Economic Activities in the European Community, Rev. 2.1 (NACE Rev. 2.1)

Retail sale of furniture, lighting equipment, tableware and other household goods
type: Concept
Additional Content Note: This class also includes: - retail sale of baby equipment (e.g. baby carriages, pushchairs, baby walkers, baby carriers, baby car seats) - retail sale of sails, except of boat sails
CoreContentNote: This class includes: - retail sale of furniture, including mattresses and box springs - retail sale of articles for lighting - retail sale of household utensils, cutlery, crockery, glassware, tableware, china and pottery - retail sale of wooden, cork and wickerwork goods - retail sale of non-electrical household appliances - retail sale of solar-powered household appliances - retail sale of parasols - retail sale of household articles and equipment n.e.c.
Exclusion Note: This class excludes: - installation of electrical systems (e.g. security alarm systems and fire alarms), see 43.21 - retail sale of electrical or electronic fire alarms, security systems, safes, see 47.52 - retail sale of photovoltaic panels without installation, see 47.52 - retail sale of cork floor tiles, see 47.53 - retail sale of curtains and net curtains, see 47.53 - retail sale of musical instruments and scores, see 47.69 - retail sale of antiques, see 47.79 - retail sale of second-hand furniture, see 47.79
broader: Retail sale of other household equipment
in scheme: Statistical Classification of Economic Activities in the European Community, Rev. 2.1 (NACE Rev. 2.1)
Notation: 47.55
top concept of: Statistical Classification of Economic Activities in the European Community, Rev. 2.1 (NACE Rev. 2.1)

Wholesale of flowers and plants
type: Concept
CoreContentNote: This class includes: - wholesale of flowers, plants and bulbs - wholesale of seeds of flowers and plants
broader: Wholesale of agricultural raw materials and live animals
in scheme: Statistical Classification of Economic Activities in the European Community, Rev. 2.1 (NACE Rev. 2.1)
Notation: 46.22
top concept of: Statistical Classification of Economic Activities in the European Community, Rev. 2.1 (NACE Rev. 2.1)

Mining of metal ores
type: Concept
Additional Content Note: This division also includes: - ore dressing and beneficiating operations (e.g. crushing, grinding, washing, drying, sintering, calcining or leaching ore, gravity separation or flotation operations)
CoreContentNote: This division includes mining for metallic minerals (ores), performed through underground or open-cast extraction, seabed mining, and so on.
Exclusion Note: This division excludes: - roasting of iron pyrites, see 20.13 - operation of blast furnaces, see division 24 - production of aluminium oxide, see 24.42
broader: MINING AND QUARRYING
in scheme: Statistical Classification of Economic Activities in the European Community, Rev. 2.1 (NACE Rev. 2.1)
Notation: 07
top concept of: Statistical Classification of Economic Activities in the European Community, Rev. 2.1 (NACE Rev. 2.1)

ConceptNoneRandom0.43179255134805217
type: ConceptAssociation
description: NACE Rev. 2.1 class 51.22 is mapped to NACE Rev. 2 class 51.22
Type: 1:1
Source Concept: Space transport
Target Concept: http://data.europa.eu/ux2/nace2/5122
in scheme: Statistical Classification of Economic Activities in the European Community, Rev. 2.1 (NACE Rev. 2.1)
scope note: the content of the NACE Rev 2.1 class is fully covered in the corresponding NACE Rev 2 class
top concept of: Statistical Classification of Economic Activities in the European Community, Rev. 2.1 (NACE Rev. 2.1)
Mapping Cardinality: 1 1

Manufacture of civilian air and spacecraft and related machinery
type: Concept
Additional Content Note: This class also includes: - overhaul and conversion of civilian aircraft or aircraft engines - manufacture of civilian aircraft seats
CoreContentNote: This class includes: - manufacture of airplanes for the transport of goods or passengers, including for recreation and sports purposes - manufacture of helicopters - manufacture of gliders and hang-gliders - manufacture of dirigibles and hot-air balloons - manufacture of parts and accessories of the aircraft of this class: • major assemblies (e.g. fuselages, wings, doors, control surfaces, landing gear, fuel tanks, nacelles) • airscrews, helicopter rotors and propelled rotor blades • civilian aircraft engines • turbojets and turboprops, of a kind typically found on civilian aircraft • parts suitable for use solely or principally with internal combustion piston engines for civilian aircraft - manufacture of ground flying trainers - manufacture of missiles for space and civilian purposes - manufacture of spacecraft and launch vehicles, satellites, planetary probes, orbital stations, shuttles - manufacture of civilian unmanned aircraft (drones)
Exclusion Note: This class excludes: - manufacture of parachutes, see 13.96 - manufacture of missiles for military purposes, see 25.30 - manufacture of telecommunication equipment for satellites, see 26.30 - manufacture of aircraft instrumentation and aeronautical instruments, see 26.51 - manufacture of air navigation systems, see 26.51 - manufacture of lighting equipment for aircraft, see 27.40 - manufacture of pistons, piston rings and carburettors not for motor vehicles or motorcycles, see 28.11 - manufacture of aircraft launching gear, aircraft carrier catapults and related equipment, see 28.99 - manufacture of ignition parts and other electrical parts for internal combustion engines, see 29.31 - manufacture of military air and spacecraft, see 30.32 - manufacture of drones for military purposes, see 30.32 - manufacture of toy drones, see 32.40 - repair and maintenance of civilian air and spacecraft, see 33.16
broader: Manufacture of air and spacecraft and related machinery
in scheme: Statistical Classification of Economic Activities in the European Community, Rev. 2.1 (NACE Rev. 2.1)
Notation: 30.31
top concept of: Statistical Classification of Economic Activities in the European Community, Rev. 2.1 (NACE Rev. 2.1)

Passenger rail transport
type: Concept
broader: Land transport and transport via pipelines
in scheme: Statistical Classification of Economic Activities in the European Community, Rev. 2.1 (NACE Rev. 2.1)
Notation: 49.1
top concept of: Statistical Classification of Economic Activities in the European Community, Rev. 2.1 (NACE Rev. 2.1)

ConceptNoneRandom0.3410718762694326
type: ConceptAssociation
description: NACE Rev. 2.1 class 95.29 is mapped to NACE Rev. 2 class 95.29
Type: 1:1
Source Concept: Repair and maintenance of personal and household goods n.e.c.
Target Concept: http://data.europa.eu/ux2/nace2/9529
in scheme: Statistical Classification of Economic Activities in the European Community, Rev. 2.1 (NACE Rev. 2.1)
scope note: the content of the NACE Rev 2.1 class is fully covered in the corresponding NACE Rev 2 class
top concept of: Statistical Classification of Economic Activities in the European Community, Rev. 2.1 (NACE Rev. 2.1)
Mapping Cardinality: 1 1

ConceptNoneRandom0.861743728602023
type: ConceptAssociation
description: NACE Rev. 2.1 class 27.12 is mapped to NACE Rev. 2 class 27.12
Type: 11:11
Source Concept: Manufacture of electricity distribution and control apparatus
Target Concept: http://data.europa.eu/ux2/nace2/2712
in scheme: Statistical Classification of Economic Activities in the European Community, Rev. 2.1 (NACE Rev. 2.1)
scope note: the content of the NACE Rev 2.1 class is fully covered in the corresponding NACE Rev 2 class
top concept of: Statistical Classification of Economic Activities in the European Community, Rev. 2.1 (NACE Rev. 2.1)
Mapping Cardinality: n m

Reproduction of recorded media
type: Concept
CoreContentNote: This class includes: - reproduction from master copies of gramophone records, compact discs and tapes with music, or other sound recordings - reproduction from master copies of records, compact discs and tapes with motion pictures, and other video recordings - reproduction from master copies of software and data on discs and tapes
Exclusion Note: This class excludes: - reproduction of printed matter, see 18.11, 18.12 - software publishing, see 58.2 - production and distribution of motion pictures, videotapes and movies on discs or similar media, see 59.11, 59.12, 59.13 - reproduction of motion picture film for theatrical distribution, see 59.12 - production of master copies for records or audio material, see 59.20
broader: Reproduction of recorded media
in scheme: Statistical Classification of Economic Activities in the European Community, Rev. 2.1 (NACE Rev. 2.1)
Notation: 18.20
top concept of: Statistical Classification of Economic Activities in the European Community, Rev. 2.1 (NACE Rev. 2.1)

ConceptNoneRandom0.38333543738768416
type: ConceptAssociation
description: NACE Rev. 2.1 class 49.39 is mapped to NACE Rev. 2 class 49.39
Type: 6:3
Source Concept: Other passenger land transport n.e.c.
Target Concept: http://data.europa.eu/ux2/nace2/4939
in scheme: Statistical Classification of Economic Activities in the European Community, Rev. 2.1 (NACE Rev. 2.1)
scope note: the content of the NACE Rev 2.1 class is fully covered in the corresponding NACE Rev 2 class
top concept of: Statistical Classification of Economic Activities in the European Community, Rev. 2.1 (NACE Rev. 2.1)
Mapping Cardinality: n m

Other mining and quarrying
type: Concept
CoreContentNote: This division includes extraction from a mine or quarry, but also dredging of alluvial deposits, rock crushing and the use of salt marshes. The products are used most notably in construction (for example, sands, stones), the manufacture of materials (for example, clay, gypsum, calcium), the manufacture of chemicals, and so on.
Exclusion Note: This division excludes processing (except crushing, grinding, cutting, cleaning, drying, sorting and mixing) of the minerals extracted, see section C.
broader: MINING AND QUARRYING
in scheme: Statistical Classification of Economic Activities in the European Community, Rev. 2.1 (NACE Rev. 2.1)
Notation: 08
top concept of: Statistical Classification of Economic Activities in the European Community, Rev. 2.1 (NACE Rev. 2.1)

Manufacture of knitted and crocheted apparel
type: Concept
broader: Manufacture of wearing apparel
in scheme: Statistical Classification of Economic Activities in the European Community, Rev. 2.1 (NACE Rev. 2.1)
Notation: 14.1
top concept of: Statistical Classification of Economic Activities in the European Community, Rev. 2.1 (NACE Rev. 2.1)

Wholesale of live animals
type: Concept
CoreContentNote: This class includes: - wholesale of pets
broader: Wholesale of agricultural raw materials and live animals
in scheme: Statistical Classification of Economic Activities in the European Community, Rev. 2.1 (NACE Rev. 2.1)
Notation: 46.23
top concept of: Statistical Classification of Economic Activities in the European Community, Rev. 2.1 (NACE Rev. 2.1)

Manufacture of lighting equipment
type: Concept
broader: Manufacture of electrical equipment
in scheme: Statistical Classification of Economic Activities in the European Community, Rev. 2.1 (NACE Rev. 2.1)
Notation: 27.4
top concept of: Statistical Classification of Economic Activities in the European Community, Rev. 2.1 (NACE Rev. 2.1)

Manufacture of other parts and accessories for motor vehicles
type: Concept
CoreContentNote: This class includes: - manufacture of diverse parts and accessories for motor vehicles, e.g.: • gearboxes, clutches, brakes, axles, road wheels, shock absorbers - manufacture of parts and accessories of bodies for motor vehicles, e.g.: • bumpers, safety seat belts, safety airbags, rear-view mirrors - manufacture of car seats, including seats for babies and children - manufacture of air-conditioning machines for motor vehicles
Exclusion Note: This class excludes: - manufacture of tyres, see 22.11 - manufacture of rubber hoses and belts, and other rubber products, see 22.12 - manufacture of pistons, piston rings and carburettors not for motor vehicles or motorcycles, see 28.11 - manufacture of pumps for motor vehicles and engines, see 28.13 - repair, maintenance and alteration of motor vehicles, see 95.31
broader: Manufacture of motor vehicle parts and accessories
in scheme: Statistical Classification of Economic Activities in the European Community, Rev. 2.1 (NACE Rev. 2.1)
Notation: 29.32
top concept of: Statistical Classification of Economic Activities in the European Community, Rev. 2.1 (NACE Rev. 2.1)

ConceptNoneRandom0.6471101170742097
type: ConceptAssociation
description: NACE Rev. 2.1 division 66 is mapped to NACE Rev. 2 division 66
Type: 1:1
Source Concept: Activities auxiliary to financial services and insurance activities
Target Concept: http://data.europa.eu/ux2/nace2/66
in scheme: Statistical Classification of Economic Activities in the European Community, Rev. 2.1 (NACE Rev. 2.1)
top concept of: Statistical Classification of Economic Activities in the European Community, Rev. 2.1 (NACE Rev. 2.1)
Mapping Cardinality: 1 1

ConceptNoneRandom0.7719801757473265
type: ConceptAssociation
description: NACE Rev. 2.1 class 15.12 is mapped to NACE Rev. 2 class 15.12
Type: 1:1
Source Concept: Manufacture of luggage, handbags, saddlery and harness of any material
Target Concept: http://data.europa.eu/ux2/nace2/1512
in scheme: Statistical Classification of Economic Activities in the European Community, Rev. 2.1 (NACE Rev. 2.1)
scope note: the content of the NACE Rev 2.1 class is fully covered in the corresponding NACE Rev 2 class
top concept of: Statistical Classification of Economic Activities in the European Community, Rev. 2.1 (NACE Rev. 2.1)
Mapping Cardinality: 1 1

ConceptNoneRandom0.212155043528381
type: ConceptAssociation
description: NACE Rev. 2.1 class 51.21 is mapped to NACE Rev. 2 class 51.21
Type: 1:1
Source Concept: Freight air transport
Target Concept: http://data.europa.eu/ux2/nace2/5121
in scheme: Statistical Classification of Economic Activities in the European Community, Rev. 2.1 (NACE Rev. 2.1)
scope note: the content of the NACE Rev 2.1 class is fully covered in the corresponding NACE Rev 2 class
top concept of: Statistical Classification of Economic Activities in the European Community, Rev. 2.1 (NACE Rev. 2.1)
Mapping Cardinality: 1 1

Manufacture of bread; manufacture of fresh pastry goods and cakes
type: Concept
Additional Content Note: This class also includes: - manufacture of pre-baked bread
CoreContentNote: This class includes: - manufacture of bakery products: • bread and rolls • pastry, cakes, pies, tarts, pancakes, waffles, etc.
Exclusion Note: This class excludes: - manufacture of dry bakery products, see 10.72 - manufacture of pastas, see 10.73 - retail sale of bread and rolls baked on the premises from pre-baked products, see 47.24
broader: Manufacture of bakery and farinaceous products
in scheme: Statistical Classification of Economic Activities in the European Community, Rev. 2.1 (NACE Rev. 2.1)
Notation: 10.71
top concept of: Statistical Classification of Economic Activities in the European Community, Rev. 2.1 (NACE Rev. 2.1)

ConceptNoneRandom0.488298428672175
type: ConceptAssociation
description: NACE Rev. 2.1 class 88.99 is mapped to NACE Rev. 2 class 88.99
Type: 1:1
Source Concept: Other social work activities without accommodation n.e.c.
Target Concept: http://data.europa.eu/ux2/nace2/8899
in scheme: Statistical Classification of Economic Activities in the European Community, Rev. 2.1 (NACE Rev. 2.1)
scope note: the content of the NACE Rev 2.1 class is fully covered in the corresponding NACE Rev 2 class
top concept of: Statistical Classification of Economic Activities in the European Community, Rev. 2.1 (NACE Rev. 2.1)
Mapping Cardinality: 1 1

ConceptNoneRandom0.19786404698812554
type: ConceptAssociation
description: NACE Rev. 2.1 class 43.60 is mapped to NACE Rev. 2 class 82.99
Type: 78:65
Source Concept: Intermediation service activities for specialised construction services
Target Concept: http://data.europa.eu/ux2/nace2/8299
in scheme: Statistical Classification of Economic Activities in the European Community, Rev. 2.1 (NACE Rev. 2.1)
scope note: the content of the NACE Rev 2.1 class is fully covered in the corresponding NACE Rev 2 class
top concept of: Statistical Classification of Economic Activities in the European Community, Rev. 2.1 (NACE Rev. 2.1)
Mapping Cardinality: n m

Wholesale of hides, skins and leather
type: Concept
CoreContentNote: This class includes: - wholesale of leather, raw and processed hides, and fur skins
Exclusion Note: This class excludes: - activities of agents involved in wholesale auctions for fur skin, see 46.11
broader: Wholesale of agricultural raw materials and live animals
in scheme: Statistical Classification of Economic Activities in the European Community, Rev. 2.1 (NACE Rev. 2.1)
Notation: 46.24
top concept of: Statistical Classification of Economic Activities in the European Community, Rev. 2.1 (NACE Rev. 2.1)

Freight rail transport
type: Concept
broader: Land transport and transport via pipelines
in scheme: Statistical Classification of Economic Activities in the European Community, Rev. 2.1 (NACE Rev. 2.1)
Notation: 49.2
top concept of: Statistical Classification of Economic Activities in the European Community, Rev. 2.1 (NACE Rev. 2.1)

Publishing of video games
type: Concept
Additional Content Note: This class also includes: - intermediation service activities for video game software publishing
CoreContentNote: This class includes: - publishing of video games for all platforms and all devices - provision of online game in-game and in-app purchases by the publisher, for all users, including subscribers
Exclusion Note: This class excludes: - reproduction of video game software, see 18.20 - retail sale of non-customised video game software on physical media, see 47.40 - operation of video game streaming sites for viewing only, see 60.20 - operation of online gaming / video game sites, not associated with publishing, see 60.39 - development of video game software, on behalf of others, see 62.10 - application hosting, see 63.10 - operation of gambling sites, see 92.00
broader: Software publishing
in scheme: Statistical Classification of Economic Activities in the European Community, Rev. 2.1 (NACE Rev. 2.1)
Notation: 58.21
top concept of: Statistical Classification of Economic Activities in the European Community, Rev. 2.1 (NACE Rev. 2.1)

ConceptNoneRandom0.23446516009318175
type: ConceptAssociation
description: NACE Rev. 2.1 class 29.31 is mapped to NACE Rev. 2 classes 27.90, 29.31
Type: 11:11
Source Concept: Manufacture of electrical and electronic equipment for motor vehicles
Target Concept: http://data.europa.eu/ux2/nace2/2790
Target Concept: http://data.europa.eu/ux2/nace2/2931
in scheme: Statistical Classification of Economic Activities in the European Community, Rev. 2.1 (NACE Rev. 2.1)
scope note: 27.90: - manufacture of inverter modules and fuel cells for cars 29.31: - manufacture of motor vehicle electrical equipment, e.g. starter motors, generators, alternators, sparking plugs, insulated ignition wiring sets, power window and door systems, assembly of purchased gauges into instrument panels, voltage regulators - manufacture of (electromagnetic) clutches for motor vehicles - manufacture of cable sets, insulated wiring sets and similar cable sets or assemblies for automotive applications
top concept of: Statistical Classification of Economic Activities in the European Community, Rev. 2.1 (NACE Rev. 2.1)
Mapping Cardinality: n m

ConceptNoneRandom0.15633391170759237
type: ConceptAssociation
description: NACE Rev. 2.1 class 97.00 is mapped to NACE Rev. 2 class 97.00
Type: 1:1
Source Concept: Activities of households as employers of domestic personnel
Target Concept: http://data.europa.eu/ux2/nace2/9700
in scheme: Statistical Classification of Economic Activities in the European Community, Rev. 2.1 (NACE Rev. 2.1)
scope note: the content of the NACE Rev 2.1 class is fully covered in the corresponding NACE Rev 2 class
top concept of: Statistical Classification of Economic Activities in the European Community, Rev. 2.1 (NACE Rev. 2.1)
Mapping Cardinality: 1 1

ConceptNoneRandom0.6880858627255789
type: ConceptAssociation
description: NACE Rev. 2.1 group 35.3 is mapped to NACE Rev. 2 group 35.3
Type: 1:1
Source Concept: Steam and air conditioning supply
Target Concept: http://data.europa.eu/ux2/nace2/353
in scheme: Statistical Classification of Economic Activities in the European Community, Rev. 2.1 (NACE Rev. 2.1)
top concept of: Statistical Classification of Economic Activities in the European Community, Rev. 2.1 (NACE Rev. 2.1)
Mapping Cardinality: 1 1

Manufacture of other wearing apparel and accessories n.e.c.
type: Concept
Additional Content Note: This class also includes: - manufacture of footwear of textile material without applied soles, except knitted or crocheted
CoreContentNote: This class includes: - manufacture of sportswear of broad woven fabrics (e.g. tracksuits, ski suits, other technical sportswear) - manufacture of hats and caps - manufacture of other clothing accessories (e.g. gloves, belts, shawls, ties, cravats, hairnets)
Exclusion Note: This class excludes: - manufacture of knitted or crocheted footwear without applied soles, see 14.10 - manufacture of knitted and crocheted swimwear, see 14.10 - manufacture of swimwear, see 14.22 - manufacture of fur clothing accessories, see 14.24 - manufacture of plastic headgear excluding safety headgear, see 22.26 - manufacture of safety headgear, see 32.99
broader: Manufacture of other wearing apparel and accessories
in scheme: Statistical Classification of Economic Activities in the European Community, Rev. 2.1 (NACE Rev. 2.1)
Notation: 14.29
top concept of: Statistical Classification of Economic Activities in the European Community, Rev. 2.1 (NACE Rev. 2.1)

Mining support service activities
type: Concept
CoreContentNote: This division includes specialised support services incidental to mining provided on a fee or contract basis. It includes exploration services through traditional prospecting methods (for example, taking core samples and making geological observations as well as drilling, test drilling or redrilling for oil wells, metallic and non-metallic minerals). Other typical services cover building oil and gas well foundations, cementing oil and gas well casings, cleaning, bailing and swabbing oil and gas wells, draining and pumping mines, and so on.
broader: MINING AND QUARRYING
in scheme: Statistical Classification of Economic Activities in the European Community, Rev. 2.1 (NACE Rev. 2.1)
Notation: 09
top concept of: Statistical Classification of Economic Activities in the European Community, Rev. 2.1 (NACE Rev. 2.1)

Financial leasing
type: Concept
Additional Content Note: This class also includes: - financial leasing of durable goods (e.g. vehicles)
CoreContentNote: This class includes the activities of financial leasing, a contract under which the lessor as legal owner of an asset conveys the risks and benefits of ownership of the asset to the lessee. Under a financial lease, the lessor is deemed to make, to the lessee, a loan with which the lessee acquires all the economic benefits and risks of the lease. Thereafter, the leased asset is shown on the balance sheet of the lessee and not the lessor; the corresponding loan is shown as an asset of the lessor and a liability of the lessee.
Exclusion Note: This class excludes: - operating leasing, according to type of goods leased, see division 77
broader: Other financial service activities, except insurance and pension funding
in scheme: Statistical Classification of Economic Activities in the European Community, Rev. 2.1 (NACE Rev. 2.1)
Notation: 64.91
top concept of: Statistical Classification of Economic Activities in the European Community, Rev. 2.1 (NACE Rev. 2.1)

ConceptNoneRandom0.3324103809071387
type: ConceptAssociation
description: NACE Rev. 2.1 division 21 is mapped to NACE Rev. 2 division 21
Type: 1:1
Source Concept: Manufacture of basic pharmaceutical products and pharmaceutical preparations
Target Concept: http://data.europa.eu/ux2/nace2/21
in scheme: Statistical Classification of Economic Activities in the European Community, Rev. 2.1 (NACE Rev. 2.1)
top concept of: Statistical Classification of Economic Activities in the European Community, Rev. 2.1 (NACE Rev. 2.1)
Mapping Cardinality: 1 1

ConceptNoneRandom0.5574634909921684
type: ConceptAssociation
description: NACE Rev. 2.1 class 38.23 is mapped to NACE Rev. 2 classes 38.21, 38.22
Type: 7:5
Source Concept: Other waste recovery
Target Concept: http://data.europa.eu/ux2/nace2/3821
Target Concept: http://data.europa.eu/ux2/nace2/3822
in scheme: Statistical Classification of Economic Activities in the European Community, Rev. 2.1 (NACE Rev. 2.1)
scope note: 38.21: - preparation of sewage sludge for land treatment resulting in benefit to agriculture or ecological improvement - preparation of non-hazardous waste for reclamation in excavated areas or for engineering purposes in landscaping 38.22: - preparation of sewage sludge for land treatment resulting in benefit to agriculture or ecological improvement
top concept of: Statistical Classification of Economic Activities in the European Community, Rev. 2.1 (NACE Rev. 2.1)
Mapping Cardinality: n m

Organisation of conventions and trade shows
type: Concept
Additional Content Note: This class also includes the management and provision of the staff to operate the facilities in which the aforementioned events take place but only if the management and provision of staff are performed in association with the organisation, promotion and/or management of such events.
CoreContentNote: This class includes the organisation, promotion and/or management of events, for example: - business and trade shows - company events - general or specialised exhibitions - conferences and conventions - seminars, symposiums and workshops - farmers’ markets and craft fairs
Exclusion Note: This class excludes: - erection of exhibition stands/booths depending on the type of installation performed, see division 43 - organisation of cultural events (e.g. film festivals, musicals or dance festivals), see 90.39 - technical planning, supply, setting-up and operation of audiovisual equipment and special effects associated with the organisation of artistic events, see 90.39 - organisation of sporting events, see 93.19 - technical planning, supply, setting-up and operation of audiovisual equipment and special effects associated with the organisation of non-artistic events, see 93.29 - organisation of personal ceremonies or celebrations, including weddings, name-giving ceremonies, birthday parties, etc., see 96.99
broader: Organisation of conventions and trade shows
in scheme: Statistical Classification of Economic Activities in the European Community, Rev. 2.1 (NACE Rev. 2.1)
Notation: 82.30
top concept of: Statistical Classification of Economic Activities in the European Community, Rev. 2.1 (NACE Rev. 2.1)

Manufacture of electrical and electronic equipment for motor vehicles
type: Concept
Additional Content Note: This class also includes: - manufacture of inverter modules and fuel cells for cars - manufacture of cable sets, insulated wiring sets and similar cable sets or assemblies for automotive applications
CoreContentNote: This class includes: - manufacture of motor vehicle electrical equipment (e.g. starter motors, generators, alternators, spark plugs, insulated ignition wiring sets, power window and door systems, assembly of purchased gauges into instrument panels, voltage regulators) - manufacture of (electromagnetic) clutches for motor vehicles
Exclusion Note: This class excludes: - manufacture of batteries for vehicles, see 27.20 - manufacture of lighting equipment for motor vehicles, see 27.40 - manufacture of pumps for motor vehicles and engines, see 28.13
broader: Manufacture of motor vehicle parts and accessories
in scheme: Statistical Classification of Economic Activities in the European Community, Rev. 2.1 (NACE Rev. 2.1)
Notation: 29.31
top concept of: Statistical Classification of Economic Activities in the European Community, Rev. 2.1 (NACE Rev. 2.1)

Manufacture of electric motors, generators, transformers and electricity distribution and control apparatus
type: Concept
CoreContentNote: This group comprises the manufacture of power, distribution and specialty transformers; electric motors, generators and motor generator sets.
broader: Manufacture of electrical equipment
in scheme: Statistical Classification of Economic Activities in the European Community, Rev. 2.1 (NACE Rev. 2.1)
Notation: 27.1
top concept of: Statistical Classification of Economic Activities in the European Community, Rev. 2.1 (NACE Rev. 2.1)

Technical testing and analysis
type: Concept
Additional Content Note: This class also includes: - inspections of air ducts, water and gas pipes, not associated with repair or installation
CoreContentNote: This class includes: - performance of physical, chemical and other analytical testing of all types of materials and products, e.g.: • acoustics and vibration testing • testing of composition and purity of minerals • testing activities in the field of food hygiene, including testing and control in relation to food production (e.g. testing of animals before slaughter) • testing of physical characteristics and the performance of materials (e.g. strength, thickness, durability, radioactivity) • qualification and reliability testing • performance testing of complete machinery: motors, automobiles, electronic equipment, etc. • radiographic testing of welds and joints • failure analysis • testing and measuring of environmental indicators: air and water pollution, etc. • testing the quality of fuels - certification of products, including consumer goods, motor vehicles, aircraft, pressurised containers, nuclear plants, etc. - periodic road safety testing of motor vehicles - testing with use of models or mock-ups (e.g. of aircraft, ships, dams) - operation of police or forensic laboratories - product origin and quality assessment activities
Exclusion Note: This class excludes: - inspections of air ducts, water and gas pipes, associated with repair or installation, see section F - sampling and weighing as part of goods handling operations, see 52.25 - penetration testing of computer systems, ethical hacking and cybersecurity, see division 62 - consulting activities carried out by companies or professionals in order to obtain a certification, see 70.20 - DNA sequencing for general research on biological processes, see 72.10 - testing of animal specimens, for sanitary reasons and not associated with food production, see 75.00 - diagnostic imaging, testing and analysis of medical and dental specimens, see division 86 - DNA sequencing for ruling out or curing a specific disease, see 86.91
broader: Technical testing and analysis
in scheme: Statistical Classification of Economic Activities in the European Community, Rev. 2.1 (NACE Rev. 2.1)
Notation: 71.20
top concept of: Statistical Classification of Economic Activities in the European Community, Rev. 2.1 (NACE Rev. 2.1)

ConceptNoneRandom0.6345126984038001
type: ConceptAssociation
description: NACE Rev. 2.1 class 06.20 is mapped to NACE Rev. 2 class 06.20
Type: 1:1
Source Concept: Extraction of natural gas
Target Concept: http://data.europa.eu/ux2/nace2/0620
in scheme: Statistical Classification of Economic Activities in the European Community, Rev. 2.1 (NACE Rev. 2.1)
scope note: the content of the NACE Rev 2.1 class is fully covered in the corresponding NACE Rev 2 class
top concept of: Statistical Classification of Economic Activities in the European Community, Rev. 2.1 (NACE Rev. 2.1)
Mapping Cardinality: 1 1

ConceptNoneRandom0.7734066616039987
type: ConceptAssociation
description: NACE Rev. 2.1 class 64.99 is mapped to NACE Rev. 2 class 64.99
Type: 4:3
Source Concept: Other financial service activities, except insurance and pension funding n.e.c.
Target Concept: http://data.europa.eu/ux2/nace2/6499
in scheme: Statistical Classification of Economic Activities in the European Community, Rev. 2.1 (NACE Rev. 2.1)
scope note: the content of the NACE Rev 2.1 class is fully covered in the corresponding NACE Rev 2 class
top concept of: Statistical Classification of Economic Activities in the European Community, Rev. 2.1 (NACE Rev. 2.1)
Mapping Cardinality: n m

ConceptNoneRandom0.14606963781219973
type: ConceptAssociation
description: NACE Rev. 2.1 group 35.4 is mapped to NACE Rev. 2 groups 35.1, 35.2
Type: 42:34
Source Concept: Activities of brokers and agents for electric power and natural gas
Target Concept: http://data.europa.eu/ux2/nace2/351
Target Concept: http://data.europa.eu/ux2/nace2/352
in scheme: Statistical Classification of Economic Activities in the European Community, Rev. 2.1 (NACE Rev. 2.1)
top concept of: Statistical Classification of Economic Activities in the European Community, Rev. 2.1 (NACE Rev. 2.1)
Mapping Cardinality: n m

ConceptNoneRandom0.2940691110333492
type: ConceptAssociation
description: NACE Rev. 2.1 group 22.1 is mapped to NACE Rev. 2 group 22.1
Type: 5:5
Source Concept: Manufacture of rubber products
Target Concept: http://data.europa.eu/ux2/nace2/221
in scheme: Statistical Classification of Economic Activities in the European Community, Rev. 2.1 (NACE Rev. 2.1)
top concept of: Statistical Classification of Economic Activities in the European Community, Rev. 2.1 (NACE Rev. 2.1)
Mapping Cardinality: n m

ConceptNoneRandom0.5480662522002079
type: ConceptAssociation
description: NACE Rev. 2.1 class 14.29 is mapped to NACE Rev. 2 class 14.19
Type: 4:5
Source Concept: Manufacture of other wearing apparel and accessories n.e.c.
Target Concept: http://data.europa.eu/ux2/nace2/1419
in scheme: Statistical Classification of Economic Activities in the European Community, Rev. 2.1 (NACE Rev. 2.1)
scope note: the content of the NACE Rev 2.1 class is fully covered in the corresponding NACE Rev 2 class
top concept of: Statistical Classification of Economic Activities in the European Community, Rev. 2.1 (NACE Rev. 2.1)
Mapping Cardinality: n m

ConceptNoneRandom0.43305352206047654
type: ConceptAssociation
description: NACE Rev. 2.1 division 20 is mapped to NACE Rev. 2 divisions 20, 38
Type: 2:2
Source Concept: Manufacture of chemicals and chemical products
Target Concept: http://data.europa.eu/ux2/nace2/20
Target Concept: http://data.europa.eu/ux2/nace2/38
in scheme: Statistical Classification of Economic Activities in the European Community, Rev. 2.1 (NACE Rev. 2.1)
top concept of: Statistical Classification of Economic Activities in the European Community, Rev. 2.1 (NACE Rev. 2.1)
Mapping Cardinality: n m

Extraction of natural gas
type: Concept
Additional Content Note: This class also includes: - mining of hydrocarbon liquids obtained through liquefaction or pyrolysis - fracking to extract coal seam gas
CoreContentNote: This class includes: - production of crude gaseous hydrocarbon (natural gas) - extraction of condensates - draining and separation of liquid hydrocarbon fractions - gas desulphurisation - extraction of coal mine methane
Exclusion Note: This class excludes: - support activities for oil and natural gas extraction, see 09.10 - oil and gas exploration, see 09.10 - production of natural gas liquids from crude petroleum (crude oil), see 19.20 - recovery of liquefied petroleum gases in the refining of petroleum, see 19.20 - manufacture of industrial gases, see 20.11 - operation of pipelines, see 49.50
broader: Extraction of natural gas
in scheme: Statistical Classification of Economic Activities in the European Community, Rev. 2.1 (NACE Rev. 2.1)
Notation: 06.20
top concept of: Statistical Classification of Economic Activities in the European Community, Rev. 2.1 (NACE Rev. 2.1)

ConceptNoneRandom0.29428457357568005
type: ConceptAssociation
description: NACE Rev. 2.1 class 77.40 is mapped to NACE Rev. 2 class 77.40
Type: 1:1
Source Concept: Leasing of intellectual property and similar products, except copyrighted works
Target Concept: http://data.europa.eu/ux2/nace2/7740
in scheme: Statistical Classification of Economic Activities in the European Community, Rev. 2.1 (NACE Rev. 2.1)
scope note: the content of the NACE Rev 2.1 class is fully covered in the corresponding NACE Rev 2 class
top concept of: Statistical Classification of Economic Activities in the European Community, Rev. 2.1 (NACE Rev. 2.1)
Mapping Cardinality: 1 1

ConceptNoneRandom0.1992468408597572
type: ConceptAssociation
description: NACE Rev. 2.1 division 68 is mapped to NACE Rev. 2 divisions 41, 42, 68
Type: 48:49
Source Concept: Real estate activities
Target Concept: http://data.europa.eu/ux2/nace2/41
Target Concept: http://data.europa.eu/ux2/nace2/42
Target Concept: http://data.europa.eu/ux2/nace2/68
in scheme: Statistical Classification of Economic Activities in the European Community, Rev. 2.1 (NACE Rev. 2.1)
top concept of: Statistical Classification of Economic Activities in the European Community, Rev. 2.1 (NACE Rev. 2.1)
Mapping Cardinality: n m

ConceptNoneRandom0.2732678868919971
type: ConceptAssociation
description: NACE Rev. 2.1 division 69 is mapped to NACE Rev. 2 division 69
Type: 1:1
Source Concept: Legal and accounting activities
Target Concept: http://data.europa.eu/ux2/nace2/69
in scheme: Statistical Classification of Economic Activities in the European Community, Rev. 2.1 (NACE Rev. 2.1)
top concept of: Statistical Classification of Economic Activities in the European Community, Rev. 2.1 (NACE Rev. 2.1)
Mapping Cardinality: 1 1

Manufacture of electricity distribution and control apparatus
type: Concept
CoreContentNote: This class includes: - manufacture of power circuit breakers - manufacture of surge suppressors (for distribution-level voltage) - manufacture of control panels for electric power distribution - manufacture of electrical relays - manufacture of duct for electrical switchboard apparatus - manufacture of electric fuses - manufacture of power switching equipment - manufacture of electric power switches (except push-button, snap, solenoid, tumbler)
Exclusion Note: This class excludes: - manufacture of environmental controls and industrial process control instruments, see 26.51 - manufacture of motor generator sets (except turbine generator sets), see 27.11 - manufacture of switches for electrical circuits (e.g. push-button and snap switches), see 27.33
broader: Manufacture of electric motors, generators, transformers and electricity distribution and control apparatus
in scheme: Statistical Classification of Economic Activities in the European Community, Rev. 2.1 (NACE Rev. 2.1)
Notation: 27.12
top concept of: Statistical Classification of Economic Activities in the European Community, Rev. 2.1 (NACE Rev. 2.1)

ConceptNoneRandom0.6250578464239605
type: ConceptAssociation
description: NACE Rev. 2.1 class 87.20 is mapped to NACE Rev. 2 class 87.20
Type: 1:1
Source Concept: Residential care activities for persons living with or having a diagnosis of a mental illness or substance abuse
Target Concept: http://data.europa.eu/ux2/nace2/8720
in scheme: Statistical Classification of Economic Activities in the European Community, Rev. 2.1 (NACE Rev. 2.1)
scope note: the content of the NACE Rev 2.1 class is fully covered in the corresponding NACE Rev 2 class
top concept of: Statistical Classification of Economic Activities in the European Community, Rev. 2.1 (NACE Rev. 2.1)
Mapping Cardinality: 1 1

Manufacture of batteries and accumulators
type: Concept
broader: Manufacture of electrical equipment
in scheme: Statistical Classification of Economic Activities in the European Community, Rev. 2.1 (NACE Rev. 2.1)
Notation: 27.2
top concept of: Statistical Classification of Economic Activities in the European Community, Rev. 2.1 (NACE Rev. 2.1)

ConceptNoneRandom0.22667037898523146
type: ConceptAssociation
description: NACE Rev. 2.1 class 27.11 is mapped to NACE Rev. 2 classes 27.11, 27.12, 27.90
Type: 11:11
Source Concept: Manufacture of electric motors, generators and transformers
Target Concept: http://data.europa.eu/ux2/nace2/2712
Target Concept: http://data.europa.eu/ux2/nace2/2790
Target Concept: http://data.europa.eu/ux2/nace2/2711
in scheme: Statistical Classification of Economic Activities in the European Community, Rev. 2.1 (NACE Rev. 2.1)
scope note: 27.11: - manufacture of electric motors except for motor vehicles - manufacture of distribution transformers, electric - manufacture of arc-welding transformers - manufacture of ballasts for discharge lamps or tubes (i.e. transformers) - manufacture of substation transformers for electric power distribution - manufacture of transmission and distribution voltage regulators - manufacture of inverters, rectifiers and converters - manufacture of electric linear actuators - manufacture of power generators (except battery charging alternators for internal combustion engines) - manufacture of motor generator sets (except turbine generator set units) - rewinding of armatures on a factory basis - manufacture of solar generators, which can be used directly to supply power to, e.g. a motor or an electrolyser 27.12: - manufacture of prime mover generator sets (except turbine generator sets) 27.90: - manufacture of solid state inverters and rectifying apparatus - manufacture of inverters, rectifiers and converters
top concept of: Statistical Classification of Economic Activities in the European Community, Rev. 2.1 (NACE Rev. 2.1)
Mapping Cardinality: n m

ConceptNoneRandom0.9283043145094363
type: ConceptAssociation
description: NACE Rev. 2.1 class 95.24 is mapped to NACE Rev. 2 class 95.24
Type: 1:1
Source Concept: Repair and maintenance of furniture and home furnishings
Target Concept: http://data.europa.eu/ux2/nace2/9524
in scheme: Statistical Classification of Economic Activities in the European Community, Rev. 2.1 (NACE Rev. 2.1)
scope note: the content of the NACE Rev 2.1 class is fully covered in the corresponding NACE Rev 2 class
top concept of: Statistical Classification of Economic Activities in the European Community, Rev. 2.1 (NACE Rev. 2.1)
Mapping Cardinality: 1 1

ConceptNoneRandom0.6163326015500534
type: ConceptAssociation
description: NACE Rev. 2.1 group 66.2 is mapped to NACE Rev. 2 group 66.2
Type: 1:1
Source Concept: Activities auxiliary to insurance and pension funding
Target Concept: http://data.europa.eu/ux2/nace2/662
in scheme: Statistical Classification of Economic Activities in the European Community, Rev. 2.1 (NACE Rev. 2.1)
top concept of: Statistical Classification of Economic Activities in the European Community, Rev. 2.1 (NACE Rev. 2.1)
Mapping Cardinality: 1 1

ConceptNoneRandom0.40689053756470095
type: ConceptAssociation
description: NACE Rev. 2.1 class 32.50 is mapped to NACE Rev. 2 classes 32.50, 32.99
Type: 11:11
Source Concept: Manufacture of medical and dental instruments and supplies
Target Concept: http://data.europa.eu/ux2/nace2/3250
Target Concept: http://data.europa.eu/ux2/nace2/3299
in scheme: Statistical Classification of Economic Activities in the European Community, Rev. 2.1 (NACE Rev. 2.1)
scope note: 32.50: manufacture of surgical drapes and sterile yarns and tissue - manufacture of dental fillings and cements (except denture adhesives), dental wax and other dental plaster preparations - manufacture of bone reconstruction cements - manufacture of dental laboratory furnaces - manufacture of laboratory ultrasonic cleaning machinery - manufacture of medical, surgical or laboratory sterilisers - manufacture of laboratory type centrifuges - manufacture of medical, surgical, dental or veterinary furniture, e.g.: • operating tables • examination tables • hospital beds with mechanical fittings • dentist chairs - manufacture of articles specially designed for use exclusively in implants in medical, surgical, dental or veterinary sciences, e.g. plates, which remain permanently in the body, for example, to replace part or the whole of a bone - manufacture of syringes, needles, catheters, cannulae, etc. - manufacture of dental instruments and appliances - manufacture of artificial teeth and dental fittings - manufacture of orthopaedic and prosthetic devices - manufacture of glass eyes - manufacture of medical thermometers - manufacture of ophthalmic goods, eyeglasses, sunglasses, lenses ground to prescription, contact lenses, safety goggles - manufacture of measure orthopaedic footwear and special insoles for correcting orthopaedic conditions 32.99: - manufacture of individual protective masks, e.g. FFP2, FFP3, surgical masks
top concept of: Statistical Classification of Economic Activities in the European Community, Rev. 2.1 (NACE Rev. 2.1)
Mapping Cardinality: n m

Other information technology and computer service activities
type: Concept
broader: Computer programming, consultancy and related activities
in scheme: Statistical Classification of Economic Activities in the European Community, Rev. 2.1 (NACE Rev. 2.1)
Notation: 62.9
top concept of: Statistical Classification of Economic Activities in the European Community, Rev. 2.1 (NACE Rev. 2.1)

Support activities for other mining and quarrying
type: Concept
broader: Mining support service activities
in scheme: Statistical Classification of Economic Activities in the European Community, Rev. 2.1 (NACE Rev. 2.1)
Notation: 09.9
top concept of: Statistical Classification of Economic Activities in the European Community, Rev. 2.1 (NACE Rev. 2.1)

ConceptNoneRandom0.8980205034296388
type: ConceptAssociation
description: NACE Rev. 2.1 class 18.20 is mapped to NACE Rev. 2 class 18.20
Type: 1:1
Source Concept: Reproduction of recorded media
Target Concept: http://data.europa.eu/ux2/nace2/1820
in scheme: Statistical Classification of Economic Activities in the European Community, Rev. 2.1 (NACE Rev. 2.1)
scope note: the content of the NACE Rev 2.1 class is fully covered in the corresponding NACE Rev 2 class
top concept of: Statistical Classification of Economic Activities in the European Community, Rev. 2.1 (NACE Rev. 2.1)
Mapping Cardinality: 1 1

ConceptNoneRandom0.0522310241195999
type: ConceptAssociation
description: NACE Rev. 2.1 division 63 is mapped to NACE Rev. 2 divisions 52, 63
Type: 48:49
Source Concept: Computing infrastructure, data processing, hosting and other information service activities
Target Concept: http://data.europa.eu/ux2/nace2/63
Target Concept: http://data.europa.eu/ux2/nace2/52
in scheme: Statistical Classification of Economic Activities in the European Community, Rev. 2.1 (NACE Rev. 2.1)
top concept of: Statistical Classification of Economic Activities in the European Community, Rev. 2.1 (NACE Rev. 2.1)
Mapping Cardinality: n m

Non-specialised retail sale of predominately food, beverages or tobacco
type: Concept
CoreContentNote: This class includes: - retail sale of a large variety of goods (e.g. wearing apparel, furniture, appliances, hardware, cosmetics) among which, however, food products, beverages or tobacco should be predominant
Exclusion Note: This class excludes: - retail sale of fuel, in combination with food, beverages, products for the maintenance of vehicles, car washing services, etc. where the sale of fuel is predominant, see 47.30
broader: Non-specialised retail sale
in scheme: Statistical Classification of Economic Activities in the European Community, Rev. 2.1 (NACE Rev. 2.1)
Notation: 47.11
top concept of: Statistical Classification of Economic Activities in the European Community, Rev. 2.1 (NACE Rev. 2.1)

ConceptNoneRandom0.2799896497062151
type: ConceptAssociation
description: NACE Rev. 2.1 class 30.32 is mapped to NACE Rev. 2 class 30.30
Type: 2:1
Source Concept: Manufacture of military air and spacecraft and related machinery
Target Concept: http://data.europa.eu/ux2/nace2/3030
in scheme: Statistical Classification of Economic Activities in the European Community, Rev. 2.1 (NACE Rev. 2.1)
scope note: the content of the NACE Rev 2.1 class is fully covered in the corresponding NACE Rev 2 class
top concept of: Statistical Classification of Economic Activities in the European Community, Rev. 2.1 (NACE Rev. 2.1)
Mapping Cardinality: n 1

Broader

Amusement and recreation activities
type: Concept
CoreContentNote: This group includes a wide range of units that operate facilities or provide services to meet the varied recreational interests of their patrons. It includes the operation of a variety of attractions (for example, mechanical rides, water rides, games, shows, theme exhibits and picnic grounds).
Exclusion Note: This group excludes: - dramatic arts, music and other arts, see division 90 - sports activities, see 93.1 - activities related to the infrastructure and facilities for sports (e.g. swimming pools, playgrounds), see 93.11
broader: Sports activities and amusement and recreation activities
in scheme: Statistical Classification of Economic Activities in the European Community, Rev. 2.1 (NACE Rev. 2.1)
Notation: 93.2
top concept of: Statistical Classification of Economic Activities in the European Community, Rev. 2.1 (NACE Rev. 2.1)

ConceptNoneRandom0.2345530269822188
type: ConceptAssociation
description: NACE Rev. 2.1 class 74.30 is mapped to NACE Rev. 2 class 74.30
Type: 1:1
Source Concept: Translation and interpretation activities
Target Concept: http://data.europa.eu/ux2/nace2/7430
in scheme: Statistical Classification of Economic Activities in the European Community, Rev. 2.1 (NACE Rev. 2.1)
scope note: the content of the NACE Rev 2.1 class is fully covered in the corresponding NACE Rev 2 class
top concept of: Statistical Classification of Economic Activities in the European Community, Rev. 2.1 (NACE Rev. 2.1)
Mapping Cardinality: 1 1

Manufacture of electric motors, generators and transformers
type: Concept
CoreContentNote: This class includes the manufacture of all electric motors and transformers: AC, DC and AC/DC. This class includes: - manufacture of electric motors, except for motor vehicles - manufacture of distribution transformers, electric - manufacture of arc welding transformers - manufacture of ballasts for discharge lamps or tubes (i.e. transformers) - manufacture of substation transformers for electric power distribution - manufacture of transmission and distribution-voltage regulators - manufacture of inverters, rectifiers and converters - manufacture of electric linear actuators - manufacture of prime mover generator sets (except turbine generator sets) - manufacture of power generators (except battery charging alternators for internal combustion engines) - manufacture of motor generator sets (except turbine generator sets) - rewinding of armatures on a factory basis - manufacture of solar generators, which can be used directly to supply power to, e.g. a motor or an electrolyser
Exclusion Note: This class excludes: - manufacture of electronic component-type transformers and switches, see 26.11 - manufacture of photovoltaic cells, modules and panels, see 26.11 - manufacture of electric welding and soldering equipment, see 27.90 - manufacture of turbine generator sets, see 28.11 - manufacture of electric motors for motor vehicles, see 29.10 - manufacture of starting motors and generators for internal combustion engines, see 29.31
broader: Manufacture of electric motors, generators, transformers and electricity distribution and control apparatus
in scheme: Statistical Classification of Economic Activities in the European Community, Rev. 2.1 (NACE Rev. 2.1)
Notation: 27.11
top concept of: Statistical Classification of Economic Activities in the European Community, Rev. 2.1 (NACE Rev. 2.1)

Forestry and logging
type: Concept
CoreContentNote: This division includes silviculture and the production of roundwood as well as the extraction and gathering of wild-growing non-wood forest products. Besides the production of timber, forestry activities result in products that undergo little processing, for example, firewood, charcoal or roundwood used in an unprocessed form (such as pit-props or pulpwood). These activities can be carried out in natural, semi-natural or planted forests.
Exclusion Note: Excluded is further processing of wood beginning with sawmilling and planing of wood, see division 16.
broader: AGRICULTURE, FORESTRY AND FISHING
in scheme: Statistical Classification of Economic Activities in the European Community, Rev. 2.1 (NACE Rev. 2.1)
Notation: 02
top concept of: Statistical Classification of Economic Activities in the European Community, Rev. 2.1 (NACE Rev. 2.1)

Other non-specialised retail sale
type: Concept
CoreContentNote: This class includes: - retail sale of a large variety of goods (e.g. wearing apparel, furniture, appliances, hardware, cosmetics, jewellery, toys, sports goods) of which food products, beverages or tobacco are not predominant
Exclusion Note: This class excludes: - non-specialised retail sale of second-hand goods, see 47.79
broader: Non-specialised retail sale
in scheme: Statistical Classification of Economic Activities in the European Community, Rev. 2.1 (NACE Rev. 2.1)
Notation: 47.12
top concept of: Statistical Classification of Economic Activities in the European Community, Rev. 2.1 (NACE Rev. 2.1)

Mining of hard coal
type: Concept
broader: Mining of coal and lignite
in scheme: Statistical Classification of Economic Activities in the European Community, Rev. 2.1 (NACE Rev. 2.1)
Notation: 05.1
top concept of: Statistical Classification of Economic Activities in the European Community, Rev. 2.1 (NACE Rev. 2.1)

ConceptNoneRandom0.26280526186864706
type: ConceptAssociation
description: NACE Rev. 2.1 class 20.51 is mapped to NACE Rev. 2 classes 20.14, 20.59
Type: 4:6
Source Concept: Manufacture of liquid biofuels
Target Concept: http://data.europa.eu/ux2/nace2/2059
Target Concept: http://data.europa.eu/ux2/nace2/2014
in scheme: Statistical Classification of Economic Activities in the European Community, Rev. 2.1 (NACE Rev. 2.1)
scope note: 20.14: - manufacture of ethanol from biomass - manufacture of mixtures of bio-ethanol and ethers partially derived from biomass - manufacture of liquid biofuels even if processes use waste as an input 20.59: - manufacture of biodiesel
top concept of: Statistical Classification of Economic Activities in the European Community, Rev. 2.1 (NACE Rev. 2.1)
Mapping Cardinality: n m

ConceptNoneRandom0.40324559219850264
type: ConceptAssociation
description: NACE Rev. 2.1 class 10.71 is mapped to NACE Rev. 2 classes 10.71, 10.86
Type: 6:6
Source Concept: Manufacture of bread; manufacture of fresh pastry goods and cakes
Target Concept: http://data.europa.eu/ux2/nace2/1071
Target Concept: http://data.europa.eu/ux2/nace2/1086
in scheme: Statistical Classification of Economic Activities in the European Community, Rev. 2.1 (NACE Rev. 2.1)
scope note: 10.71: - manufacture of bakery products: • bread and rolls • pastry, cakes, pies, tarts, pancakes, waffles etc. - manufacture of pre-baked bread 10.86: - manufacture of gluten-free products
top concept of: Statistical Classification of Economic Activities in the European Community, Rev. 2.1 (NACE Rev. 2.1)
Mapping Cardinality: n m

Other waste recovery
type: Concept
CoreContentNote: This class includes: - preparation of sewage sludge for land treatment resulting in benefits to agriculture or ecological improvement - preparation of non-hazardous waste for reclamation in excavated areas or for engineering purposes in landscaping
Exclusion Note: This class excludes: - production of biogas from sewage sludge, see 35.21 - back-filling without related preparation activities (e.g. preparation of non-hazardous waste for engineering purposes in landscaping), see division 42
broader: Waste recovery
in scheme: Statistical Classification of Economic Activities in the European Community, Rev. 2.1 (NACE Rev. 2.1)
Notation: 38.23
top concept of: Statistical Classification of Economic Activities in the European Community, Rev. 2.1 (NACE Rev. 2.1)

ConceptNoneRandom0.5153934144985458
type: ConceptAssociation
description: NACE Rev. 2.1 class 95.23 is mapped to NACE Rev. 2 class 95.23
Type: 1:1
Source Concept: Repair and maintenance of footwear and leather goods
Target Concept: http://data.europa.eu/ux2/nace2/9523
in scheme: Statistical Classification of Economic Activities in the European Community, Rev. 2.1 (NACE Rev. 2.1)
scope note: the content of the NACE Rev 2.1 class is fully covered in the corresponding NACE Rev 2 class
top concept of: Statistical Classification of Economic Activities in the European Community, Rev. 2.1 (NACE Rev. 2.1)
Mapping Cardinality: 1 1

ConceptNoneRandom0.7698912752596063
type: ConceptAssociation
description: NACE Rev. 2.1 group 88.1 is mapped to NACE Rev. 2 group 88.1
Type: 1:1
Source Concept: Social work activities without accommodation for older persons or persons with disabilities
Target Concept: http://data.europa.eu/ux2/nace2/881
in scheme: Statistical Classification of Economic Activities in the European Community, Rev. 2.1 (NACE Rev. 2.1)
top concept of: Statistical Classification of Economic Activities in the European Community, Rev. 2.1 (NACE Rev. 2.1)
Mapping Cardinality: 1 1

Motion picture, video and television programme production activities
type: Concept
CoreContentNote: This class includes: - production of motion pictures, videos or audiovisual and television programme elements - production of advertising films - production of animated audiovisual works - production of television or video news programmes - production of vlogs - production of video podcasts
Exclusion Note: This class excludes: - film duplicating (except reproduction of motion picture film for theatrical distribution) as well as reproduction of audio and video recordings on physical media from master copies, see 18.20 - wholesale of recorded media, see 46.49 - retail sale of recorded media, see 47.69 - post-production activities, see 59.12 - reproduction of motion picture film for theatrical distribution, see 59.12 - processing motion picture film, see 59.12 - sound recording and recording of audiobooks, see 59.20 - television broadcasting, see 60.20 - creating a complete television channel programme, see 60.20 - film processing, excluding processing motion picture film, see 74.20 - activities of personal theatrical or artistic agents or agencies, see 74.99 - rental of videotapes and DVDs to the general public, see 77.22 - real-time (i.e. simultaneous) closed captioning (e.g. of live television performance meetings or conferences), see 82.99 - activities of independent cartoonists, see 90.12 - activities of independent actors, see 90.20 - activities of independent stage designers and other support activities to the performing arts, see 90.3 - activities of independent directors, see 90.39
broader: Motion picture, video and television programme activities
in scheme: Statistical Classification of Economic Activities in the European Community, Rev. 2.1 (NACE Rev. 2.1)
Notation: 59.11
top concept of: Statistical Classification of Economic Activities in the European Community, Rev. 2.1 (NACE Rev. 2.1)

ConceptNoneRandom0.10585327468028016
type: ConceptAssociation
description: NACE Rev. 2.1 group 66.3 is mapped to NACE Rev. 2 groups 66.1, 66.3
Type: 2:2
Source Concept: Fund management activities
Target Concept: http://data.europa.eu/ux2/nace2/663
Target Concept: http://data.europa.eu/ux2/nace2/661
in scheme: Statistical Classification of Economic Activities in the European Community, Rev. 2.1 (NACE Rev. 2.1)
top concept of: Statistical Classification of Economic Activities in the European Community, Rev. 2.1 (NACE Rev. 2.1)
Mapping Cardinality: n m

Tertiary education
type: Concept
Additional Content Note: This class also includes: - short-cycle vocational education and training programmes at ISCED-P 2011 Level 5 - higher vocational and professional education and training programmes at ISCED-P 2011 Level 6 and ISCED-P 2011 Level 7 (for example, those leading to master craftsmen qualifications) - education activities of performing arts schools providing tertiary education - adult or continuing education programmes equivalent in complexity of content to the education given in education activities already classified at this level
CoreContentNote: This class includes the furnishing of tertiary academic, professional and vocational courses and the granting of degrees at short-cycle, bachelor’s or equivalent level, master’s or equivalent level, and doctoral level. This class includes education in public and private universities provided at the level of: - short-cycle studies, usually based on practical learning appropriate to the performance of a given profession and preparing students for entry into the labour market or other higher education programmes - first-cycle studies open to applicants with a secondary school leaving certificate and leading to a first-degree qualification - second-cycle studies open to applicants holding at least a first-cycle qualification and leading to a second-cycle qualification - comprehensive master’s degree courses open to applicants holding a secondary school leaving certificate and leading to a second-cycle qualification - postgraduate studies open to applicants who have completed at least first-cycle studies and leading to a postgraduate qualification - third-cycle studies (training for doctoral students) open to applicants holding at least second-cycle studies and leading to a third-cycle qualification Education may be conducted as full-time or part-time studies.
Exclusion Note: This class excludes: - non-formal education and training, see 85.5
broader: Tertiary education
in scheme: Statistical Classification of Economic Activities in the European Community, Rev. 2.1 (NACE Rev. 2.1)
Notation: 85.40
top concept of: Statistical Classification of Economic Activities in the European Community, Rev. 2.1 (NACE Rev. 2.1)

ConceptNoneRandom0.39287226255807983
type: ConceptAssociation
description: NACE Rev. 2.1 division 62 is mapped to NACE Rev. 2 division 62
Type: 1:1
Source Concept: Computer programming, consultancy and related activities
Target Concept: http://data.europa.eu/ux2/nace2/62
in scheme: Statistical Classification of Economic Activities in the European Community, Rev. 2.1 (NACE Rev. 2.1)
top concept of: Statistical Classification of Economic Activities in the European Community, Rev. 2.1 (NACE Rev. 2.1)
Mapping Cardinality: 1 1

Other credit granting
type: Concept
CoreContentNote: This class includes: - financial service activities primarily concerned with making intermediation by incurring liabilities – in forms other than currency, deposits or close substitutes for deposits – where the granting of credit can take a variety of forms (e.g. loans, mortgages, credit cards), providing the following types of services: • granting of consumer credit by non-depository institutions • international trade financing • provision of long-term finance to industry • provision of banking-like services without a banking license, in cooperation with a licensed bank • money lending outside the banking system • credit granting by specialised non-depository institutions (e.g. for house purchases) • loan securitisation • factoring and supply chain financing activities • activities of pawnbrokers
Exclusion Note: This class excludes: - credit granting by specialised deposit-taking institutions, see 64.19 - financial leasing, see 64.91 - securitisation of assets other than loans, see 64.99 - operating leasing, according to type of goods leased, see division 77 - grant-giving activities by membership organisations, see 94.99
broader: Other financial service activities, except insurance and pension funding
in scheme: Statistical Classification of Economic Activities in the European Community, Rev. 2.1 (NACE Rev. 2.1)
Notation: 64.92
top concept of: Statistical Classification of Economic Activities in the European Community, Rev. 2.1 (NACE Rev. 2.1)

ConceptNoneRandom0.8076019292742589
type: ConceptAssociation
description: NACE Rev. 2.1 class 52.10 is mapped to NACE Rev. 2 class 52.10
Type: 78:65
Source Concept: Warehousing and storage
Target Concept: http://data.europa.eu/ux2/nace2/5210
in scheme: Statistical Classification of Economic Activities in the European Community, Rev. 2.1 (NACE Rev. 2.1)
scope note: the content of the NACE Rev 2.1 class is fully covered in the corresponding NACE Rev 2 class
top concept of: Statistical Classification of Economic Activities in the European Community, Rev. 2.1 (NACE Rev. 2.1)
Mapping Cardinality: n m

ConceptNoneRandom0.134199783114055
type: ConceptAssociation
description: NACE Rev. 2.1 class 32.99 is mapped to NACE Rev. 2 classes 27.90, 32.30, 32.99
Type: 11:11
Source Concept: Other manufacturing n.e.c.
Target Concept: http://data.europa.eu/ux2/nace2/3230
Target Concept: http://data.europa.eu/ux2/nace2/2790
Target Concept: http://data.europa.eu/ux2/nace2/3299
in scheme: Statistical Classification of Economic Activities in the European Community, Rev. 2.1 (NACE Rev. 2.1)
scope note: 27.90: - manufacture of electronic cigarettes (vapes) 32.30: - manufacture of sports safety headgear 32.99: - manufacture of protective safety equipment, e.g.: • linemen's safety belts and other belts for occupational use • cork life preservers • safety headgear and other personal safety equipment (e.g. protective face shields/visors, of plastics, such as athletic helmets) • firefighting resistant clothing • metal safety headgear and other metal personal safety devices • earplugs and noise plugs, e.g. for swimming and noise protection • gas masks • biohazard protective clothing and accessories • bulletproof vests • clean room suits and accessories - manufacture of pens and pencils of all kinds whether or not mechanical - manufacture of pencil leads - manufacture of date, sealing or numbering stamps, hand-operated devices for printing, or embossing labels, hand printing sets, prepared typewriter ribbons and inked pads - manufacture of globes - manufacture of umbrellas, sun-umbrellas, walking sticks, seat-sticks - manufacture of buttons, press-fasteners, snap-fasteners, press-studs, slide fasteners - manufacture of cigarette lighters and other lighters - manufacture of articles of personal use, e.g.: smoking pipes, scent sprays, vacuum flasks and other vacuum vessels for personal or household use, wigs, false beards, eyebrows - manufacture of miscellaneous articles, e.g.: candles, tapers and the like; artificial flowers, fruit and foliage; jokes and novelties; hand sieves and hand riddles; tailors' dummies; burial coffins - manufacture of floral baskets, bouquets, wreaths and similar articles - taxidermy activities - manufacture of scale models designed for demonstrational purposes
top concept of: Statistical Classification of Economic Activities in the European Community, Rev. 2.1 (NACE Rev. 2.1)
Mapping Cardinality: n m

Investigation and security activities
type: Concept
CoreContentNote: This group includes security activities that are normally carried out by private operators.
broader: Investigation and security activities
in scheme: Statistical Classification of Economic Activities in the European Community, Rev. 2.1 (NACE Rev. 2.1)
Notation: 80.0
top concept of: Statistical Classification of Economic Activities in the European Community, Rev. 2.1 (NACE Rev. 2.1)

Child day-care activities
type: Concept
Additional Content Note: This class also includes: - day-care activities for children with disabilities
CoreContentNote: This class includes: - day-care activities for children provided in private homes or day-care centres - after-school care activities
broader: Other social work activities without accommodation
in scheme: Statistical Classification of Economic Activities in the European Community, Rev. 2.1 (NACE Rev. 2.1)
Notation: 88.91
top concept of: Statistical Classification of Economic Activities in the European Community, Rev. 2.1 (NACE Rev. 2.1)

Fishing and aquaculture
type: Concept
Additional Content Note: The division also includes service activities incidental to marine or freshwater fishery or aquaculture.
CoreContentNote: This division includes capture fishery and aquaculture, which are characterised by the gathering of marine, brackish or freshwater fish, crustaceans, molluscs, and other organisms and products (for example, aquatic plants, pearls, sponges).
Exclusion Note: This division excludes: - processing of fish, crustaceans or molluscs, whether at land-based plants or on factory ships, see 10.20 - building and repairing of ships and boats, see 30.11, 30.13, 33.15, 33.18 - sport or recreational fishing activities, see 93.19
broader: AGRICULTURE, FORESTRY AND FISHING
in scheme: Statistical Classification of Economic Activities in the European Community, Rev. 2.1 (NACE Rev. 2.1)
Notation: 03
top concept of: Statistical Classification of Economic Activities in the European Community, Rev. 2.1 (NACE Rev. 2.1)

ConceptNoneRandom0.6064583236470376
type: ConceptAssociation
description: NACE Rev. 2.1 class 84.11 is mapped to NACE Rev. 2 class 84.11
Type: 1:1
Source Concept: General public administration activities
Target Concept: http://data.europa.eu/ux2/nace2/8411
in scheme: Statistical Classification of Economic Activities in the European Community, Rev. 2.1 (NACE Rev. 2.1)
scope note: the content of the NACE Rev 2.1 class is fully covered in the corresponding NACE Rev 2 class
top concept of: Statistical Classification of Economic Activities in the European Community, Rev. 2.1 (NACE Rev. 2.1)
Mapping Cardinality: 1 1

Mining of lignite
type: Concept
broader: Mining of coal and lignite
in scheme: Statistical Classification of Economic Activities in the European Community, Rev. 2.1 (NACE Rev. 2.1)
Notation: 05.2
top concept of: Statistical Classification of Economic Activities in the European Community, Rev. 2.1 (NACE Rev. 2.1)

Manufacture of luggage, handbags, saddlery and harness of any material
type: Concept
Additional Content Note: This class also includes: - manufacture of leather clothes for animals
CoreContentNote: This class includes: - manufacture of luggage, handbags, backpacks, etc., of leather, composition leather or any other material where the same technology is used as for leather - manufacture of saddlery and harness for any animal - manufacture of non-metallic watch bands (e.g. fabric, leather, plastic) - manufacture of diverse articles of leather or composition leather (e.g. driving belts, packings) - manufacture of shoelaces, of leather - manufacture of horse whips and riding crops
Exclusion Note: This class excludes: - manufacture of leather wearing apparel, see 14.24 - manufacture of leather gloves and hats, see 14.29 - manufacture of footwear, see 15.20 - manufacture of saddles for bicycles, see 30.92 - manufacture of precious metal watch bands, see 32.12 - manufacture of non-precious metal watch bands, see 32.13 - manufacture of linemen’s safety belts and other belts for occupational use, see 32.99
broader: Tanning, dyeing, dressing of leather and fur; manufacture of luggage, handbags, saddlery and harness
in scheme: Statistical Classification of Economic Activities in the European Community, Rev. 2.1 (NACE Rev. 2.1)
Notation: 15.12
top concept of: Statistical Classification of Economic Activities in the European Community, Rev. 2.1 (NACE Rev. 2.1)

Technical testing and analysis
type: Concept
broader: Architectural and engineering activities; technical testing and analysis
in scheme: Statistical Classification of Economic Activities in the European Community, Rev. 2.1 (NACE Rev. 2.1)
Notation: 71.2
top concept of: Statistical Classification of Economic Activities in the European Community, Rev. 2.1 (NACE Rev. 2.1)

Energy recovery
type: Concept
Additional Content Note: This class also includes the activities of waste-to-energy plants.
CoreContentNote: This class includes pretreatment of waste for energy recovery, conversion of waste materials (for example, into usable heat or electricity), through a variety of processes, which include thermal treatment.
Exclusion Note: This class excludes: - landfill gas recovery for gas supply, see 35.21
broader: Waste recovery
in scheme: Statistical Classification of Economic Activities in the European Community, Rev. 2.1 (NACE Rev. 2.1)
Notation: 38.22
top concept of: Statistical Classification of Economic Activities in the European Community, Rev. 2.1 (NACE Rev. 2.1)

Motion picture, video and television programme post-production activities
type: Concept
Additional Content Note: This class also includes: - activities of stock footage film libraries, etc.
CoreContentNote: This class includes: - motion picture, video or audiovisual and television programme post-production activities, e.g.: • editing, titling, subtitling credits, closed captioning • film/tape transfers • conversion to video streaming formats - activities of motion picture film laboratories and activities of special laboratories for animated films: • developing and processing motion picture film • reproduction of motion picture film for cinema distribution
Exclusion Note: This class excludes: - film duplication and reproduction of audio and video recordings from master copies, see 18.20 - wholesale of recorded media, see 46.49 - retail sale of recorded media, see 47.69 - animation production, see 59.11 - film processing, not for the motion picture industry, see 74.20 - rental of recorded media to the general public, see 77.22 - real-time (i.e. simultaneous) closed captioning, see 82.99 - activities of independent actors, cartoonists, directors, stage designers, and other support activities to the performing arts, see division 90
broader: Motion picture, video and television programme activities
in scheme: Statistical Classification of Economic Activities in the European Community, Rev. 2.1 (NACE Rev. 2.1)
Notation: 59.12
top concept of: Statistical Classification of Economic Activities in the European Community, Rev. 2.1 (NACE Rev. 2.1)

ConceptNoneRandom0.09342230583330524
type: ConceptAssociation
description: NACE Rev. 2.1 group 13.9 is mapped to NACE Rev. 2 groups 13.2, 13.9
Type: 3:3
Source Concept: Manufacture of other textiles
Target Concept: http://data.europa.eu/ux2/nace2/132
Target Concept: http://data.europa.eu/ux2/nace2/139
in scheme: Statistical Classification of Economic Activities in the European Community, Rev. 2.1 (NACE Rev. 2.1)
top concept of: Statistical Classification of Economic Activities in the European Community, Rev. 2.1 (NACE Rev. 2.1)
Mapping Cardinality: n m

Scheduled passenger transport by road
type: Concept
Additional Content Note: This class also includes: - operation of school buses and buses for the transport of employees - scheduled passenger transport by road for sightseeing
CoreContentNote: This class includes: - scheduled urban, suburban or long-distance road transport of passengers by e.g. bus, coach, trolleybus, minibus. Such transport follows a fixed timetable, entailing the picking up and setting down of passengers normally at fixed stops
Exclusion Note: This class excludes: - passenger rail transport, see 49.1 - passenger transport by funicular railway, see 49.12 - non-scheduled passenger transport by road for sightseeing, in vehicles of 10 or more persons, see 49.32 - on-demand passenger transport services in vehicles with a driver for a maximum of 9 persons (taxi, etc.), see 49.33 - operation of aerial cableways, etc., see 49.34
broader: Other passenger land transport
in scheme: Statistical Classification of Economic Activities in the European Community, Rev. 2.1 (NACE Rev. 2.1)
Notation: 49.31
top concept of: Statistical Classification of Economic Activities in the European Community, Rev. 2.1 (NACE Rev. 2.1)

Mining of coal and lignite
type: Concept
CoreContentNote: This division includes the extraction of solid mineral fuels through underground or open-cast mining and includes operations (for example, grading, cleaning, compressing and other steps necessary for transport) leading to a marketable product.
Exclusion Note: This division excludes: - coking, see 19.10 - services incidental to coal or lignite mining, see 09.90 - manufacture of briquettes, see 19.20
broader: MINING AND QUARRYING
in scheme: Statistical Classification of Economic Activities in the European Community, Rev. 2.1 (NACE Rev. 2.1)
Notation: 05
top concept of: Statistical Classification of Economic Activities in the European Community, Rev. 2.1 (NACE Rev. 2.1)

ConceptNoneRandom0.6109063719156081
type: ConceptAssociation
description: NACE Rev. 2.1 division 65 is mapped to NACE Rev. 2 division 65
Type: 1:1
Source Concept: Insurance, reinsurance and pension funding, except compulsory social security
Target Concept: http://data.europa.eu/ux2/nace2/65
in scheme: Statistical Classification of Economic Activities in the European Community, Rev. 2.1 (NACE Rev. 2.1)
top concept of: Statistical Classification of Economic Activities in the European Community, Rev. 2.1 (NACE Rev. 2.1)
Mapping Cardinality: 1 1

Freshwater fishing
type: Concept
Additional Content Note: This class also includes: - gathering of freshwater materials - gathering of other freshwater organisms: seaweed and algae
CoreContentNote: This class includes: - fishing on a commercial basis in inland waters - taking of freshwater crustaceans and molluscs - taking of freshwater aquatic animals
Exclusion Note: This class excludes: - catching of frogs or collection of snails in the wild, see 01.70 - collecting wild plants (e.g. reeds, sedges), see 02.30 - processing of fish, crustaceans and molluscs on factory ships or in factories ashore, see 10.20 - fishing inspection, protection and patrol services, see 84.24 - fishing practiced for sport or recreation and related services, see 93.19 - operation of sport fishing preserves, see 93.19
broader: Fishing
in scheme: Statistical Classification of Economic Activities in the European Community, Rev. 2.1 (NACE Rev. 2.1)
Notation: 03.12
top concept of: Statistical Classification of Economic Activities in the European Community, Rev. 2.1 (NACE Rev. 2.1)

Manufacture of metal forming machinery and machine tools for metal work
type: Concept
CoreContentNote: This class includes: - manufacture of machine tools for working metals, including those using a laser beam, ultrasonic waves, plasma arc, magnetic pulse, etc. - manufacture of machine tools for turning, drilling, boring, threading or tapping for working metal - manufacture of machine tools for deburring, sharpening, grinding, honing, lapping, polishing or otherwise finishing metal or cermet by means of grinding stones, abrasives or polishing products - manufacture of machining centres and multi-station machines for working metal - manufacture of machine tools for planing, shaping, slotting, broaching, gear cutting, gear grinding or gear finishing, sawing and cutting-off, and of other machine tools working by removing metal or cermets - manufacture of metal stamping or pressing machine tools - manufacture of punch presses, hydraulic presses, hydraulic brakes, drop hammers, forging machines, etc. - manufacture of draw benches, thread rolling machines for working wires - manufacture of filing machines, riveters, sheet metal cutters
Exclusion Note: This class excludes: - manufacture of interchangeable tools, see 25.63 - manufacture of electrical welding and soldering machinery and apparatus, see 27.90 - manufacture of machines for additive manufacturing, see 28.97
broader: Manufacture of metal forming machinery and machine tools
in scheme: Statistical Classification of Economic Activities in the European Community, Rev. 2.1 (NACE Rev. 2.1)
Notation: 28.41
top concept of: Statistical Classification of Economic Activities in the European Community, Rev. 2.1 (NACE Rev. 2.1)

ConceptNoneRandom0.9013777434242547
type: ConceptAssociation
description: NACE Rev. 2.1 class 84.12 is mapped to NACE Rev. 2 class 84.12
Type: 1:1
Source Concept: Regulation of health care, education, cultural services and other social services
Target Concept: http://data.europa.eu/ux2/nace2/8412
in scheme: Statistical Classification of Economic Activities in the European Community, Rev. 2.1 (NACE Rev. 2.1)
scope note: the content of the NACE Rev 2.1 class is fully covered in the corresponding NACE Rev 2 class
top concept of: Statistical Classification of Economic Activities in the European Community, Rev. 2.1 (NACE Rev. 2.1)
Mapping Cardinality: 1 1

Manufacture of other machine tools
type: Concept
Additional Content Note: This class also includes: - manufacture of parts and accessories for the machine tools listed
CoreContentNote: This class includes: - manufacture of machine tools for working wood, cork, bone, stone, hard rubber, hard plastics, ceramics, concrete, cold glass or similar hard non-metal materials - manufacture of work holders for machine tools - manufacture of dividing heads and other special attachments for machine tools - manufacture of stationary machines for nailing, stapling, glueing or otherwise assembling wood, cork, bone, hard rubber or hard plastics, etc. - manufacture of stationary rotary or rotary percussion drills, etc. - manufacture of presses for the manufacture of particle board, etc.
Exclusion Note: This class excludes: - manufacture of interchangeable tools for machine tools (e.g. drills, punches, dies, taps, milling cutters, turning tools, saw blades, cutting knives), see 25.63 - manufacture of electric handheld soldering irons and soldering guns, see 27.90 - manufacture of power-driven hand tools, see 28.24 - manufacture of filing machines, riveters, sheet metal cutters, see 28.41 - manufacture of machinery used in metal mills or foundries, see 28.91 - manufacture of machinery for mining and quarrying, see 28.92 - manufacture of machines for additive manufacturing, see 28.97
broader: Manufacture of metal forming machinery and machine tools
in scheme: Statistical Classification of Economic Activities in the European Community, Rev. 2.1 (NACE Rev. 2.1)
Notation: 28.42
top concept of: Statistical Classification of Economic Activities in the European Community, Rev. 2.1 (NACE Rev. 2.1)

Marine fishing
type: Concept
Additional Content Note: This class also includes: - gathering of other marine organisms and materials (e.g. natural pearls, sponges, coral, seaweed, algae)
CoreContentNote: This class includes: - fishing on a commercial basis in ocean and coastal waters - taking of marine crustaceans and molluscs - whaling - taking of marine aquatic animals (e.g. turtles, sea squirts, tunicates, sea urchins)
Exclusion Note: This class excludes: - capturing of marine mammals apart from whales (e.g. seals, walruses), see 01.70 - processing of whales on factory ships, see 10.11 - processing of fish, crustaceans and molluscs on factory ships or in factories ashore, see 10.20 - rental of pleasure boats with crew for sea and coastal water transport (e.g. for fishing trips), see 50.10 - fishing inspection, protection and patrol services, see 84.24 - fishing practiced for sport or recreation and related services, see 93.19 - operation of sport fishing preserves, see 93.19
broader: Fishing
in scheme: Statistical Classification of Economic Activities in the European Community, Rev. 2.1 (NACE Rev. 2.1)
Notation: 03.11
top concept of: Statistical Classification of Economic Activities in the European Community, Rev. 2.1 (NACE Rev. 2.1)

Non-scheduled passenger transport by road
type: Concept
CoreContentNote: This class includes: - non-scheduled urban, interurban and long-distance road transport of passengers in vehicles of 10 or more persons. This may include transport by bus, coach, trolleybus or minibus.
Exclusion Note: This class excludes: - passenger rail transport, see 49.1 - operation of school buses and buses for the transport of employees, see 49.31 - on-demand passenger transport services in vehicles with a driver for a maximum of 9 persons (taxi, etc.), see 49.33
broader: Other passenger land transport
in scheme: Statistical Classification of Economic Activities in the European Community, Rev. 2.1 (NACE Rev. 2.1)
Notation: 49.32
top concept of: Statistical Classification of Economic Activities in the European Community, Rev. 2.1 (NACE Rev. 2.1)

ConceptNoneRandom0.4350085672970029
type: ConceptAssociation
description: NACE Rev. 2.1 class 10.73 is mapped to NACE Rev. 2 classes 10.73, 10.86
Type: 6:6
Source Concept: Manufacture of farinaceous products
Target Concept: http://data.europa.eu/ux2/nace2/1086
Target Concept: http://data.europa.eu/ux2/nace2/1073
in scheme: Statistical Classification of Economic Activities in the European Community, Rev. 2.1 (NACE Rev. 2.1)
scope note: 10.73: - manufacture of pastas, e.g. macaroni and noodles, whether or not cooked or stuffed - manufacture of couscous 10.86: - manufacture of gluten-free products
top concept of: Statistical Classification of Economic Activities in the European Community, Rev. 2.1 (NACE Rev. 2.1)
Mapping Cardinality: n m

Manufacture of brooms and brushes
type: Concept
CoreContentNote: This class includes: - manufacture of brooms and brushes (e.g. toilet brushes, household brushes, paintbrushes, fine brushes, technical and industrial brushes, including brushes constituting parts of machines, hand-operated mechanical floor sweepers, mops and feather-dusters, paint pads and rollers, squeegees and other brushes, brooms, mops) - manufacture of shoe and clothes brushes
broader: Manufacturing n.e.c.
in scheme: Statistical Classification of Economic Activities in the European Community, Rev. 2.1 (NACE Rev. 2.1)
Notation: 32.91
top concept of: Statistical Classification of Economic Activities in the European Community, Rev. 2.1 (NACE Rev. 2.1)

Reproduction of recorded media
type: Concept
broader: Printing and reproduction of recorded media
in scheme: Statistical Classification of Economic Activities in the European Community, Rev. 2.1 (NACE Rev. 2.1)
Notation: 18.2
top concept of: Statistical Classification of Economic Activities in the European Community, Rev. 2.1 (NACE Rev. 2.1)

Inland passenger water transport
type: Concept
Additional Content Note: This class also includes: - rental of pleasure boats with crew for inland water transport - operation of sightseeing boats and excursions on inland waterways - inland ferry transport of passengers with or without a vehicle
CoreContentNote: This class includes: - transport of passengers via rivers, canals, lakes and other inland waterways, including inside harbours and ports
Exclusion Note: This class excludes: - restaurant and bar activities aboard ships, when provided by separate units, see 56.11, 56.30 - rental of pleasure boats and yachts without crew, see 77.21 - operation of floating casinos, not transporting passengers, see 92.00
broader: Inland passenger water transport
in scheme: Statistical Classification of Economic Activities in the European Community, Rev. 2.1 (NACE Rev. 2.1)
Notation: 50.30
top concept of: Statistical Classification of Economic Activities in the European Community, Rev. 2.1 (NACE Rev. 2.1)

ConceptNoneRandom0.5894820174482913
type: ConceptAssociation
description: NACE Rev. 2.1 class 29.32 is mapped to NACE Rev. 2 classes 23.12, 28.11, 28.25, 29.32
Type: 8:9
Source Concept: Manufacture of other parts and accessories for motor vehicles
Target Concept: http://data.europa.eu/ux2/nace2/2811
Target Concept: http://data.europa.eu/ux2/nace2/2932
Target Concept: http://data.europa.eu/ux2/nace2/2825
Target Concept: http://data.europa.eu/ux2/nace2/2312
in scheme: Statistical Classification of Economic Activities in the European Community, Rev. 2.1 (NACE Rev. 2.1)
scope note: 23.12: - manufacture of rear-view mirrors for vehicles 28.11: - manufacture of pistons, piston rings and carburettors for motor vehicles 28.25: - manufacture of air-conditioning machines for motor vehicles 29.32: - manufacture of diverse parts and accessories for motor vehicles, e.g.: • gear boxes, clutches, brakes, axles, road wheels, shock absorbers - manufacture of parts and accessories of bodies for motor vehicles, e.g.: • bumpers, safety seat belts, safety airbags, rear-view mirrors - manufacture of car seats, including seats for babies and children - manufacture of air-conditioning machines for motor vehicles
top concept of: Statistical Classification of Economic Activities in the European Community, Rev. 2.1 (NACE Rev. 2.1)
Mapping Cardinality: n m

Tanning, dressing, dyeing of leather and fur
type: Concept
CoreContentNote: This class includes: - tanning, dyeing and dressing of hides, skins and pre-tanned leather - manufacture of chamois dressed, parchment dressed, patent or metallised leathers - manufacture of composition leather - scraping, shearing, plucking, currying, tanning, bleaching and dyeing of fur skins and hides with the hair on
Exclusion Note: This class excludes: - production of hides and skins as part of ranching, see 01.4 - production of raw hides and skins as part of slaughtering, see 10.11 - manufacture of leather apparel, see 14.24 - manufacture of imitation leather not based on natural leather, see 22.12, 22.26
broader: Tanning, dyeing, dressing of leather and fur; manufacture of luggage, handbags, saddlery and harness
in scheme: Statistical Classification of Economic Activities in the European Community, Rev. 2.1 (NACE Rev. 2.1)
Notation: 15.11
top concept of: Statistical Classification of Economic Activities in the European Community, Rev. 2.1 (NACE Rev. 2.1)

ConceptNoneRandom0.9786510936184338
type: ConceptAssociation
description: NACE Rev. 2.1 group 31.0 is mapped to NACE Rev. 2 groups 23.4, 31.0
Type: 2:2
Source Concept: Manufacture of furniture
Target Concept: http://data.europa.eu/ux2/nace2/310
Target Concept: http://data.europa.eu/ux2/nace2/234
in scheme: Statistical Classification of Economic Activities in the European Community, Rev. 2.1 (NACE Rev. 2.1)
top concept of: Statistical Classification of Economic Activities in the European Community, Rev. 2.1 (NACE Rev. 2.1)
Mapping Cardinality: n m

ConceptNoneRandom0.13275625734272856
type: ConceptAssociation
description: NACE Rev. 2.1 class 96.10 is mapped to NACE Rev. 2 class 96.01
Type: 4:3
Source Concept: Washing and cleaning of textile and fur products
Target Concept: http://data.europa.eu/ux2/nace2/9601
in scheme: Statistical Classification of Economic Activities in the European Community, Rev. 2.1 (NACE Rev. 2.1)
scope note: the content of the NACE Rev 2.1 class is fully covered in the corresponding NACE Rev 2 class
top concept of: Statistical Classification of Economic Activities in the European Community, Rev. 2.1 (NACE Rev. 2.1)
Mapping Cardinality: n m

Materials recovery
type: Concept
CoreContentNote: This class includes the processing of metal and non-metal waste, including scrap and other articles into secondary raw materials. Further included is the recovery of materials from waste streams in the form of: (1) separating and sorting recoverable materials from non-hazardous waste streams; or (2) separating and sorting of commingled recoverable materials (for example, paper, plastics, used beverage cans and metals) into distinct categories. Examples of the mechanical or chemical transformation processes that are undertaken include: - mechanical crushing and shredding of metal waste (e.g. from used cars, washing machines or motorcycles) - mechanical reduction of large iron pieces (e.g. railway wagons) - recovery of iron from clinker - reclaiming metals out of photographic waste (e.g. fixer solution or photographic films and paper) - dismantling of wrecks of any type (automobiles, ships, computers, televisions and other equipment) for materials recovery - producing of rubber powder from rubber waste and scrap, including decontamination, division (elimination) of fractions and devulcanising - sorting and mechanical processing (e.g. cleaning, grinding) of plastics to produce secondary raw materials - processing (ageing, cleaning, sorting) of incineration bottom ash into secondary raw materials (metals, aggregates) - crushing, cleaning and sorting of glass - crushing, cleaning and sorting of other waste (e.g. demolition waste to obtain secondary raw materials) - processing of food, beverage and tobacco waste and residual substances into secondary raw materials - recovery of waste oil, processing of used cooking oils and fats into secondary raw materials - extraction of silver from waste chemicals, other than by electrolytic refining - recovery of phosphorus from the incineration of sewage sludge - recovery of textile and clothing products by mechanical, thermal or chemical processes - production of waste compost - production of biogas from waste, not for the purpose o…
Exclusion Note: This class excludes: - manufacture of new final products from secondary raw materials, whether or not self-manufactured (e.g. spinning yarn from garnetted stock, making pulp from paper waste, retreading tyres or the production of metal from metal scrap), see corresponding classes in section C - reprocessing of nuclear fuels, see 20.13 - remelting of plastics to produce granulates or compounds, see 20.16 - remelting ferrous waste and scrap, see 24.10 - production of biogas from waste for gas supply, see 35.21 - energy recovery during waste thermal treatment, see 38.22 - disposal of waste without recovery and treatment prior to disposal, see 38.3 - wholesale of recoverable materials, see 46.87
broader: Waste recovery
in scheme: Statistical Classification of Economic Activities in the European Community, Rev. 2.1 (NACE Rev. 2.1)
Notation: 38.21
top concept of: Statistical Classification of Economic Activities in the European Community, Rev. 2.1 (NACE Rev. 2.1)

ConceptNoneRandom0.6466367233041276
type: ConceptAssociation
description: NACE Rev. 2.1 group 66.1 is mapped to NACE Rev. 2 group 66.1
Type: 2:2
Source Concept: Activities auxiliary to financial services, except insurance and pension funding
Target Concept: http://data.europa.eu/ux2/nace2/661
in scheme: Statistical Classification of Economic Activities in the European Community, Rev. 2.1 (NACE Rev. 2.1)
top concept of: Statistical Classification of Economic Activities in the European Community, Rev. 2.1 (NACE Rev. 2.1)
Mapping Cardinality: n m

Motion picture and video distribution activities
type: Concept
CoreContentNote: This class includes: - acquiring copyrights or distribution rights (e.g. for film and audiovisual works) - distributing productions (e.g. film and audiovisual works to motion picture theatres, television networks and stations, and exhibitors)
Exclusion Note: This class excludes: - film duplication and reproduction of audio and video recordings from master copies, see 18.20 - wholesale of recorded media, see 46.49 - retail sale of recorded media, see 47.69 - reproduction of motion picture film for theatrical distribution, see 59.12 - video streaming distribution and download service activities not associated with its publishing, see 60.20 - management of copyrights and distribution rights for films, see 74.91 - rental of recorded media, see 77.22
broader: Motion picture, video and television programme activities
in scheme: Statistical Classification of Economic Activities in the European Community, Rev. 2.1 (NACE Rev. 2.1)
Notation: 59.13
top concept of: Statistical Classification of Economic Activities in the European Community, Rev. 2.1 (NACE Rev. 2.1)

ConceptNoneRandom0.2845879044230324
type: ConceptAssociation
description: NACE Rev. 2.1 class 95.25 is mapped to NACE Rev. 2 class 95.25
Type: 1:1
Source Concept: Repair and maintenance of watches, clocks and jewellery
Target Concept: http://data.europa.eu/ux2/nace2/9525
in scheme: Statistical Classification of Economic Activities in the European Community, Rev. 2.1 (NACE Rev. 2.1)
scope note: the content of the NACE Rev 2.1 class is fully covered in the corresponding NACE Rev 2 class
top concept of: Statistical Classification of Economic Activities in the European Community, Rev. 2.1 (NACE Rev. 2.1)
Mapping Cardinality: 1 1

ConceptNoneRandom0.3606877451044357
type: ConceptAssociation
description: NACE Rev. 2.1 class 30.31 is mapped to NACE Rev. 2 class 30.30
Type: 2:1
Source Concept: Manufacture of civilian air and spacecraft and related machinery
Target Concept: http://data.europa.eu/ux2/nace2/3030
in scheme: Statistical Classification of Economic Activities in the European Community, Rev. 2.1 (NACE Rev. 2.1)
scope note: the content of the NACE Rev 2.1 class is fully covered in the corresponding NACE Rev 2 class
top concept of: Statistical Classification of Economic Activities in the European Community, Rev. 2.1 (NACE Rev. 2.1)
Mapping Cardinality: n 1

ConceptNoneRandom0.6022974810248392
type: ConceptAssociation
description: NACE Rev. 2.1 division 64 is mapped to NACE Rev. 2 division 64
Type: 1:1
Source Concept: Financial service activities, except insurance and pension funding
Target Concept: http://data.europa.eu/ux2/nace2/64
in scheme: Statistical Classification of Economic Activities in the European Community, Rev. 2.1 (NACE Rev. 2.1)
top concept of: Statistical Classification of Economic Activities in the European Community, Rev. 2.1 (NACE Rev. 2.1)
Mapping Cardinality: 1 1

Sports activities
type: Concept
CoreContentNote: This group includes the operation of sports facilities; activities of sports teams or clubs primarily participating in live sporting events; independent athletes engaged in participating in live sports or racing events; activities related to training animals for sports or entertainment; sports trainers providing specialised services to support participants in sporting events or competitions; operators of arenas and stadiums; other activities of organising, promoting or managing sporting events n.e.c.
Exclusion Note: This group excludes: - sports and recreation education activities, see 85.51
broader: Sports activities and amusement and recreation activities
in scheme: Statistical Classification of Economic Activities in the European Community, Rev. 2.1 (NACE Rev. 2.1)
Notation: 93.1
top concept of: Statistical Classification of Economic Activities in the European Community, Rev. 2.1 (NACE Rev. 2.1)

Radio broadcasting and audio distribution activities
type: Concept
Additional Content Note: This class also includes: - activities of radio networks, i.e. assembling and transmitting aural programming to the affiliates or subscribers via over-the-air broadcasts, cable or satellite - radio broadcasting activities over the internet (internet radio stations) - radio programme broadcasting and concurrent filming for video broadcast
CoreContentNote: This class includes: - broadcasting audio signals through radio broadcasting studios and facilities for the transmission of aural programming to the public, to affiliates or to subscribers - on-demand audio streaming and download services by third-party distributors with distribution rights - broadcasting live podcasts
Exclusion Note: This class excludes: - wholesale of audio recordings on physical media, see 46.49 - retail sale of audio recordings on physical media, see 47.69 - publishing of audiobooks, associated with streaming and download services of book publishers, see 58.11 - publishing of music and other sound recordings, associated with streaming and download services of music and other sound recording publishers, see 59.20 - production of radio programming and audio podcasts, see 59.20 - provision of technical infrastructure services related to audio streaming services without having acquired the rights to the audio content, see 63.10
broader: Radio broadcasting and audio distribution activities
in scheme: Statistical Classification of Economic Activities in the European Community, Rev. 2.1 (NACE Rev. 2.1)
Notation: 60.10
top concept of: Statistical Classification of Economic Activities in the European Community, Rev. 2.1 (NACE Rev. 2.1)

Extraction of crude petroleum and natural gas
type: Concept
CoreContentNote: This division includes the production of crude petroleum, the mining and extraction of oil from oil shale and oil sands, and the production of natural gas and recovery of hydrocarbon liquids. This division also includes the activities of operating and/or developing oilfields and gas fields. Such activities may include drilling, completing and equipping wells; operating separators, emulsion breakers, desalting equipment and field-gathering lines for crude petroleum; all other activities in the preparation of oil and gas up to the point of shipment from the producing property.
Exclusion Note: This division excludes: - support activities for oilfields and gas fields, performed on a fee or contract basis, see 09.10 - exploration of oil and gas wells, see 09.10 - test drilling and boring in connection with petroleum or gas extraction, see 09.10 - refining of petroleum products, see 19.20 - geophysical, geologic and seismic surveying, see 71.12
broader: MINING AND QUARRYING
in scheme: Statistical Classification of Economic Activities in the European Community, Rev. 2.1 (NACE Rev. 2.1)
Notation: 06
top concept of: Statistical Classification of Economic Activities in the European Community, Rev. 2.1 (NACE Rev. 2.1)

ConceptNoneRandom0.6868072260168747
type: ConceptAssociation
description: NACE Rev. 2.1 class 84.13 is mapped to NACE Rev. 2 class 84.13
Type: 1:1
Source Concept: Regulation of and contribution to more efficient operation of businesses
Target Concept: http://data.europa.eu/ux2/nace2/8413
in scheme: Statistical Classification of Economic Activities in the European Community, Rev. 2.1 (NACE Rev. 2.1)
scope note: the content of the NACE Rev 2.1 class is fully covered in the corresponding NACE Rev 2 class
top concept of: Statistical Classification of Economic Activities in the European Community, Rev. 2.1 (NACE Rev. 2.1)
Mapping Cardinality: 1 1

On-demand passenger transport service activities by vehicle with driver
type: Concept
CoreContentNote: This class includes the on-demand transport of passengers in vehicles with a driver, for a maximum of 9 persons: - taxi services - private hire vehicles with a driver - motorcycle taxi services
Exclusion Note: This class excludes: - bicycle taxi services, see 49.39 - passenger road transport by vehicles drawn by humans or animals, see 49.39 - intermediation service activities for passenger transport, see 52.32 - patient transport by ambulance, see 86.92
broader: Other passenger land transport
in scheme: Statistical Classification of Economic Activities in the European Community, Rev. 2.1 (NACE Rev. 2.1)
Notation: 49.33
top concept of: Statistical Classification of Economic Activities in the European Community, Rev. 2.1 (NACE Rev. 2.1)

Other personal service activities n.e.c.
type: Concept
CoreContentNote: These activities are predominantly provided to individuals. This class includes: - astrological and spiritualists’ activities - social activities (e.g. escort services, dating services, services of a marriage bureau) - provision or arrangement of sexual services, organisation of prostitution events or operation of prostitution establishments - pet care services (e.g. boarding, grooming or training pets) - operation of shelters for abandoned pets - genealogical activities - activities of tattooing and piercing studios - activities of shoe-shiners, porters, car parkers, etc. - concession operation of coin-operated personal services machines (e.g. photo booths, weighing machines or lockers) - operation of photo automats for printing photographs from electronic records (e.g. from telephone, memory cards, flash drives) - dating and other speed networking activities - tattoo artist activities, using biological substances (e.g. henna) for temporary decoration - horse whispering activities - housesitting activities - wedding planners’ activities
Exclusion Note: This class excludes: - veterinary activities, see 75.00 - home cleaning activities, see 81.21 - yoga or Pilates instruction, see 85.51 - provision of alternative therapeutic services (e.g. homeopathy, chiropractic treatments, osteopathy, crystal therapy, iridology, kinesiology and radionics), see 86.96 - activities of practitioners in the field of shiatsu, Thai massage, Watsu, tui na, qigong, see 86.99 - homecare services for older persons, including live-in care services, see 88.10 - day-care activities for children provided in private homes or day-care centres, see 88.91 - after-school care services, see 88.91 - operation of coin-operated gambling machines, see 92.00 - operation of coin-operated washing machines, see 96.10
broader: Other personal service activities
in scheme: Statistical Classification of Economic Activities in the European Community, Rev. 2.1 (NACE Rev. 2.1)
Notation: 96.99
top concept of: Statistical Classification of Economic Activities in the European Community, Rev. 2.1 (NACE Rev. 2.1)

ConceptNoneRandom0.7517766160479946
type: ConceptAssociation
description: NACE Rev. 2.1 class 10.72 is mapped to NACE Rev. 2 classes 10.72, 10.86
Type: 6:6
Source Concept: Manufacture of rusks, biscuits, preserved pastries and cakes
Target Concept: http://data.europa.eu/ux2/nace2/1086
Target Concept: http://data.europa.eu/ux2/nace2/1072
in scheme: Statistical Classification of Economic Activities in the European Community, Rev. 2.1 (NACE Rev. 2.1)
scope note: 10.72: - manufacture of rusks, biscuits and other dry bakery products - manufacture of preserved pastry goods, cakes and waffles - manufacture of snack products (cookies, crackers, pretzels etc.), whether sweet or salted - manufacture of breadcrumbs, obtained by grinding toasted bread 10.86: - manufacture of gluten-free products
top concept of: Statistical Classification of Economic Activities in the European Community, Rev. 2.1 (NACE Rev. 2.1)
Mapping Cardinality: n m

ConceptNoneRandom0.008429788532867799
type: ConceptAssociation
description: NACE Rev. 2.1 group 27.4 is mapped to NACE Rev. 2 group 27.4
Type: 1:1
Source Concept: Manufacture of lighting equipment
Target Concept: http://data.europa.eu/ux2/nace2/274
in scheme: Statistical Classification of Economic Activities in the European Community, Rev. 2.1 (NACE Rev. 2.1)
top concept of: Statistical Classification of Economic Activities in the European Community, Rev. 2.1 (NACE Rev. 2.1)
Mapping Cardinality: 1 1

Manufacture of industrial gases
type: Concept
Additional Content Note: This class also includes: - production of hydrogen, not for energy supply through a network
CoreContentNote: This class includes: - manufacture of liquefied or compressed selected inorganic industrial or medical gases: • elemental gases • liquid or compressed air • mixed industrial gases • inert gases (e.g. carbon dioxide) • isolating gases
Exclusion Note: This class excludes: - extraction of methane, ethane, butane or propane, see 06.20 - liquefaction and regasification of natural gas for the purpose of transport, done at the mine site, see 09.10 - manufacture of fuel gases (e.g. ethane, butane or propane in a petroleum refinery), see 19.20 - manufacture of refrigerant gases of halogenated hydrocarbons, see 20.14 - manufacture of gaseous fuels from coal, waste, etc., see 35.21 - manufacture of hydrogen for the provision as a gaseous fuel through a permanent supply network, see 35.21
broader: Manufacture of basic chemicals, fertilisers and nitrogen compounds, plastics and synthetic rubber in primary forms
in scheme: Statistical Classification of Economic Activities in the European Community, Rev. 2.1 (NACE Rev. 2.1)
Notation: 20.11
top concept of: Statistical Classification of Economic Activities in the European Community, Rev. 2.1 (NACE Rev. 2.1)

Installation of insulation
type: Concept
CoreContentNote: This class includes: - thermal insulation works (e.g. for pipes, boilers and ducts, interior or exterior, including cladding for insulation) - sound insulation works - vibration insulation works - fireproofing works - hydro insulation - internal insulation of roofs
Exclusion Note: This class excludes: - external insulation of roofs, see 43.41 - waterproofing of roofs, see 43.41
broader: Electrical, plumbing and other construction installation activities
in scheme: Statistical Classification of Economic Activities in the European Community, Rev. 2.1 (NACE Rev. 2.1)
Notation: 43.23
top concept of: Statistical Classification of Economic Activities in the European Community, Rev. 2.1 (NACE Rev. 2.1)

Manufacture of plaster products for construction purposes
type: Concept
CoreContentNote: This class includes: - manufacture of articles of plaster or compositions based on plaster for use in construction: • boards, sheets, panels, tiles and similar articles, not ornamented
broader: Manufacture of articles of concrete, cement and plaster
in scheme: Statistical Classification of Economic Activities in the European Community, Rev. 2.1 (NACE Rev. 2.1)
Notation: 23.62
top concept of: Statistical Classification of Economic Activities in the European Community, Rev. 2.1 (NACE Rev. 2.1)

Manufacture of other chemical products n.e.c.
type: Concept
Additional Content Note: This class also includes: - manufacture of writing and drawing ink - manufacture of matches
CoreContentNote: This class includes: - manufacture of photographic plates, films, sensitised paper and other sensitised unexposed materials - manufacture of chemical preparations for photographic uses - manufacture of gelatine and its derivatives - manufacture of glues and prepared adhesives, including rubber-based glues and adhesives - manufacture of essential oils - manufacture of extracts of natural aromatic products - manufacture of resinoids - manufacture of mixtures of odoriferous products for the manufacture of perfumes or food - manufacture of propellant powders - manufacture of explosives and pyrotechnic products, including percussion caps, detonators, signalling flares, etc. - manufacture of e-liquids used in vaping devices - manufacture of various chemical products: • peptones, peptone derivatives, other protein substances and their derivatives n.e.c. • chemically modified oils and fats • materials used in the finishing of textiles and leather • powders and pastes used in soldering, brazing or welding • substances used to pickle metal • prepared additives for cements • activated carbon, lubricating oil additives, prepared rubber accelerators, catalysts and other chemical products for industrial use • anti-knock preparations, antifreeze preparations • liquids for hydraulic transmission • composite diagnostic or laboratory reagents • fuel additives (e.g. based on ethyl tertiary-butyl ether (ETBE) and methyl tertiary-butyl ether (MTBE))
Exclusion Note: This class excludes: - manufacture of synthetic aromatic products, see 20.14 - manufacture of printing ink, see 20.30 - manufacture of perfume and toilet preparations, see 20.42 - manufacture of liquid biofuels, see 20.51
broader: Manufacture of other chemical products
in scheme: Statistical Classification of Economic Activities in the European Community, Rev. 2.1 (NACE Rev. 2.1)
Notation: 20.59
top concept of: Statistical Classification of Economic Activities in the European Community, Rev. 2.1 (NACE Rev. 2.1)

Compulsory social security activities
type: Concept
broader: Public administration and defence; compulsory social security
in scheme: Statistical Classification of Economic Activities in the European Community, Rev. 2.1 (NACE Rev. 2.1)
Notation: 84.3
top concept of: Statistical Classification of Economic Activities in the European Community, Rev. 2.1 (NACE Rev. 2.1)

ConceptNoneRandom0.09086782324727094
type: ConceptAssociation
description: NACE Rev. 2.1 division 28 is mapped to NACE Rev. 2 divisions 25, 28
Type: 48:49
Source Concept: Manufacture of machinery and equipment n.e.c.
Target Concept: http://data.europa.eu/ux2/nace2/28
Target Concept: http://data.europa.eu/ux2/nace2/25
in scheme: Statistical Classification of Economic Activities in the European Community, Rev. 2.1 (NACE Rev. 2.1)
top concept of: Statistical Classification of Economic Activities in the European Community, Rev. 2.1 (NACE Rev. 2.1)
Mapping Cardinality: n m

ConceptNoneRandom0.6338731122167489
type: ConceptAssociation
description: NACE Rev. 2.1 class 88.10 is mapped to NACE Rev. 2 class 88.10
Type: 1:1
Source Concept: Social work activities without accommodation for older persons or persons with disabilities
Target Concept: http://data.europa.eu/ux2/nace2/8810
in scheme: Statistical Classification of Economic Activities in the European Community, Rev. 2.1 (NACE Rev. 2.1)
scope note: the content of the NACE Rev 2.1 class is fully covered in the corresponding NACE Rev 2 class
top concept of: Statistical Classification of Economic Activities in the European Community, Rev. 2.1 (NACE Rev. 2.1)
Mapping Cardinality: 1 1

Other telecommunication activities
type: Concept
Additional Content Note: This class also includes: - provision of notification services (e.g. SMS bank alerts, advertising)
CoreContentNote: This class includes: - provision of specialised telecommunication applications (e.g. satellite tracking, communication telemetry, radar station operations) - operation of satellite terminal stations and associated facilities operationally connected with one or more terrestrial communication systems and capable of transmitting telecommunications to or receiving telecommunications from satellite systems - provision of internet access over networks between the client and the internet service provider not owned or controlled by the internet service provider (e.g. dial-up internet access) - transmission via the internet of text messaging (SMS) - voice over internet protocol (VoIP), text messaging (SMS), advanced data services (SMS+, MMS+) and provision of SMS push services, without operating facilities for the transmission of data
Exclusion Note: This class excludes: - provision of internet access by operators of telecommunication infrastructure, see 61.10 - reselling of telecommunication services and intermediation services for telecommunication, see 61.20
broader: Other telecommunication activities
in scheme: Statistical Classification of Economic Activities in the European Community, Rev. 2.1 (NACE Rev. 2.1)
Notation: 61.90
top concept of: Statistical Classification of Economic Activities in the European Community, Rev. 2.1 (NACE Rev. 2.1)

ConceptNoneRandom0.027675792492918627
type: ConceptAssociation
description: NACE Rev. 2.1 group 14.1 is mapped to NACE Rev. 2 groups 14.1, 14.3
Type: 2:3
Source Concept: Manufacture of knitted and crocheted apparel
Target Concept: http://data.europa.eu/ux2/nace2/141
Target Concept: http://data.europa.eu/ux2/nace2/143
in scheme: Statistical Classification of Economic Activities in the European Community, Rev. 2.1 (NACE Rev. 2.1)
top concept of: Statistical Classification of Economic Activities in the European Community, Rev. 2.1 (NACE Rev. 2.1)
Mapping Cardinality: n m

ConceptNoneRandom0.8814745163933604
type: ConceptAssociation
description: NACE Rev. 2.1 group 49.2 is mapped to NACE Rev. 2 group 49.2
Type: 1:1
Source Concept: Freight rail transport
Target Concept: http://data.europa.eu/ux2/nace2/492
in scheme: Statistical Classification of Economic Activities in the European Community, Rev. 2.1 (NACE Rev. 2.1)
top concept of: Statistical Classification of Economic Activities in the European Community, Rev. 2.1 (NACE Rev. 2.1)
Mapping Cardinality: 1 1

Architectural and engineering activities and related technical consultancy
type: Concept
CoreContentNote: This group includes the provision of architectural services, engineering services, drafting services, building inspection services, surveying and mapping services, and so on.
broader: Architectural and engineering activities; technical testing and analysis
in scheme: Statistical Classification of Economic Activities in the European Community, Rev. 2.1 (NACE Rev. 2.1)
Notation: 71.1
top concept of: Statistical Classification of Economic Activities in the European Community, Rev. 2.1 (NACE Rev. 2.1)

ConceptNoneRandom0.6296576680610375
type: ConceptAssociation
description: NACE Rev. 2.1 group 27.5 is mapped to NACE Rev. 2 group 27.5
Type: 1:1
Source Concept: Manufacture of domestic appliances
Target Concept: http://data.europa.eu/ux2/nace2/275
in scheme: Statistical Classification of Economic Activities in the European Community, Rev. 2.1 (NACE Rev. 2.1)
top concept of: Statistical Classification of Economic Activities in the European Community, Rev. 2.1 (NACE Rev. 2.1)
Mapping Cardinality: 1 1

NACE - Level 3 - Groups
type: Collection
type: ClassificationLevel
comment: Level 3: 287 groups identified by three-digit numerical codes (01.1 to 99.0)
Depth: 3
Notation Pattern: [0-9]{2}\.[0-9]{1}
Organized By: generic group
in scheme: Statistical Classification of Economic Activities in the European Community, Rev. 2.1 (NACE Rev. 2.1)
Member: Research and experimental development on social sciences and humanities
Member: Radio broadcasting and audio distribution activities
Member: Inland freight water transport
Member: Other financial service activities, except insurance and pension funding
Member: Real estate activities with own property and development of building projects
Member: Manufacture of rubber products
Member: Wholesale of food, beverages and tobacco
Member: Other residential care activities
Member: Activities of brokers and agents for electric power and natural gas
Member: Retail sale of other household equipment
Member: Mixed farming
Member: Other education
Member: Manufacture of clay building materials
Member: Compulsory social security activities
Member: Intermediation service activities for personal services
Member: Repair and maintenance of personal and household goods
Member: Casting of metals
Member: Manufacture of refined petroleum products and fossil fuel products
Member: Mining of iron ores
Member: Architectural and engineering activities and related technical consultancy
Member: Television programming, broadcasting and video distribution activities
Member: Travel agency and tour operator activities
Member: Rental and operating of own or leased real estate
Member: Repair and maintenance of fabricated metal products, machinery and equipment
Member: Restaurants and mobile food service activities
Member: Retail sale of cultural and recreational goods
Member: Support activities to agriculture and post-harvest crop activities
Member: Educational support activities
Member: Wholesale of household goods
Member: Repair and maintenance of motor vehicles and motorcycles
Member: Processing and preserving of meat and production of meat products
Member: Manufacture of plastic products
Member: Manufacture of other porcelain and ceramic products
Member: Activities of business, employers and professional membership organisations
Member: Printing and service activities related to printing
Member: Mining of non-ferrous metal ores
Member: Hairdressing, beauty treatment, day spa and similar activities
Member: Sea and coastal freight water transport
Member: Wired, wireless, and satellite telecommunication activities
Member: Market research and public opinion polling
Member: Administration of the State and the economic, social and environmental policies of the community
Member: Construction of other civil engineering projects
Member: Manufacture of glass and glass products
Member: Manufacture of beverages
Member: Legal activities
Member: Wholesale on a fee or contract basis
Member: Manufacture of other products of first processing of steel
Member: Software publishing
Member: Manufacture of gas, and distribution of gaseous fuels through mains
Member: Retail sale of automotive fuel
Member: Manufacture of other electrical equipment
Member: Other social work activities without accommodation
Member: Treatment and coating of metals; machining
Member: Plant propagation
Member: Secondary and post-secondary non-tertiary education
Member: Manufacture of optical instruments, magnetic and optical media and photographic equipment
Member: Quarrying of stone, sand and clay
Member: Research and experimental development on natural sciences and engineering
Member: Repair and maintenance of computers and communication equipment
Member: Public relations and communication activities
Member: Telecommunication reselling activities and intermediation service activities for telecommunication
Member: Inland passenger water transport
Member: Manufacture of transport equipment n.e.c.
Member: Accounting, bookkeeping and auditing activities; tax consultancy
Member: Manufacture of refractory products
Member: Retail sale of information and communication equipment
Member: Steam and air conditioning supply
Member: Wholesale of agricultural raw materials and live animals
Member: Manufacture of basic precious and other non-ferrous metals
Member: Animal production
Member: Tertiary education
Member: Manufacture of cutlery, tools and general hardware

ConceptNoneRandom0.09279688651714446
type: ConceptAssociation
description: NACE Rev. 2.1 group 14.2 is mapped to NACE Rev. 2 groups 14.1, 14.2
Type: 2:3
Source Concept: Manufacture of other wearing apparel and accessories
Target Concept: http://data.europa.eu/ux2/nace2/142
Target Concept: http://data.europa.eu/ux2/nace2/141
in scheme: Statistical Classification of Economic Activities in the European Community, Rev. 2.1 (NACE Rev. 2.1)
top concept of: Statistical Classification of Economic Activities in the European Community, Rev. 2.1 (NACE Rev. 2.1)
Mapping Cardinality: n m

AGRICULTURE, FORESTRY AND FISHING
type: Concept
Additional Content Note: This section also includes organic agriculture, aquaculture, the growing of genetically modified crops and the raising of genetically modified animals.
CoreContentNote: This section includes the exploitation of vegetal and animal natural resources, comprising the activities of growing of crops, raising and breeding of animals, harvesting of timber and other plants, and the production of animal products from a farm or natural habitats.
Exclusion Note: This section excludes undifferentiated subsistence goods-producing activities of households, which are classified in class 98.10.
in scheme: Statistical Classification of Economic Activities in the European Community, Rev. 2.1 (NACE Rev. 2.1)
Notation: A
top concept of: Statistical Classification of Economic Activities in the European Community, Rev. 2.1 (NACE Rev. 2.1)

Manufacture of concrete products for construction purposes
type: Concept
Additional Content Note: This class also includes: - manufacture of calcium silicate masonry units - manufacture of autoclaved aerated concrete masonry units
CoreContentNote: This class includes: - manufacture of precast concrete, cement or artificial stone articles for use in construction: • tiles, flagstones, building blocks, bricks, boards, sheets, panels, pipes, posts, etc. - manufacture of prefabricated structures and structural components for building or civil engineering, traffic control and obstruction, of cement, concrete or artificial stone - manufacture of prefabricated factory-made elements of brick for construction of prefabricated structures to be used in landscaping and retaining wall, wastewater and stormwater management, and underground utilities - manufacture of factory-made elements with concrete - manufacture of prefabricated concrete pipes for drinking water
Exclusion Note: This class excludes: - manufacture of other articles of concrete, cement and plaster not for use in construction, see 23.66
broader: Manufacture of articles of concrete, cement and plaster
in scheme: Statistical Classification of Economic Activities in the European Community, Rev. 2.1 (NACE Rev. 2.1)
Notation: 23.61
top concept of: Statistical Classification of Economic Activities in the European Community, Rev. 2.1 (NACE Rev. 2.1)

Other construction installation
type: Concept
Additional Content Note: This class also includes: - installation of equipment for the personal safety of builders (e.g. to secure lifelines)
CoreContentNote: This class includes the installation, repair and maintenance of equipment other than electrical, plumbing, heating and air-conditioning systems or industrial machinery in buildings and civil engineering structures. This class includes: - installation in buildings or other construction projects of: • elevators, escalators, including stairlifts • automated and revolving doors • lightning conductors • vacuum cleaning systems • blinds and awnings - installation of fences, railings and fire escape staircases - installation of signs, whether illuminated or not - installation and replacement of locks - installation of automatic systems on buildings (e.g. for opening windows and doors)
Exclusion Note: This class excludes: - installation of industrial machinery, see 33.20
broader: Electrical, plumbing and other construction installation activities
in scheme: Statistical Classification of Economic Activities in the European Community, Rev. 2.1 (NACE Rev. 2.1)
Notation: 43.24
top concept of: Statistical Classification of Economic Activities in the European Community, Rev. 2.1 (NACE Rev. 2.1)

ConceptNoneRandom0.28473509810998654
type: ConceptAssociation
description: NACE Rev. 2.1 division 27 is mapped to NACE Rev. 2 divisions 27, 28
Type: 48:49
Source Concept: Manufacture of electrical equipment
Target Concept: http://data.europa.eu/ux2/nace2/28
Target Concept: http://data.europa.eu/ux2/nace2/27
in scheme: Statistical Classification of Economic Activities in the European Community, Rev. 2.1 (NACE Rev. 2.1)
top concept of: Statistical Classification of Economic Activities in the European Community, Rev. 2.1 (NACE Rev. 2.1)
Mapping Cardinality: n m

Printing and service activities related to printing
type: Concept
CoreContentNote: This group includes the printing of products (for example, newspapers, books, periodicals, business forms and greeting cards), printing on T-shirts and other types of material, and associated support activities (for example, bookbinding, plate-making services, data imaging). Printing can be done using various techniques and on different materials.
broader: Printing and reproduction of recorded media
in scheme: Statistical Classification of Economic Activities in the European Community, Rev. 2.1 (NACE Rev. 2.1)
Notation: 18.1
top concept of: Statistical Classification of Economic Activities in the European Community, Rev. 2.1 (NACE Rev. 2.1)

ConceptNoneRandom0.2938623226388959
type: ConceptAssociation
description: NACE Rev. 2.1 class 46.71 is mapped to NACE Rev. 2 classes 45.11, 45.19
Type: 78:65
Source Concept: Wholesale of motor vehicles
Target Concept: http://data.europa.eu/ux2/nace2/4519
Target Concept: http://data.europa.eu/ux2/nace2/4511
in scheme: Statistical Classification of Economic Activities in the European Community, Rev. 2.1 (NACE Rev. 2.1)
scope note: 45.11: - wholesale of new and used motor vehicles, including electrical vehicles: • passenger motor vehicles, including specialised passenger motor vehicles, e.g. ambulances, minibuses - wholesale of off-road motor vehicles 45.19: - wholesale of new and used motor vehicles, including electrical vehicles: • lorries, trailers and semi-trailers • camping vehicles, e.g. caravans, motorhomes - wholesale of off-road motor vehicles
top concept of: Statistical Classification of Economic Activities in the European Community, Rev. 2.1 (NACE Rev. 2.1)
Mapping Cardinality: n m

ConceptNoneRandom0.6307659758838264
type: ConceptAssociation
description: NACE Rev. 2.1 class 07.10 is mapped to NACE Rev. 2 class 07.10
Type: 1:1
Source Concept: Mining of iron ores
Target Concept: http://data.europa.eu/ux2/nace2/0710
in scheme: Statistical Classification of Economic Activities in the European Community, Rev. 2.1 (NACE Rev. 2.1)
scope note: the content of the NACE Rev 2.1 class is fully covered in the corresponding NACE Rev 2 class
top concept of: Statistical Classification of Economic Activities in the European Community, Rev. 2.1 (NACE Rev. 2.1)
Mapping Cardinality: 1 1

Processing and preserving of potatoes
type: Concept
CoreContentNote: This class includes: - processing and preserving of potatoes: • manufacture of prepared frozen potatoes • manufacture of dehydrated mashed potatoes • manufacture of potato snacks • manufacture of potato crisps • manufacture of potato flour and meal • peeling and cutting of potatoes
broader: Processing and preserving of fruit and vegetables
in scheme: Statistical Classification of Economic Activities in the European Community, Rev. 2.1 (NACE Rev. 2.1)
Notation: 10.31
top concept of: Statistical Classification of Economic Activities in the European Community, Rev. 2.1 (NACE Rev. 2.1)

ConceptNoneRandom0.14549739518116178
type: ConceptAssociation
description: NACE Rev. 2.1 group 49.3 is mapped to NACE Rev. 2 group 49.3
Type: 42:34
Source Concept: Other passenger land transport
Target Concept: http://data.europa.eu/ux2/nace2/493
in scheme: Statistical Classification of Economic Activities in the European Community, Rev. 2.1 (NACE Rev. 2.1)
top concept of: Statistical Classification of Economic Activities in the European Community, Rev. 2.1 (NACE Rev. 2.1)
Mapping Cardinality: n m

ConceptNoneRandom0.2561953265641953
type: ConceptAssociation
description: NACE Rev. 2.1 group 36.0 is mapped to NACE Rev. 2 group 36.0
Type: 1:1
Source Concept: Water collection, treatment and supply
Target Concept: http://data.europa.eu/ux2/nace2/360
in scheme: Statistical Classification of Economic Activities in the European Community, Rev. 2.1 (NACE Rev. 2.1)
top concept of: Statistical Classification of Economic Activities in the European Community, Rev. 2.1 (NACE Rev. 2.1)
Mapping Cardinality: 1 1

ConceptNoneRandom0.3678756937243076
type: ConceptAssociation
description: NACE Rev. 2.1 class 66.30 is mapped to NACE Rev. 2 classes 66.19, 66.30
Type: 2:2
Source Concept: Fund management activities
Target Concept: http://data.europa.eu/ux2/nace2/6619
Target Concept: http://data.europa.eu/ux2/nace2/6630
in scheme: Statistical Classification of Economic Activities in the European Community, Rev. 2.1 (NACE Rev. 2.1)
scope note: 66.19: - trustee, fiduciary and custody services on a fee or contract basis 66.30: - management of mutual funds - management of other investment funds - management of pension funds - activities of asset management, on a fee or contract basis - trustee, fiduciary and custody services on a fee or contract basis
top concept of: Statistical Classification of Economic Activities in the European Community, Rev. 2.1 (NACE Rev. 2.1)
Mapping Cardinality: n m

Administration of the State and the economic, social and environmental policies of the community
type: Concept
CoreContentNote: This group includes general administration (for example, executive, legislative and financial administration, at all levels of government) and supervision in the field of social, economic and environmental policy of the community.
broader: Public administration and defence; compulsory social security
in scheme: Statistical Classification of Economic Activities in the European Community, Rev. 2.1 (NACE Rev. 2.1)
Notation: 84.1
top concept of: Statistical Classification of Economic Activities in the European Community, Rev. 2.1 (NACE Rev. 2.1)

MINING AND QUARRYING
type: Concept
CoreContentNote: Mining and quarrying include the extraction of minerals occurring naturally as solids (coal and ores), liquids (petroleum) or gases (natural gas). Extraction can be achieved by different methods (for example, underground or surface mining, well operation, seabed mining). This section includes supplementary activities aimed at preparing the crude materials for marketing (for example, crushing, grinding, cleaning, drying, sorting, concentrating ores and liquefaction of natural gas). Mining activities are classified into divisions, groups and classes on the basis of the principal mineral produced. Divisions 05 and 06 are concerned with mining and quarrying of fossil fuels (coal, lignite, petroleum, gas); divisions 07 and 08 concern metal ores, various minerals and quarry products. Some of the technical operations of this section, particularly related to the extraction of hydrocarbons, may also be carried out for third parties by specialised units as an industrial service activity which is reflected in division 09.
Exclusion Note: This section excludes: - further processing of the extracted materials, see section C - use of the extracted materials without further transformation for construction purposes, see section F - bottling of natural spring and mineral waters at springs and wells, see 11.07 - remediation of mine sites, see 39.00
in scheme: Statistical Classification of Economic Activities in the European Community, Rev. 2.1 (NACE Rev. 2.1)
Notation: B
top concept of: Statistical Classification of Economic Activities in the European Community, Rev. 2.1 (NACE Rev. 2.1)

Other social work activities without accommodation
type: Concept
broader: Social work activities without accommodation
in scheme: Statistical Classification of Economic Activities in the European Community, Rev. 2.1 (NACE Rev. 2.1)
Notation: 88.9
top concept of: Statistical Classification of Economic Activities in the European Community, Rev. 2.1 (NACE Rev. 2.1)

Retail sale of books
type: Concept
CoreContentNote: This class includes: - retail sale of books, including audiobooks on physical media
Exclusion Note: This class excludes: - retail sale of recorded media except audiobooks on physical media, see 47.69 - retail sale of antique books, see 47.79 - retail sale of second-hand books, see 47.79 - distributing e-books and audiobooks via streaming and downloading by book publishers, see 58.11
broader: Retail sale of cultural and recreational goods
in scheme: Statistical Classification of Economic Activities in the European Community, Rev. 2.1 (NACE Rev. 2.1)
Notation: 47.61
top concept of: Statistical Classification of Economic Activities in the European Community, Rev. 2.1 (NACE Rev. 2.1)

ConceptNoneRandom0.6866973664559675
type: ConceptAssociation
description: NACE Rev. 2.1 class 91.30 is mapped to NACE Rev. 2 classes 33.19, 41.20, 90.03
Type: 23:16
Source Concept: Conservation, restoration and other support activities for cultural heritage
Target Concept: http://data.europa.eu/ux2/nace2/4120
Target Concept: http://data.europa.eu/ux2/nace2/9003
Target Concept: http://data.europa.eu/ux2/nace2/3319
in scheme: Statistical Classification of Economic Activities in the European Community, Rev. 2.1 (NACE Rev. 2.1)
scope note: 33.19: - restoring of organs and other historic musical instruments 41.20: - restoration of historical buildings 90.03: - conservation and restoration of works of art and museum collection objects
top concept of: Statistical Classification of Economic Activities in the European Community, Rev. 2.1 (NACE Rev. 2.1)
Mapping Cardinality: n m

Investigation and security activities
type: Concept
Additional Content Note: This division also includes: - security services related to the prevention and safety of people at public events and premises open to the public - security services providing armoured car services
CoreContentNote: This division includes security-related services: - investigation services in private, commercial, corporate, insurance and criminal law for the exercise of rights in court - guard and patrol services - picking up and delivering money, receipts or other valuable items, with personnel and equipment to protect such properties while in transit - security system services and the operation of electronic security alarm systems (e.g. burglar and fire alarms), as well as remote monitoring and video surveillance systems services, where the activity focuses on remote monitoring these systems, but often also involves sale, installation and repair services
Exclusion Note: This division excludes: - information technology security activities, see division 62
broader: ADMINISTRATIVE AND SUPPORT SERVICE ACTIVITIES
in scheme: Statistical Classification of Economic Activities in the European Community, Rev. 2.1 (NACE Rev. 2.1)
Notation: 80
top concept of: Statistical Classification of Economic Activities in the European Community, Rev. 2.1 (NACE Rev. 2.1)

ConceptNoneRandom0.5715586646177578
type: ConceptAssociation
description: NACE Rev. 2.1 group 27.2 is mapped to NACE Rev. 2 group 27.2
Type: 1:1
Source Concept: Manufacture of batteries and accumulators
Target Concept: http://data.europa.eu/ux2/nace2/272
in scheme: Statistical Classification of Economic Activities in the European Community, Rev. 2.1 (NACE Rev. 2.1)
top concept of: Statistical Classification of Economic Activities in the European Community, Rev. 2.1 (NACE Rev. 2.1)
Mapping Cardinality: 1 1

ConceptNoneRandom0.3458633795340208
type: ConceptAssociation
description: NACE Rev. 2.1 class 64.11 is mapped to NACE Rev. 2 class 64.11
Type: 1:1
Source Concept: Central banking
Target Concept: http://data.europa.eu/ux2/nace2/6411
in scheme: Statistical Classification of Economic Activities in the European Community, Rev. 2.1 (NACE Rev. 2.1)
scope note: the content of the NACE Rev 2.1 class is fully covered in the corresponding NACE Rev 2 class
top concept of: Statistical Classification of Economic Activities in the European Community, Rev. 2.1 (NACE Rev. 2.1)
Mapping Cardinality: 1 1

Conservation, restoration and other support activities for cultural heritage
type: Concept
Additional Content Note: This class also includes: - consulting regarding the conservation and restoration of cultural heritage - activities necessary for the digitisation of cultural heritage, e.g.: • gathering the information and data needed for the creation of virtual replicas
CoreContentNote: This class includes: - conservation and restoration of historical and archaeological assets of all types of materials, whether the assets are movable or stationary
Exclusion Note: This class excludes: - renovation, renewal, reconstruction and retrofitting of historical and archaeological sites and buildings, see 43.99 - architectural activities to support the conservation and restoration of cultural heritage properties, see 71.11 - conservation science (research and development activities devoted to cultural heritage), see division 72 - archaeological excavations, see 72.20 - repair of furniture not considered cultural heritage and non-historical, see 95.24 - repair of musical instruments not considered cultural heritage and non-historical, see 95.29
broader: Conservation, restoration and other support activities for cultural heritage
in scheme: Statistical Classification of Economic Activities in the European Community, Rev. 2.1 (NACE Rev. 2.1)
Notation: 91.30
top concept of: Statistical Classification of Economic Activities in the European Community, Rev. 2.1 (NACE Rev. 2.1)

MANUFACTURING
type: Concept
CoreContentNote: This section includes the physical, mechanical, chemical or biological transformation of materials, substances, or components into new products, although this cannot be used as the single universal criterion for defining manufacturing (see remark on processing of waste below). The materials, substances, or components undergoing transformation are either raw materials or products of agriculture, forestry, fishing, mining or quarrying as well as products of other manufacturing activities. Substantial alteration, renovation or reconstruction of goods is generally considered to be manufacturing. The output of a manufacturing process may be finished in the sense that it is ready for use or consumption, or it may be semi-finished in the sense that it is to become an input for further manufacturing. For example, the output of alumina refining is the input used in the primary production of aluminium; primary aluminium is the input to aluminium wire drawing; aluminium wire is the input for the manufacture of fabricated wire products. Manufacture of specialised components and parts of, and accessories and attachments to machinery and equipment is, as a general rule, classified in the same class as the manufacture of the machinery and equipment for which the parts and accessories are intended. Manufacture of unspecialised components and parts of machinery and equipment (for example, engines, pistons, electric motors, electrical assemblies, valves, gears, roller bearings, is classified in the appropriate class of manufacturing, without regard to the machinery and equipment in which these items may be included. Making specialised components and accessories by moulding or extruding plastics materials is usually included in group 22.2. Assembly of the component parts of manufactured products is considered manufacturing. This includes the assembly of manufactured products from either self-produced or purchased components. The recovery of waste, in other words, the processing of was…
in scheme: Statistical Classification of Economic Activities in the European Community, Rev. 2.1 (NACE Rev. 2.1)
Notation: C
top concept of: Statistical Classification of Economic Activities in the European Community, Rev. 2.1 (NACE Rev. 2.1)

ConceptNoneRandom0.32425468345468256
type: ConceptAssociation
description: NACE Rev. 2.1 class 19.10 is mapped to NACE Rev. 2 class 19.10
Type: 1:1
Source Concept: Manufacture of coke oven products
Target Concept: http://data.europa.eu/ux2/nace2/1910
in scheme: Statistical Classification of Economic Activities in the European Community, Rev. 2.1 (NACE Rev. 2.1)
scope note: the content of the NACE Rev 2.1 class is fully covered in the corresponding NACE Rev 2 class
top concept of: Statistical Classification of Economic Activities in the European Community, Rev. 2.1 (NACE Rev. 2.1)
Mapping Cardinality: 1 1

Retail sale of newspapers, and other periodical publications and stationery
type: Concept
Additional Content Note: This class also includes: - retail sale of stationery, office and school supplies (e.g. pens, pencils, paper)
CoreContentNote: This class includes: - retail sale of newspapers, periodicals and journals
Exclusion Note: This class excludes: - retail sale of art tools and materials for drawing, painting and sculpting, see 47.69 - distribution of newspapers via streaming or downloading by their publishers, see 58.12 - distribution of periodicals and journals via streaming or downloading by their publishers, see 58.13
broader: Retail sale of cultural and recreational goods
in scheme: Statistical Classification of Economic Activities in the European Community, Rev. 2.1 (NACE Rev. 2.1)
Notation: 47.62
top concept of: Statistical Classification of Economic Activities in the European Community, Rev. 2.1 (NACE Rev. 2.1)

Provision of services to the community as a whole
type: Concept
CoreContentNote: This group includes foreign affairs, defence, justice, public order and safety activities.
broader: Public administration and defence; compulsory social security
in scheme: Statistical Classification of Economic Activities in the European Community, Rev. 2.1 (NACE Rev. 2.1)
Notation: 84.2
top concept of: Statistical Classification of Economic Activities in the European Community, Rev. 2.1 (NACE Rev. 2.1)

ConceptNoneRandom0.20506967606080861
type: ConceptAssociation
description: NACE Rev. 2.1 division 29 is mapped to NACE Rev. 2 divisions 23, 27, 28, 29
Type: 48:49
Source Concept: Manufacture of motor vehicles, trailers and semi-trailers
Target Concept: http://data.europa.eu/ux2/nace2/28
Target Concept: http://data.europa.eu/ux2/nace2/29
Target Concept: http://data.europa.eu/ux2/nace2/23
Target Concept: http://data.europa.eu/ux2/nace2/27
in scheme: Statistical Classification of Economic Activities in the European Community, Rev. 2.1 (NACE Rev. 2.1)
top concept of: Statistical Classification of Economic Activities in the European Community, Rev. 2.1 (NACE Rev. 2.1)
Mapping Cardinality: n m

Services to buildings and landscape activities
type: Concept
CoreContentNote: This division includes the provision of a number of general support services, for example: - the provision of a combination of support services within clients’ facilities - the interior and exterior cleaning of buildings of all types - cleaning of industrial machinery, cleaning of trains, buses, planes, etc. - cleaning of the inside of road and sea tankers - disinfecting and exterminating activities for buildings, ships, trains, etc. - bottle cleaning - street sweeping - snow and ice removal - provision of landscape care and maintenance services
broader: ADMINISTRATIVE AND SUPPORT SERVICE ACTIVITIES
in scheme: Statistical Classification of Economic Activities in the European Community, Rev. 2.1 (NACE Rev. 2.1)
Notation: 81
top concept of: Statistical Classification of Economic Activities in the European Community, Rev. 2.1 (NACE Rev. 2.1)

Other monetary intermediation
type: Concept
Additional Content Note: This class also includes: - activities of postal banks (e.g. for giro (current) and savings accounts) - credit granting by specialised deposit-taking institutions (e.g. for house purchases, agriculture) - money order activities
CoreContentNote: This class includes the receiving of deposits and/or close substitutes for deposits and extending of credit or other forms of lending funds. The granting of credit can take a variety of forms (for example, loans, mortgages, consumer credit cards, and so on). These activities are generally carried out by monetary institutions other than central banks, for example: - banks - savings banks - credit cooperatives and unions
Exclusion Note: This class excludes: - credit granting by specialised non-depository institutions (e.g. for house purchases), see 64.92 - credit card transaction processing and settlement activities, see 66.19
broader: Monetary intermediation
in scheme: Statistical Classification of Economic Activities in the European Community, Rev. 2.1 (NACE Rev. 2.1)
Notation: 64.19
top concept of: Statistical Classification of Economic Activities in the European Community, Rev. 2.1 (NACE Rev. 2.1)

ConceptNoneRandom0.09362923843244764
type: ConceptAssociation
description: NACE Rev. 2.1 group 27.3 is mapped to NACE Rev. 2 group 27.3
Type: 1:1
Source Concept: Manufacture of wiring and wiring devices
Target Concept: http://data.europa.eu/ux2/nace2/273
in scheme: Statistical Classification of Economic Activities in the European Community, Rev. 2.1 (NACE Rev. 2.1)
top concept of: Statistical Classification of Economic Activities in the European Community, Rev. 2.1 (NACE Rev. 2.1)
Mapping Cardinality: 1 1

ConceptNoneRandom0.5997742614685089
type: ConceptAssociation
description: NACE Rev. 2.1 class 41.00 is mapped to NACE Rev. 2 class 41.20
Type: 23:16
Source Concept: Construction of residential and non-residential buildings
Target Concept: http://data.europa.eu/ux2/nace2/4120
in scheme: Statistical Classification of Economic Activities in the European Community, Rev. 2.1 (NACE Rev. 2.1)
scope note: the content of the NACE Rev 2.1 class is fully covered in the corresponding NACE Rev 2 class
top concept of: Statistical Classification of Economic Activities in the European Community, Rev. 2.1 (NACE Rev. 2.1)
Mapping Cardinality: n m

Manufacture of coke oven products
type: Concept
CoreContentNote: This class includes: - operation of coke ovens - production of coke and semi-coke - production of pitch and pitch coke - production of coke oven gas - production of crude coal and lignite tars - agglomeration of coke
Exclusion Note: This class excludes: - manufacture of coal fuel briquettes, see 19.20
broader: Manufacture of coke oven products
in scheme: Statistical Classification of Economic Activities in the European Community, Rev. 2.1 (NACE Rev. 2.1)
Notation: 19.10
top concept of: Statistical Classification of Economic Activities in the European Community, Rev. 2.1 (NACE Rev. 2.1)

ConceptNoneRandom0.801512164339356
type: ConceptAssociation
description: NACE Rev. 2.1 group 49.1 is mapped to NACE Rev. 2 groups 49.1, 49.3
Type: 42:34
Source Concept: Passenger rail transport
Target Concept: http://data.europa.eu/ux2/nace2/493
Target Concept: http://data.europa.eu/ux2/nace2/491
in scheme: Statistical Classification of Economic Activities in the European Community, Rev. 2.1 (NACE Rev. 2.1)
top concept of: Statistical Classification of Economic Activities in the European Community, Rev. 2.1 (NACE Rev. 2.1)
Mapping Cardinality: n m

ConceptNoneRandom0.3887333729543144
type: ConceptAssociation
description: NACE Rev. 2.1 class 23.63 is mapped to NACE Rev. 2 class 23.63
Type: 1:1
Source Concept: Manufacture of ready-mixed concrete
Target Concept: http://data.europa.eu/ux2/nace2/2363
in scheme: Statistical Classification of Economic Activities in the European Community, Rev. 2.1 (NACE Rev. 2.1)
scope note: the content of the NACE Rev 2.1 class is fully covered in the corresponding NACE Rev 2 class
top concept of: Statistical Classification of Economic Activities in the European Community, Rev. 2.1 (NACE Rev. 2.1)
Mapping Cardinality: 1 1

ConceptNoneRandom0.25050453010470075
type: ConceptAssociation
description: NACE Rev. 2.1 group 01.2 is mapped to NACE Rev. 2 group 01.2
Type: 2:2
Source Concept: Growing of perennial crops
Target Concept: http://data.europa.eu/ux2/nace2/012
in scheme: Statistical Classification of Economic Activities in the European Community, Rev. 2.1 (NACE Rev. 2.1)
top concept of: Statistical Classification of Economic Activities in the European Community, Rev. 2.1 (NACE Rev. 2.1)
Mapping Cardinality: n m

Retail sale of sporting equipment
type: Concept
CoreContentNote: This class includes: - retail sale of sports goods, including fishing gear, weapons and ammunition, camping goods, etc. - retail sale of boats - retail sale of bicycles, including electric bicycles, monowheels, hoverboards, kickscooters, etc. - retail sale of special footwear for sports (e.g. football shoes, ice skates, ski boots) - retail sale of special sports equipment clothes for skiing, martial arts, ballet, etc. - retail sale of parachutes, tents, sleeping bags, etc.
Exclusion Note: This class excludes: - retail sale of non-specialised sports footwear (e.g. tennis shoes, basketball shoes, gym shoes, training shoes), see 47.72
broader: Retail sale of cultural and recreational goods
in scheme: Statistical Classification of Economic Activities in the European Community, Rev. 2.1 (NACE Rev. 2.1)
Notation: 47.63
top concept of: Statistical Classification of Economic Activities in the European Community, Rev. 2.1 (NACE Rev. 2.1)

ConceptNoneRandom0.9218726596162236
type: ConceptAssociation
description: NACE Rev. 2.1 class 61.90 is mapped to NACE Rev. 2 classes 61.20, 61.90
Type: 78:65
Source Concept: Other telecommunication activities
Target Concept: http://data.europa.eu/ux2/nace2/6190
Target Concept: http://data.europa.eu/ux2/nace2/6120
in scheme: Statistical Classification of Economic Activities in the European Community, Rev. 2.1 (NACE Rev. 2.1)
scope note: 61.20: - transmission via the internet of text messaging (SMS) 61.90: - provision of specialised telecommunication applications, e.g. satellite tracking, communication telemetry, radar station operations - operation of satellite terminal stations and associated facilities operationally connected with one or more terrestrial communication systems and capable of transmitting telecommunication to or receiving telecommunication from satellite systems - provision of internet access over networks between the client and the Internet Service Provider not owned or controlled by the Internet Service Provider, e.g. dial-up internet access - provision of telephone and internet access in facilities open to the public
top concept of: Statistical Classification of Economic Activities in the European Community, Rev. 2.1 (NACE Rev. 2.1)
Mapping Cardinality: n m

Intermediation service activities for business support service activities n.e.c.
type: Concept
Additional Content Note: This class also includes: - reservation services for theatrical, sport, amusement and entertainment tickets - intermediation service activities for lottery games
CoreContentNote: This class includes the intermediation service activities for business support activities n.e.c., by bringing clients and service providers together for a fee or commission. These intermediation activities can be carried out on digital platforms or through non-digital channels (including face-to-face, door-to-door, telephone, mail, and so on). The fee or commission can be received from either the client or the provider of the business support service. Revenue for the intermediation activities can include other sources of income (for example, revenues from the sale of advertising space).
Exclusion Note: This class excludes: - activities of brokers and agents for electric power and natural gas, see 35.40 - intermediation service activities for specialised construction services, see 43.60 - intermediation service activities for retail sale, see 47.9 - intermediation service activities for transport, see 52.3 - intermediation service activities for postal and courier activities, see 53.30 - intermediation service activities for accommodation, see 55.40 - intermediation service activities for food and beverage service activities, see 56.40 - intermediation service activities for video game software publishing, see 58.21 - intermediation service activities for software publishing and software downloads, see 58.29 - intermediation service activities for telecommunication activities, see 61.20 - financial and insurance intermediation service activities, see section L (e.g. activities of insurance agents and brokers (class 66.22)) - intermediation service activities for real estate activities, see 68.31 - travel agency activities, see 79.11 - patent brokering (marketing) service activities, see 74.91 - intermediation service activities for the rental and leasing of tangible goods and non-financial intangible assets, see 77.5 - intermediation service activities for courses and tutors, see 85.61 - appointment reservations for medical visits, see 86.97 - intermediation service activities for medical, dental and other health services, see 86.97 - intermediation service activities for residential care activities, see 87.91 - intermediation service activities for the repair and maintenance of computers, personal and household goods, motor vehicles and motorcycles, see 95.40 - intermediation service activities for personal services, see 96.40
broader: Intermediation service activities for business support service activities n.e.c.
in scheme: Statistical Classification of Economic Activities in the European Community, Rev. 2.1 (NACE Rev. 2.1)
Notation: 82.40
top concept of: Statistical Classification of Economic Activities in the European Community, Rev. 2.1 (NACE Rev. 2.1)

Mining of iron ores
type: Concept
CoreContentNote: This class includes: - mining of ores valued chiefly for iron content - beneficiation of iron ores
Exclusion Note: This class excludes: - extraction and preparation of pyrites and pyrrhotite (except roasting), see 08.91
broader: Mining of iron ores
in scheme: Statistical Classification of Economic Activities in the European Community, Rev. 2.1 (NACE Rev. 2.1)
Notation: 07.10
top concept of: Statistical Classification of Economic Activities in the European Community, Rev. 2.1 (NACE Rev. 2.1)

ConceptNoneRandom0.19290013516995208
type: ConceptAssociation
description: NACE Rev. 2.1 division 23 is mapped to NACE Rev. 2 divisions 13, 22, 23
Type: 48:49
Source Concept: Manufacture of other non-metallic mineral products
Target Concept: http://data.europa.eu/ux2/nace2/22
Target Concept: http://data.europa.eu/ux2/nace2/23
Target Concept: http://data.europa.eu/ux2/nace2/13
in scheme: Statistical Classification of Economic Activities in the European Community, Rev. 2.1 (NACE Rev. 2.1)
top concept of: Statistical Classification of Economic Activities in the European Community, Rev. 2.1 (NACE Rev. 2.1)
Mapping Cardinality: n m

Computer programming activities
type: Concept
broader: Computer programming, consultancy and related activities
in scheme: Statistical Classification of Economic Activities in the European Community, Rev. 2.1 (NACE Rev. 2.1)
Notation: 62.1
top concept of: Statistical Classification of Economic Activities in the European Community, Rev. 2.1 (NACE Rev. 2.1)

Support activities for petroleum and natural gas extraction
type: Concept
broader: Mining support service activities
in scheme: Statistical Classification of Economic Activities in the European Community, Rev. 2.1 (NACE Rev. 2.1)
Notation: 09.1
top concept of: Statistical Classification of Economic Activities in the European Community, Rev. 2.1 (NACE Rev. 2.1)

ConceptNoneRandom0.8338704009933614
type: ConceptAssociation
description: NACE Rev. 2.1 class 10.31 is mapped to NACE Rev. 2 class 10.31
Type: 1:1
Source Concept: Processing and preserving of potatoes
Target Concept: http://data.europa.eu/ux2/nace2/1031
in scheme: Statistical Classification of Economic Activities in the European Community, Rev. 2.1 (NACE Rev. 2.1)
scope note: the content of the NACE Rev 2.1 class is fully covered in the corresponding NACE Rev 2 class
top concept of: Statistical Classification of Economic Activities in the European Community, Rev. 2.1 (NACE Rev. 2.1)
Mapping Cardinality: 1 1

ConceptNoneRandom0.060671023636228893
type: ConceptAssociation
description: NACE Rev. 2.1 class 20.11 is mapped to NACE Rev. 2 class 20.11
Type: 4:6
Source Concept: Manufacture of industrial gases
Target Concept: http://data.europa.eu/ux2/nace2/2011
in scheme: Statistical Classification of Economic Activities in the European Community, Rev. 2.1 (NACE Rev. 2.1)
scope note: the content of the NACE Rev 2.1 class is fully covered in the corresponding NACE Rev 2 class
top concept of: Statistical Classification of Economic Activities in the European Community, Rev. 2.1 (NACE Rev. 2.1)
Mapping Cardinality: n m

ConceptNoneRandom0.42173391484596123
type: ConceptAssociation
description: NACE Rev. 2.1 group 58.1 is mapped to NACE Rev. 2 group 58.1
Type: 1:1
Source Concept: Publishing of books, newspapers and other publishing activities, except software publishing
Target Concept: http://data.europa.eu/ux2/nace2/581
in scheme: Statistical Classification of Economic Activities in the European Community, Rev. 2.1 (NACE Rev. 2.1)
top concept of: Statistical Classification of Economic Activities in the European Community, Rev. 2.1 (NACE Rev. 2.1)
Mapping Cardinality: 1 1

ConceptNoneRandom0.5227780737877353
type: ConceptAssociation
description: NACE Rev. 2.1 class 43.23 is mapped to NACE Rev. 2 classes 43.29, 43.39, 43.99
Type: 23:16
Source Concept: Installation of insulation
Target Concept: http://data.europa.eu/ux2/nace2/4329
Target Concept: http://data.europa.eu/ux2/nace2/4339
Target Concept: http://data.europa.eu/ux2/nace2/4399
in scheme: Statistical Classification of Economic Activities in the European Community, Rev. 2.1 (NACE Rev. 2.1)
scope note: 43.29: - thermal insulation works, e.g. for pipes, boilers and ducts, interior or exterior, including cladding for insulation - sound insulation works - vibration insulation works - fireproofing works - internal insulation of roofs 43.39: - installation of acoustic panels, tiles and similar materials - installation of interior insulation in boats 43.99: - hydro insulation
top concept of: Statistical Classification of Economic Activities in the European Community, Rev. 2.1 (NACE Rev. 2.1)
Mapping Cardinality: n m

ConceptNoneRandom0.28089859812396833
type: ConceptAssociation
description: NACE Rev. 2.1 class 20.59 is mapped to NACE Rev. 2 classes 20.51, 20.52, 20.53, 20.59
Type: 4:6
Source Concept: Manufacture of other chemical products n.e.c.
Target Concept: http://data.europa.eu/ux2/nace2/2051
Target Concept: http://data.europa.eu/ux2/nace2/2052
Target Concept: http://data.europa.eu/ux2/nace2/2053
Target Concept: http://data.europa.eu/ux2/nace2/2059
in scheme: Statistical Classification of Economic Activities in the European Community, Rev. 2.1 (NACE Rev. 2.1)
scope note: 20.51: - manufacture of propellant powders - manufacture of explosives and pyrotechnic products, including percussion caps, detonators, signalling flares etc. - manufacture of matches 20.52: - manufacture of glues and prepared adhesives, including rubber-based glues and adhesives 20.53: - manufacture of extracts of natural aromatic products - manufacture of resinoids - manufacture of mixtures of odoriferous products for the manufacture of perfumes or food 20.59: - manufacture of photographic plates, films, sensitised paper and other sensitised unexposed materials - manufacture of chemical preparations for photographic uses - manufacture of gelatine and its derivatives - manufacture of essential oils - manufacture of e-liquids used in vaping devices - manufacture of various chemical products: • peptones, peptone derivatives, other protein substances and their derivatives n.e.c. • chemically modified oils and fats • materials used in the finishing of textiles and leather • powders and pastes used in soldering, brazing or welding • substances used to pickle metal • prepared additives for cements • activated carbon, lubricating oil additives, prepared rubber accelerators, catalysts and other chemical products for industrial use • anti-knock preparations, antifreeze preparations • liquids for hydraulic transmission • composite diagnostic or laboratory reagents • fuel additives, e.g. based on Ethyl tertiary-butyl ether (ETBE) and Methyl tertiary-butyl ether (MTBE) - manufacture of writing and drawing ink
top concept of: Statistical Classification of Economic Activities in the European Community, Rev. 2.1 (NACE Rev. 2.1)
Mapping Cardinality: n m

Computer consultancy and computer facilities management activities
type: Concept
broader: Computer programming, consultancy and related activities
in scheme: Statistical Classification of Economic Activities in the European Community, Rev. 2.1 (NACE Rev. 2.1)
Notation: 62.2
top concept of: Statistical Classification of Economic Activities in the European Community, Rev. 2.1 (NACE Rev. 2.1)

ConceptNoneRandom0.9114748955835436
type: ConceptAssociation
description: NACE Rev. 2.1 group 23.1 is mapped to NACE Rev. 2 group 23.1
Type: 18:19
Source Concept: Manufacture of glass and glass products
Target Concept: http://data.europa.eu/ux2/nace2/231
in scheme: Statistical Classification of Economic Activities in the European Community, Rev. 2.1 (NACE Rev. 2.1)
top concept of: Statistical Classification of Economic Activities in the European Community, Rev. 2.1 (NACE Rev. 2.1)
Mapping Cardinality: n m

ConceptNoneRandom0.9607874939576262
type: ConceptAssociation
description: NACE Rev. 2.1 group 58.2 is mapped to NACE Rev. 2 group 58.2
Type: 1:1
Source Concept: Software publishing
Target Concept: http://data.europa.eu/ux2/nace2/582
in scheme: Statistical Classification of Economic Activities in the European Community, Rev. 2.1 (NACE Rev. 2.1)
top concept of: Statistical Classification of Economic Activities in the European Community, Rev. 2.1 (NACE Rev. 2.1)
Mapping Cardinality: 1 1

ConceptNoneRandom0.538237884258857
type: ConceptAssociation
description: NACE Rev. 2.1 class 23.64 is mapped to NACE Rev. 2 class 23.64
Type: 1:1
Source Concept: Manufacture of mortars
Target Concept: http://data.europa.eu/ux2/nace2/2364
in scheme: Statistical Classification of Economic Activities in the European Community, Rev. 2.1 (NACE Rev. 2.1)
scope note: the content of the NACE Rev 2.1 class is fully covered in the corresponding NACE Rev 2 class
top concept of: Statistical Classification of Economic Activities in the European Community, Rev. 2.1 (NACE Rev. 2.1)
Mapping Cardinality: 1 1

ConceptNoneRandom0.6608456960794891
type: ConceptAssociation
description: NACE Rev. 2.1 group 27.9 is mapped to NACE Rev. 2 groups 27.9, 28.4
Type: 18:19
Source Concept: Manufacture of other electrical equipment
Target Concept: http://data.europa.eu/ux2/nace2/284
Target Concept: http://data.europa.eu/ux2/nace2/279
in scheme: Statistical Classification of Economic Activities in the European Community, Rev. 2.1 (NACE Rev. 2.1)
top concept of: Statistical Classification of Economic Activities in the European Community, Rev. 2.1 (NACE Rev. 2.1)
Mapping Cardinality: n m

ConceptNoneRandom0.8296258665440983
type: ConceptAssociation
description: NACE Rev. 2.1 group 01.3 is mapped to NACE Rev. 2 group 01.3
Type: 1:1
Source Concept: Plant propagation
Target Concept: http://data.europa.eu/ux2/nace2/013
in scheme: Statistical Classification of Economic Activities in the European Community, Rev. 2.1 (NACE Rev. 2.1)
top concept of: Statistical Classification of Economic Activities in the European Community, Rev. 2.1 (NACE Rev. 2.1)
Mapping Cardinality: 1 1

Retail sale of games and toys
type: Concept
Additional Content Note: This class also includes: - retail sale of toy drones
CoreContentNote: This class includes: - retail sale of games and toys, made of all materials - retail sale of party supplies (e.g. masks, party favour (cotillons, jokes, etc.), magic items)
Exclusion Note: This class excludes: - retail sale of video consoles and video games on physical media, see 47.40 - retail sale of disguises, see 47.71 - second-hand retail sale of games and toys, see 47.79 - edition/publishing of games, board games, see 58.19 - distribution of video games via streaming and downloading by their publishers, see 58.21 - distribution of audio via streaming and downloading by their publishers, see 59.20 - content distribution (sharing) platforms for video games, see 60.39
broader: Retail sale of cultural and recreational goods
in scheme: Statistical Classification of Economic Activities in the European Community, Rev. 2.1 (NACE Rev. 2.1)
Notation: 47.64
top concept of: Statistical Classification of Economic Activities in the European Community, Rev. 2.1 (NACE Rev. 2.1)

Wholesale of fruit and vegetables
type: Concept
Additional Content Note: This class also includes: - wholesale of mushrooms
CoreContentNote: This class includes: - wholesale of fresh fruits and vegetables - wholesale of legumes - wholesale of dried fruits and vegetables - wholesale of preserved fruits and vegetables - wholesale of frozen fruits and vegetables
Exclusion Note: This class excludes: - wholesale of fruit and vegetable juices, see 46.34 - wholesale of ready-made meals, see 46.38
broader: Wholesale of food, beverages and tobacco
in scheme: Statistical Classification of Economic Activities in the European Community, Rev. 2.1 (NACE Rev. 2.1)
Notation: 46.31
top concept of: Statistical Classification of Economic Activities in the European Community, Rev. 2.1 (NACE Rev. 2.1)

ConceptNoneRandom0.8218114712484359
type: ConceptAssociation
description: NACE Rev. 2.1 class 32.11 is mapped to NACE Rev. 2 class 32.11
Type: 1:1
Source Concept: Striking of coins
Target Concept: http://data.europa.eu/ux2/nace2/3211
in scheme: Statistical Classification of Economic Activities in the European Community, Rev. 2.1 (NACE Rev. 2.1)
scope note: the content of the NACE Rev 2.1 class is fully covered in the corresponding NACE Rev 2 class
top concept of: Statistical Classification of Economic Activities in the European Community, Rev. 2.1 (NACE Rev. 2.1)
Mapping Cardinality: 1 1

ConceptNoneRandom0.4494588121390233
type: ConceptAssociation
description: NACE Rev. 2.1 division 22 is mapped to NACE Rev. 2 division 22
Type: 48:49
Source Concept: Manufacture of rubber and plastic products
Target Concept: http://data.europa.eu/ux2/nace2/22
in scheme: Statistical Classification of Economic Activities in the European Community, Rev. 2.1 (NACE Rev. 2.1)
top concept of: Statistical Classification of Economic Activities in the European Community, Rev. 2.1 (NACE Rev. 2.1)
Mapping Cardinality: n m

Restaurant activities
type: Concept
Additional Content Note: This class also includes: - operation of restaurants on transport equipment and within transport facilities, if operated by separate units not part of the transport provider - operation of restaurants in a hotel, if operated by separate units not part of the hotel - operation of takeaway restaurants in a supermarket, if operated by separate units not part of the supermarket
CoreContentNote: This class includes the provision of predominantly food services to customers (for example, in traditional restaurants, self-service or takeaway restaurants), with or without seating, in permanent or temporary facilities. This class includes activities of: - restaurants - cafeterias - fast-food restaurants - take-out eating places
Exclusion Note: This class excludes: - retail sale of food through vending machines, see 47.2 - operation of railway dining cars as an integrated operation of railway companies, see 49.11 - mobile food service activities, see 56.12 - event catering activities, see 56.21 - concession operation of eating facilities, see 56.22 - activities of food service contractors (e.g. for transport companies), see 56.22 - activities of tea rooms, see 56.30
broader: Restaurants and mobile food service activities
in scheme: Statistical Classification of Economic Activities in the European Community, Rev. 2.1 (NACE Rev. 2.1)
Notation: 56.11
top concept of: Statistical Classification of Economic Activities in the European Community, Rev. 2.1 (NACE Rev. 2.1)

ConceptNoneRandom0.06543927803542793
type: ConceptAssociation
description: NACE Rev. 2.1 class 43.24 is mapped to NACE Rev. 2 class 43.29
Type: 23:16
Source Concept: Other construction installation
Target Concept: http://data.europa.eu/ux2/nace2/4329
in scheme: Statistical Classification of Economic Activities in the European Community, Rev. 2.1 (NACE Rev. 2.1)
scope note: the content of the NACE Rev 2.1 class is fully covered in the corresponding NACE Rev 2 class
top concept of: Statistical Classification of Economic Activities in the European Community, Rev. 2.1 (NACE Rev. 2.1)
Mapping Cardinality: n m

ConceptNoneRandom0.5971675885963362
type: ConceptAssociation
description: NACE Rev. 2.1 group 49.4 is mapped to NACE Rev. 2 group 49.4
Type: 42:34
Source Concept: Freight transport by road and removal services
Target Concept: http://data.europa.eu/ux2/nace2/494
in scheme: Statistical Classification of Economic Activities in the European Community, Rev. 2.1 (NACE Rev. 2.1)
top concept of: Statistical Classification of Economic Activities in the European Community, Rev. 2.1 (NACE Rev. 2.1)
Mapping Cardinality: n m

Activities of households as employers of domestic personnel
type: Concept
broader: Activities of households as employers of domestic personnel
in scheme: Statistical Classification of Economic Activities in the European Community, Rev. 2.1 (NACE Rev. 2.1)
Notation: 97.0
top concept of: Statistical Classification of Economic Activities in the European Community, Rev. 2.1 (NACE Rev. 2.1)

ConceptNoneRandom0.9637696007557273
type: ConceptAssociation
description: NACE Rev. 2.1 class 23.61 is mapped to NACE Rev. 2 class 23.61
Type: 1:1
Source Concept: Manufacture of concrete products for construction purposes
Target Concept: http://data.europa.eu/ux2/nace2/2361
in scheme: Statistical Classification of Economic Activities in the European Community, Rev. 2.1 (NACE Rev. 2.1)
scope note: the content of the NACE Rev 2.1 class is fully covered in the corresponding NACE Rev 2 class
top concept of: Statistical Classification of Economic Activities in the European Community, Rev. 2.1 (NACE Rev. 2.1)
Mapping Cardinality: 1 1

Wholesale of meat, meat products, fish and fish products
type: Concept
Additional Content Note: This class also includes: - wholesale of tripe, delicatessen (charcuterie), salted meat - wholesale of snails - wholesale of algae and seaweed
CoreContentNote: This class includes: - wholesale of meat and meat products - wholesale of poultry and game - wholesale of fish and fish products - wholesale of seafood
Exclusion Note: This class excludes: - wholesale of livestock feed, see 46.21 - wholesale of ready-made meals, see 46.38 - wholesale of food for pets, see 46.38
broader: Wholesale of food, beverages and tobacco
in scheme: Statistical Classification of Economic Activities in the European Community, Rev. 2.1 (NACE Rev. 2.1)
Notation: 46.32
top concept of: Statistical Classification of Economic Activities in the European Community, Rev. 2.1 (NACE Rev. 2.1)

Buying and selling of own real estate
type: Concept
Additional Content Note: This class also includes: - subdividing real estate into lots, without land improvement
CoreContentNote: This class includes: - buying and selling of self-owned real estate, e.g.: • apartment buildings and dwellings • non-residential buildings, including office buildings, industrial buildings, warehouses, hotels and other leisure buildings, exhibition halls, self-storage facilities, retail stores/shops, and shopping centres • data centres • land
Exclusion Note: This class excludes: - subdividing and improving self-owned land for later sale, see 68.12 - development of building projects for sale, see 68.12
broader: Real estate activities with own property and development of building projects
in scheme: Statistical Classification of Economic Activities in the European Community, Rev. 2.1 (NACE Rev. 2.1)
Notation: 68.11
top concept of: Statistical Classification of Economic Activities in the European Community, Rev. 2.1 (NACE Rev. 2.1)

ConceptNoneRandom0.9691302174089949
type: ConceptAssociation
description: NACE Rev. 2.1 class 55.20 is mapped to NACE Rev. 2 class 55.20
Type: 1:1
Source Concept: Holiday and other short-stay accommodation
Target Concept: http://data.europa.eu/ux2/nace2/5520
in scheme: Statistical Classification of Economic Activities in the European Community, Rev. 2.1 (NACE Rev. 2.1)
scope note: the content of the NACE Rev 2.1 class is fully covered in the corresponding NACE Rev 2 class
top concept of: Statistical Classification of Economic Activities in the European Community, Rev. 2.1 (NACE Rev. 2.1)
Mapping Cardinality: 1 1

ConceptNoneRandom0.5435103693955611
type: ConceptAssociation
description: NACE Rev. 2.1 division 26 is mapped to NACE Rev. 2 divisions 26, 28, 32
Type: 48:49
Source Concept: Manufacture of computer, electronic and optical products
Target Concept: http://data.europa.eu/ux2/nace2/28
Target Concept: http://data.europa.eu/ux2/nace2/32
Target Concept: http://data.europa.eu/ux2/nace2/26
in scheme: Statistical Classification of Economic Activities in the European Community, Rev. 2.1 (NACE Rev. 2.1)
top concept of: Statistical Classification of Economic Activities in the European Community, Rev. 2.1 (NACE Rev. 2.1)
Mapping Cardinality: n m

Manufacture of rusks, biscuits, preserved pastries and cakes
type: Concept
Additional Content Note: This class also includes: - manufacture of breadcrumbs, obtained by grinding toasted bread
CoreContentNote: This class includes: - manufacture of rusks, biscuits and other dry bakery products - manufacture of preserved pastry goods, cakes and waffles - manufacture of snack products (cookies, crackers, pretzels, etc.), whether sweet or salted
Exclusion Note: This class excludes: - manufacture of potato snacks, see 10.31
broader: Manufacture of bakery and farinaceous products
in scheme: Statistical Classification of Economic Activities in the European Community, Rev. 2.1 (NACE Rev. 2.1)
Notation: 10.72
top concept of: Statistical Classification of Economic Activities in the European Community, Rev. 2.1 (NACE Rev. 2.1)

Mobile food service activities
type: Concept
CoreContentNote: This class includes the preparation and serving of predominantly food for immediate consumption from movable carts or portable stalls. This class includes activities of mobile food operators, including: - hot food trucks - food vendors - ice cream vendors - food preparation in market stalls - snack vendors - frozen yogurt vendors - pancake vendors
Exclusion Note: This class excludes: - retail sale of food through vending machines, see 47.2 - food delivery by independent units, see 53.20 - preparation and serving of food from movable and temporary carts or portable stalls based on contractual arrangements with the customer, for a specific event, see 56.21 - concession operation of eating facilities, see 56.22 - mobile beverage serving activities, see 56.30
broader: Restaurants and mobile food service activities
in scheme: Statistical Classification of Economic Activities in the European Community, Rev. 2.1 (NACE Rev. 2.1)
Notation: 56.12
top concept of: Statistical Classification of Economic Activities in the European Community, Rev. 2.1 (NACE Rev. 2.1)

ConceptNoneRandom0.7794262771612439
type: ConceptAssociation
description: NACE Rev. 2.1 class 43.21 is mapped to NACE Rev. 2 class 43.21
Type: 1:1
Source Concept: Electrical installation
Target Concept: http://data.europa.eu/ux2/nace2/4321
in scheme: Statistical Classification of Economic Activities in the European Community, Rev. 2.1 (NACE Rev. 2.1)
scope note: the content of the NACE Rev 2.1 class is fully covered in the corresponding NACE Rev 2 class
top concept of: Statistical Classification of Economic Activities in the European Community, Rev. 2.1 (NACE Rev. 2.1)
Mapping Cardinality: 1 1

ConceptNoneRandom0.6748798468690512
type: ConceptAssociation
description: NACE Rev. 2.1 class 46.72 is mapped to NACE Rev. 2 class 45.31
Type: 78:65
Source Concept: Wholesale of motor vehicle parts and accessories
Target Concept: http://data.europa.eu/ux2/nace2/4531
in scheme: Statistical Classification of Economic Activities in the European Community, Rev. 2.1 (NACE Rev. 2.1)
scope note: the content of the NACE Rev 2.1 class is fully covered in the corresponding NACE Rev 2 class
top concept of: Statistical Classification of Economic Activities in the European Community, Rev. 2.1 (NACE Rev. 2.1)
Mapping Cardinality: n m

ConceptNoneRandom0.9918309329944697
type: ConceptAssociation
description: NACE Rev. 2.1 class 20.13 is mapped to NACE Rev. 2 class 20.13
Type: 1:1
Source Concept: Manufacture of other inorganic basic chemicals
Target Concept: http://data.europa.eu/ux2/nace2/2013
in scheme: Statistical Classification of Economic Activities in the European Community, Rev. 2.1 (NACE Rev. 2.1)
scope note: the content of the NACE Rev 2.1 class is fully covered in the corresponding NACE Rev 2 class
top concept of: Statistical Classification of Economic Activities in the European Community, Rev. 2.1 (NACE Rev. 2.1)
Mapping Cardinality: 1 1

Other manufacturing n.e.c.
type: Concept
CoreContentNote: This class includes: - manufacture of protective safety equipment, e.g.: • linemen’s safety belts and other belts for occupational use • cork life preservers • safety headgear and other personal safety equipment (e.g. protective face shields/visors, of plastics, such as athletic helmets) • fire-protective clothing • metal safety headgear and other metal personal safety devices • earplugs and noise plugs (e.g. for swimming and noise protection) • gas masks • biohazard protective clothing and accessories • bulletproof vests • clean room suits and accessories - manufacture of pens and pencils of all kinds, whether or not mechanical - manufacture of pencil leads - manufacture of date, sealing or numbering stamps, hand-operated devices for printing, or embossing labels, hand-printing sets, prepared typewriter ribbons and inked pads - manufacture of globes - manufacture of umbrellas, sun umbrellas, walking sticks, seat-sticks - manufacture of buttons, press fasteners, snap-fasteners, press studs, slide fasteners - manufacture of electronic cigarettes (vapes) - manufacture of cigarette lighters and other lighters - manufacture of articles of personal use (e.g. smoking pipes, scent sprays, vacuum flasks and other vacuum vessels for personal or household use, wigs, false beards, eyebrows) - manufacture of miscellaneous articles (e.g. candles, tapers, etc.; artificial flowers, fruits and foliage; jokes and novelties; hand sieves and hand riddles; tailors’ dummies; burial coffins) - manufacture of floral baskets, bouquets, wreaths and similar articles - taxidermy activities - manufacture of scale models designed for demonstrational purposes
Exclusion Note: This class excludes: - manufacture of lighter wicks, see 13.96 - manufacture of workwear, see 14.23 - manufacture of paper novelties, see 17.25 - manufacture of plastic headgear excluding safety headgear, see 22.26 - manufacture of individual protective masks (e.g. FFP2, FFP3, surgical masks), see 32.50
broader: Manufacturing n.e.c.
in scheme: Statistical Classification of Economic Activities in the European Community, Rev. 2.1 (NACE Rev. 2.1)
Notation: 32.99
top concept of: Statistical Classification of Economic Activities in the European Community, Rev. 2.1 (NACE Rev. 2.1)

ConceptNoneRandom0.034815257375173214
type: ConceptAssociation
description: NACE Rev. 2.1 group 49.5 is mapped to NACE Rev. 2 group 49.5
Type: 1:1
Source Concept: Transport via pipeline
Target Concept: http://data.europa.eu/ux2/nace2/495
in scheme: Statistical Classification of Economic Activities in the European Community, Rev. 2.1 (NACE Rev. 2.1)
top concept of: Statistical Classification of Economic Activities in the European Community, Rev. 2.1 (NACE Rev. 2.1)
Mapping Cardinality: 1 1

ConceptNoneRandom0.262564128792543
type: ConceptAssociation
description: NACE Rev. 2.1 class 23.62 is mapped to NACE Rev. 2 class 23.62
Type: 1:1
Source Concept: Manufacture of plaster products for construction purposes
Target Concept: http://data.europa.eu/ux2/nace2/2362
in scheme: Statistical Classification of Economic Activities in the European Community, Rev. 2.1 (NACE Rev. 2.1)
scope note: the content of the NACE Rev 2.1 class is fully covered in the corresponding NACE Rev 2 class
top concept of: Statistical Classification of Economic Activities in the European Community, Rev. 2.1 (NACE Rev. 2.1)
Mapping Cardinality: 1 1

ConceptNoneRandom0.13963848974741944
type: ConceptAssociation
description: NACE Rev. 2.1 group 01.1 is mapped to NACE Rev. 2 groups 01.1, 01.2
Type: 2:2
Source Concept: Growing of non-perennial crops
Target Concept: http://data.europa.eu/ux2/nace2/012
Target Concept: http://data.europa.eu/ux2/nace2/011
in scheme: Statistical Classification of Economic Activities in the European Community, Rev. 2.1 (NACE Rev. 2.1)
top concept of: Statistical Classification of Economic Activities in the European Community, Rev. 2.1 (NACE Rev. 2.1)
Mapping Cardinality: n m

Wholesale of dairy products, eggs and edible oils and fats
type: Concept
Additional Content Note: This class also includes: - wholesale of powdered milk - wholesale of ice creams and sorbets
CoreContentNote: This class includes: - wholesale of dairy products - wholesale of eggs and egg products - wholesale of edible oils and fats of animal or vegetable origin
broader: Wholesale of food, beverages and tobacco
in scheme: Statistical Classification of Economic Activities in the European Community, Rev. 2.1 (NACE Rev. 2.1)
Notation: 46.33
top concept of: Statistical Classification of Economic Activities in the European Community, Rev. 2.1 (NACE Rev. 2.1)

ConceptNoneRandom0.13806585767309787
type: ConceptAssociation
description: NACE Rev. 2.1 division 24 is mapped to NACE Rev. 2 division 24
Type: 1:1
Source Concept: Manufacture of basic metals
Target Concept: http://data.europa.eu/ux2/nace2/24
in scheme: Statistical Classification of Economic Activities in the European Community, Rev. 2.1 (NACE Rev. 2.1)
top concept of: Statistical Classification of Economic Activities in the European Community, Rev. 2.1 (NACE Rev. 2.1)
Mapping Cardinality: 1 1

ConceptNoneRandom0.4480526394453418
type: ConceptAssociation
description: NACE Rev. 2.1 division 25 is mapped to NACE Rev. 2 division 25
Type: 48:49
Source Concept: Manufacture of fabricated metal products, except machinery and equipment
Target Concept: http://data.europa.eu/ux2/nace2/25
in scheme: Statistical Classification of Economic Activities in the European Community, Rev. 2.1 (NACE Rev. 2.1)
top concept of: Statistical Classification of Economic Activities in the European Community, Rev. 2.1 (NACE Rev. 2.1)
Mapping Cardinality: n m

Relation

Manufacture of medical and dental instruments and supplies
type: Concept
CoreContentNote: This class includes the manufacture of laboratory apparatus, surgical and medical instruments, surgical appliances and supplies, dental equipment and supplies, orthodontic goods, dentures and orthodontic appliances. Further included is the manufacture of medical, dental and similar furniture where the additional specific functions determine the purpose of the product (for example, dentist’s chairs with built-in hydraulic functions). This class includes: - manufacture of surgical drapes and sterile yarns/tissue - manufacture of dental fillings and cements (except denture adhesives), dental wax and other dental plaster preparations - manufacture of bone reconstruction cements - manufacture of dental laboratory furnaces - manufacture of laboratory ultrasonic cleaning machinery - manufacture of medical, surgical or laboratory sterilisers - manufacture of laboratory-type centrifuges - manufacture of medical, surgical, dental or veterinary furniture, e.g.: • operating tables • examination tables • hospital beds with mechanical fittings • dentist chairs - manufacture of articles specially designed for use exclusively in implants in medical, surgical, dental or veterinary sciences (e.g. plates which remain permanently in the body (e.g. to replace part or the whole of a bone)) - manufacture of syringes, needles, catheters, cannulae, etc. - manufacture of dental instruments and appliances - manufacture of artificial teeth and dental fittings - manufacture of orthopaedic and prosthetic devices - manufacture of glass eyes - manufacture of medical thermometers - manufacture of ophthalmic goods, eyeglasses, sunglasses, lenses ground to prescription, contact lenses, safety goggles - manufacture of made-to-measure orthopaedic footwear and special insoles for correcting orthopaedic conditions - manufacture of individual protective masks (e.g. FFP2, FFP3, surgical masks)
Exclusion Note: This class excludes: - manufacture of special series-produced shoes supporting the arch of the foot, see 15.20 - manufacture of denture fixative pastes and powders, see 20.42 - manufacture of wadding, gauze, bandages and similar articles (e.g. dressings, adhesive plasters, poultices, impregnated or coated with pharmaceutical substances), see 21.20 - manufacture of electromedical and electrotherapeutic apparatus, see 26.60 - manufacture of hearing aids, see 26.60 - manufacture of wheelchairs, see 30.92 - retail sale of corrective glasses, lenses and sunglasses, see 47.74
broader: Manufacture of medical and dental instruments and supplies
in scheme: Statistical Classification of Economic Activities in the European Community, Rev. 2.1 (NACE Rev. 2.1)
Notation: 32.50
top concept of: Statistical Classification of Economic Activities in the European Community, Rev. 2.1 (NACE Rev. 2.1)

ConceptNoneRandom0.014709390687387636
type: ConceptAssociation
description: NACE Rev. 2.1 class 10.32 is mapped to NACE Rev. 2 class 10.32
Type: 1:1
Source Concept: Manufacture of fruit and vegetable juice
Target Concept: http://data.europa.eu/ux2/nace2/1032
in scheme: Statistical Classification of Economic Activities in the European Community, Rev. 2.1 (NACE Rev. 2.1)
scope note: the content of the NACE Rev 2.1 class is fully covered in the corresponding NACE Rev 2 class
top concept of: Statistical Classification of Economic Activities in the European Community, Rev. 2.1 (NACE Rev. 2.1)
Mapping Cardinality: 1 1

Manufacture of farinaceous products
type: Concept
CoreContentNote: This class includes: - manufacture of pastas (e.g. macaroni and noodles), whether or not cooked or stuffed - manufacture of couscous
Exclusion Note: This class excludes: - manufacture of prepared meals and dishes based on pasta and/or couscous dishes, see 10.85 - manufacture of soup containing pasta, see 10.89
broader: Manufacture of bakery and farinaceous products
in scheme: Statistical Classification of Economic Activities in the European Community, Rev. 2.1 (NACE Rev. 2.1)
Notation: 10.73
top concept of: Statistical Classification of Economic Activities in the European Community, Rev. 2.1 (NACE Rev. 2.1)

ConceptNoneRandom0.20540307992340423
type: ConceptAssociation
description: NACE Rev. 2.1 class 46.73 is mapped to NACE Rev. 2 class 45.40
Type: 78:65
Source Concept: Wholesale of motorcycles, motorcycle parts and accessories
Target Concept: http://data.europa.eu/ux2/nace2/4540
in scheme: Statistical Classification of Economic Activities in the European Community, Rev. 2.1 (NACE Rev. 2.1)
scope note: the content of the NACE Rev 2.1 class is fully covered in the corresponding NACE Rev 2 class
top concept of: Statistical Classification of Economic Activities in the European Community, Rev. 2.1 (NACE Rev. 2.1)
Mapping Cardinality: n m

ConceptNoneRandom0.9682769279422779
type: ConceptAssociation
description: NACE Rev. 2.1 class 20.12 is mapped to NACE Rev. 2 class 20.12
Type: 1:1
Source Concept: Manufacture of dyes and pigments
Target Concept: http://data.europa.eu/ux2/nace2/2012
in scheme: Statistical Classification of Economic Activities in the European Community, Rev. 2.1 (NACE Rev. 2.1)
scope note: the content of the NACE Rev 2.1 class is fully covered in the corresponding NACE Rev 2 class
top concept of: Statistical Classification of Economic Activities in the European Community, Rev. 2.1 (NACE Rev. 2.1)
Mapping Cardinality: 1 1

Manufacture of military air and spacecraft and related machinery
type: Concept
Additional Content Note: This class also includes: - factory overhaul and rebuilding military air and spacecraft - manufacture of military aircraft seats
CoreContentNote: This class includes the manufacture of military aircraft and spacecraft and related machinery. The class includes the manufacture of: - fixed-wing aircraft - tiltrotor aircraft - rotary-wing aircraft - drones for military purposes (unmanned aerial vehicles (UAVs))
Exclusion Note: This class excludes: - manufacture of weapons and ammunition, see 25.30 - manufacture of missiles for military purposes, see 25.30 - manufacture of civilian air and spacecraft and related machinery, see 30.31 - repair and maintenance of military air and spacecraft machinery, see 33.18
broader: Manufacture of air and spacecraft and related machinery
in scheme: Statistical Classification of Economic Activities in the European Community, Rev. 2.1 (NACE Rev. 2.1)
Notation: 30.32
top concept of: Statistical Classification of Economic Activities in the European Community, Rev. 2.1 (NACE Rev. 2.1)

ConceptNoneRandom0.2309243656299158
type: ConceptAssociation
description: NACE Rev. 2.1 class 43.22 is mapped to NACE Rev. 2 classes 43.22, 43.99
Type: 23:16
Source Concept: Plumbing, heat and air-conditioning installation
Target Concept: http://data.europa.eu/ux2/nace2/4322
Target Concept: http://data.europa.eu/ux2/nace2/4399
in scheme: Statistical Classification of Economic Activities in the European Community, Rev. 2.1 (NACE Rev. 2.1)
scope note: 43.22: - installation, maintenance and repair of: • heating systems, e.g. heat pumps, solar thermal collectors • furnaces, cooling towers • plumbing and sanitary equipment • ventilation and air-conditioning equipment and ducts • gas fittings • steam piping • sprinkler systems, e.g. fire and lawn sprinkler systems - construction or installation of masonry heater stoves - duct work installation - installation of medical gas distribution systems in hospitals 43.99: - construction or installation of masonry heater stoves
top concept of: Statistical Classification of Economic Activities in the European Community, Rev. 2.1 (NACE Rev. 2.1)
Mapping Cardinality: n m

ConceptNoneRandom0.1279437947422919
type: ConceptAssociation
description: NACE Rev. 2.1 class 20.16 is mapped to NACE Rev. 2 classes 20.16, 38.32
Type: 7:5
Source Concept: Manufacture of plastics in primary forms
Target Concept: http://data.europa.eu/ux2/nace2/2016
Target Concept: http://data.europa.eu/ux2/nace2/3832
in scheme: Statistical Classification of Economic Activities in the European Community, Rev. 2.1 (NACE Rev. 2.1)
scope note: 20.16: - manufacture of plastics in primary forms: • polymers, including those of ethylene, propylene, styrene, vinyl chloride, vinyl acetate and acrylics • polyamides • phenolic and epoxide resins and polyurethanes • alkyd and polyester resins and polyethers • ion-exchangers based on polymers - manufacture of silicones in primary forms - plastic compounding activities - manufacture of cellulose and its chemical derivatives 38.32: - manufacture of plastic powders, granules or flakes by compounding or transforming plastic resins from recovered plastic waste - manufacture of recycled plastic in flakes or plastic granulates based on pre-treated plastic waste following material recovery operation
top concept of: Statistical Classification of Economic Activities in the European Community, Rev. 2.1 (NACE Rev. 2.1)
Mapping Cardinality: n m

ConceptNoneRandom0.9420225342991196
type: ConceptAssociation
description: NACE Rev. 2.1 class 24.52 is mapped to NACE Rev. 2 class 24.52
Type: 1:1
Source Concept: Casting of steel
Target Concept: http://data.europa.eu/ux2/nace2/2452
in scheme: Statistical Classification of Economic Activities in the European Community, Rev. 2.1 (NACE Rev. 2.1)
scope note: the content of the NACE Rev 2.1 class is fully covered in the corresponding NACE Rev 2 class
top concept of: Statistical Classification of Economic Activities in the European Community, Rev. 2.1 (NACE Rev. 2.1)
Mapping Cardinality: 1 1

Other processing and preserving of fruit and vegetables
type: Concept
Additional Content Note: This class also includes: - manufacture of perishable prepared foods of fruits and vegetables, e.g.: • salads; mixed salads, packaged • peeled or cut vegetables • tofu (bean curd)
CoreContentNote: This class includes: - manufacture of food consisting chiefly of fruits or vegetables - preserving of fruits, nuts or vegetables (e.g. freezing, drying, freeze-drying, drying by infra-red radiation, immersing in oil or in vinegar, canning, high pressure, high temperature) - manufacture of fruit or vegetable food products - manufacture of jams, marmalades and table jellies - shelling, peeling and roasting of nuts - manufacture of nut foods and pastes
Exclusion Note: This class excludes: - manufacture of fruit and vegetable juices, see 10.32 - manufacture of flour or meal of dried leguminous vegetables, see 10.61 - preservation of fruits and nuts in sugar, see 10.82 - manufacture of prepared vegetable dishes, see 10.85 - manufacture of artificial concentrates, see 10.89
broader: Processing and preserving of fruit and vegetables
in scheme: Statistical Classification of Economic Activities in the European Community, Rev. 2.1 (NACE Rev. 2.1)
Notation: 10.39
top concept of: Statistical Classification of Economic Activities in the European Community, Rev. 2.1 (NACE Rev. 2.1)

ConceptNoneRandom0.28619233618270445
type: ConceptAssociation
description: NACE Rev. 2.1 class 26.70 is mapped to NACE Rev. 2 classes 26.70, 26.80
Type: 1:2
Source Concept: Manufacture of optical instruments, magnetic and optical media and photographic equipment
Target Concept: http://data.europa.eu/ux2/nace2/2670
Target Concept: http://data.europa.eu/ux2/nace2/2680
in scheme: Statistical Classification of Economic Activities in the European Community, Rev. 2.1 (NACE Rev. 2.1)
scope note: 26.70: - manufacture of optical mirrors - manufacture of optical gun sighting equipment - manufacture of optical positioning equipment - manufacture of optical magnifying instruments - manufacture of optical machinist's precision tools - manufacture of optical comparators - manufacture of film cameras and digital cameras - manufacture of motion picture and slide projectors - manufacture of overhead transparency projectors - manufacture of optical measuring and checking devices and instruments (e.g. fire control equipment, photographic light meters, range finders) - manufacture of lenses, optical microscopes, binoculars and telescopes - manufacture of objective lenses for cameras, projectors or photographic enlargers or reducers - manufacture of laser assemblies 26.80: - manufacture of unrecorded magnetic audio and video tapes - manufacture of unrecorded optical disks
top concept of: Statistical Classification of Economic Activities in the European Community, Rev. 2.1 (NACE Rev. 2.1)
Mapping Cardinality: 1 m

ConceptNoneRandom0.9594892523684723
type: ConceptAssociation
description: NACE Rev. 2.1 group 71.1 is mapped to NACE Rev. 2 group 71.1
Type: 1:1
Source Concept: Architectural and engineering activities and related technical consultancy
Target Concept: http://data.europa.eu/ux2/nace2/711
in scheme: Statistical Classification of Economic Activities in the European Community, Rev. 2.1 (NACE Rev. 2.1)
top concept of: Statistical Classification of Economic Activities in the European Community, Rev. 2.1 (NACE Rev. 2.1)
Mapping Cardinality: 1 1

Forging and shaping metal and powder metallurgy
type: Concept
Additional Content Note: This class also includes: - subsequent trimming or descaling of the metal, without any further processing
CoreContentNote: This class includes general activities for the forming of metal. This class includes: - forging, pressing, stamping and roll-forming of metal - production of metal objects directly from metal powders by heat treatment (sintering) or under pressure, i.e. powder metallurgy
Exclusion Note: This class excludes: - production of metal powder, see 24.10, 24.4
broader: Forging and shaping metal and powder metallurgy
in scheme: Statistical Classification of Economic Activities in the European Community, Rev. 2.1 (NACE Rev. 2.1)
Notation: 25.40
top concept of: Statistical Classification of Economic Activities in the European Community, Rev. 2.1 (NACE Rev. 2.1)

Manufacture of machinery for metallurgy
type: Concept
CoreContentNote: This class includes: - manufacture of machines and equipment for handling hot metals (e.g. converters, ingot moulds, ladles and casting machines, of a kind used in metallurgy or in metal foundries) - manufacture of metal-rolling mills and rolls for such mills
Exclusion Note: This class excludes: - manufacture of moulding boxes and moulds (except ingot moulds), see 25.63 - manufacture of draw benches, see 28.41 - manufacture of machines for forming foundry moulds, see 28.99
broader: Manufacture of other special-purpose machinery
in scheme: Statistical Classification of Economic Activities in the European Community, Rev. 2.1 (NACE Rev. 2.1)
Notation: 28.91
top concept of: Statistical Classification of Economic Activities in the European Community, Rev. 2.1 (NACE Rev. 2.1)

TRANSPORTATION AND STORAGE
type: Concept
Additional Content Note: This section also includes: - intermediation services that link customers to transport service providers, except for division 79
CoreContentNote: This section includes the transport of passengers or freight, by rail, pipeline, road, water or air. It includes the transport of passengers regardless of the reasons, whether for personal, professional or recreational reasons, scheduled or not. Rental of transport equipment with a driver or operator as well as postal and courier activities are classified in this section. The section also includes associated activities (for example, operation of terminal and parking facilities, cargo handling, warehousing and storage, such as the operation of silos, merchandise warehouses, storage tanks). Transport activities classified in divisions 49, 50, 51 and 53 often involve related activities (for example, packaging, goods handling operations, temporary crating, sampling and weighing of goods) which solely support the transport activities. These supporting activities are only to be classified in division 52 if they are performed on behalf of others.
Exclusion Note: This section excludes: - major repair, maintenance or alteration of transport equipment, except motor vehicles, see 33.1 - construction, maintenance and repair of roads, railways, harbours, airfields, see division 42 - rental of transport equipment without a driver or operator, see 77.1, 77.3 - transport activities as an integral part of recreational facilities (e.g. in theme parks), see 93.2 - maintenance and repair of motor vehicles, see 95.31 - maintenance and repair of motorcycles, see 95.32
in scheme: Statistical Classification of Economic Activities in the European Community, Rev. 2.1 (NACE Rev. 2.1)
Notation: H
top concept of: Statistical Classification of Economic Activities in the European Community, Rev. 2.1 (NACE Rev. 2.1)

Veterinary activities
type: Concept
broader: Veterinary activities
in scheme: Statistical Classification of Economic Activities in the European Community, Rev. 2.1 (NACE Rev. 2.1)
Notation: 75.0
top concept of: Statistical Classification of Economic Activities in the European Community, Rev. 2.1 (NACE Rev. 2.1)

ConceptNoneRandom0.1927896709087754
type: ConceptAssociation
description: NACE Rev. 2.1 class 56.11 is mapped to NACE Rev. 2 class 56.10
Type: 2:1
Source Concept: Restaurant activities
Target Concept: http://data.europa.eu/ux2/nace2/5610
in scheme: Statistical Classification of Economic Activities in the European Community, Rev. 2.1 (NACE Rev. 2.1)
scope note: the content of the NACE Rev 2.1 class is fully covered in the corresponding NACE Rev 2 class
top concept of: Statistical Classification of Economic Activities in the European Community, Rev. 2.1 (NACE Rev. 2.1)
Mapping Cardinality: n 1

Other postal and courier activities
type: Concept
broader: Postal and courier activities
in scheme: Statistical Classification of Economic Activities in the European Community, Rev. 2.1 (NACE Rev. 2.1)
Notation: 53.2
top concept of: Statistical Classification of Economic Activities in the European Community, Rev. 2.1 (NACE Rev. 2.1)

ConceptNoneRandom0.12793908721156255
type: ConceptAssociation
description: NACE Rev. 2.1 section D is mapped to NACE Rev. 2 sections D, H
Type: 18:17
Source Concept: ELECTRICITY, GAS, STEAM AND AIR CONDITIONING SUPPLY
Target Concept: http://data.europa.eu/ux2/nace2/D
Target Concept: http://data.europa.eu/ux2/nace2/H
in scheme: Statistical Classification of Economic Activities in the European Community, Rev. 2.1 (NACE Rev. 2.1)
top concept of: Statistical Classification of Economic Activities in the European Community, Rev. 2.1 (NACE Rev. 2.1)
Mapping Cardinality: n m

Warehousing and storage
type: Concept
Additional Content Note: This class also includes: - storage of goods in foreign trade zones - blast freezing associated with storage and warehousing - activities of storage of physical archives and paper files
CoreContentNote: This class includes: - operation of storage and warehouse facilities for all kinds of goods: • operation of grain silos • general merchandise warehouses • refrigerated warehouses and cool stores • storage tanks, etc. - warehousing of furniture, not part of a removal service
Exclusion Note: This class excludes: - storage of electricity, see 35.16 - storage of gaseous fuels for energy supply through a network, see 35.24 - storage of furniture as part of a removal service, see 49.42 - operation of parking facilities for motor vehicles, see 52.21 - winter storage of caravans, ships and boats, and storage of aircraft, see 52.21, 52.22, 52.23 - operation of self-storage facilities, see 68.20 - rental of vacant space, see 68.20
broader: Warehousing and storage
in scheme: Statistical Classification of Economic Activities in the European Community, Rev. 2.1 (NACE Rev. 2.1)
Notation: 52.10
top concept of: Statistical Classification of Economic Activities in the European Community, Rev. 2.1 (NACE Rev. 2.1)

Leasing of intellectual property and similar products, except copyrighted works
type: Concept
Additional Content Note: This class also includes: - receiving royalties or licensing fees for scientific research results
CoreContentNote: This class includes the activities of allowing others to use intellectual property products and similar products for which a royalty payment or licensing fee is paid to the owner of the product (in other words, the asset holder). The leasing of these products can take various forms (for example, permission for reproduction, use in subsequent processes or products, operating businesses under a franchise). The current owners may or may not have created these products. This class includes: - leasing of intellectual property products, except copyrighted works (e.g. books, software) - receiving royalties or licensing fees for the use of: • patented entities • trademarks or service marks • brand names • mineral exploration and evaluation • franchise agreements • internet domains • rights of designed or developed board games
Exclusion Note: This class excludes: - acquisition of rights and publishing, see divisions 58, 59 - producing, reproducing and distributing copyrighted works (books, software, film), see divisions 58, 59 - streaming of content (e.g. software, books, by content publishers), see division 58 - audiobook streaming activities not associated with its publishing, see 60.10 - leasing of real estate, see 68.20 - leasing of tangible products (assets), see 77.1, 77.2, 77.3
broader: Leasing of intellectual property and similar products, except copyrighted works
in scheme: Statistical Classification of Economic Activities in the European Community, Rev. 2.1 (NACE Rev. 2.1)
Notation: 77.40
top concept of: Statistical Classification of Economic Activities in the European Community, Rev. 2.1 (NACE Rev. 2.1)

Raising of horses and other equines
type: Concept
CoreContentNote: This class includes: - raising and breeding of horses, asses, mules or hinnies, regardless of the purpose
Exclusion Note: This class excludes: - operation of racing and riding stables (if they do not have breeding activities), see 93.19
broader: Animal production
in scheme: Statistical Classification of Economic Activities in the European Community, Rev. 2.1 (NACE Rev. 2.1)
Notation: 01.43
top concept of: Statistical Classification of Economic Activities in the European Community, Rev. 2.1 (NACE Rev. 2.1)

Human health activities
type: Concept
Additional Content Note: This division also includes other human health activities (for example, activities of medical laboratories, blood banks, sperm banks, transplant organ banks, and so on, including collecting, processing, storing and shipping).
CoreContentNote: This division includes activities of short- or long-term inpatient health care. It covers general and specialty medical/surgical care offered by hospitals, preventoria, medical nursing homes, mental hospital institutions, rehabilitation centres and other human health institutions which have accommodation facilities and which engage in providing diagnostic and medical treatment to primarily inpatients, with a wide range of medical conditions. This division also includes medical consultation and treatment in the field of general and specialised medicine, by general practitioners and medical specialists and surgeons. It includes dental practice activities of a general or specialised nature, as well as orthodontic activities. Additionally, this division includes medical, curative, rehabilitative or prevention activities by paramedical practitioners and health professionals other than hospitals or practicing medical doctors.
Exclusion Note: This division excludes: - veterinary activities, see 75.00
broader: HUMAN HEALTH AND SOCIAL WORK ACTIVITIES
in scheme: Statistical Classification of Economic Activities in the European Community, Rev. 2.1 (NACE Rev. 2.1)
Notation: 86
top concept of: Statistical Classification of Economic Activities in the European Community, Rev. 2.1 (NACE Rev. 2.1)

Belongs To

ConceptNoneRandom0.8543285558250884
type: ConceptAssociation
description: NACE Rev. 2.1 group 18.1 is mapped to NACE Rev. 2 groups 18.1, 74.2, 82.1
Type: 4:4
Source Concept: Printing and service activities related to printing
Target Concept: http://data.europa.eu/ux2/nace2/821
Target Concept: http://data.europa.eu/ux2/nace2/742
Target Concept: http://data.europa.eu/ux2/nace2/181
in scheme: Statistical Classification of Economic Activities in the European Community, Rev. 2.1 (NACE Rev. 2.1)
top concept of: Statistical Classification of Economic Activities in the European Community, Rev. 2.1 (NACE Rev. 2.1)
Mapping Cardinality: n m

ConceptNoneRandom0.5644808382482427
type: ConceptAssociation
description: NACE Rev. 2.1 class 82.40 is mapped to NACE Rev. 2 classes 79.90, 82.99
Type: 78:65
Source Concept: Intermediation service activities for business support service activities n.e.c.
Target Concept: http://data.europa.eu/ux2/nace2/8299
Target Concept: http://data.europa.eu/ux2/nace2/7990
in scheme: Statistical Classification of Economic Activities in the European Community, Rev. 2.1 (NACE Rev. 2.1)
scope note: 79.90: - reservation services for theatrical, sport, amusement and entertainment tickets
top concept of: Statistical Classification of Economic Activities in the European Community, Rev. 2.1 (NACE Rev. 2.1)
Mapping Cardinality: n m

ConceptNoneRandom0.7886905311145703
type: ConceptAssociation
description: NACE Rev. 2.1 class 47.63 is mapped to NACE Rev. 2 classes 47.64, 47.78, 47.89, 47.91, 47.99
Type: 78:65
Source Concept: Retail sale of sporting equipment
Target Concept: http://data.europa.eu/ux2/nace2/4791
Target Concept: http://data.europa.eu/ux2/nace2/4799
Target Concept: http://data.europa.eu/ux2/nace2/4789
Target Concept: http://data.europa.eu/ux2/nace2/4778
Target Concept: http://data.europa.eu/ux2/nace2/4764
in scheme: Statistical Classification of Economic Activities in the European Community, Rev. 2.1 (NACE Rev. 2.1)
scope note: 47.64: - retail sale of sports goods, including fishing gear, weapons and ammunitions, camping goods, etc. - retail sale of boats - retail sale bicycles, including electric bicycles, mono wheels, hover boards, kickscooters, etc. - retail sale of special footwear for sports, e.g. football shoes, ice skates, ski boots - retail sale of special sports equipment clothes for skiing, martial arts, ballet etc. - retail sale of parachutes, tents, sleeping bags, etc. 47.78: - retail sale of weapons and ammunition 47.89: - retail sale via stalls and markets of sports goods, including fishing gear, weapons and ammunitions, camping goods, etc. - retail sale via stalls and markets of boats - retail sale via stalls and markets of bicycles, including electric bicycles, mono wheels, hover boards, kickscooters, etc. - retail sale via stalls and markets of protective gear for motorcyclists - retail sale via stalls and markets of special footwear for sports, e.g. football shoes, ice skates, ski boots - retail sale via stalls and markets of special sports equipment clothes for skiing, martial arts, ballet etc. - retail sale via stalls and markets of parachutes, tents, sleeping bags etc. 47.91: - retail sale via mail order houses or via Internet of sports goods, including fishing gear, weapons and ammunitions, camping goods, etc. - retail sale via mail order houses or via Internet of boats - retail sale via mail order houses or via Internet of bicycles, including electric bicycles, mono wheels, hover boards, kickscooters, etc. - retail sale of via mail order houses or via Internet protective gear for motorcyclists - retail sale via mail order houses or via Internet of special footwear for sports, e.g. football shoes, ice skates, ski boots - retail sale via mail order houses or via Internet of special sports equipment clothes for skiing, martial arts, ballet etc. - retail sale via mail order houses or via Internet of parachutes, tents, sleeping bags etc. 47.99: - retail sale not in stores…
top concept of: Statistical Classification of Economic Activities in the European Community, Rev. 2.1 (NACE Rev. 2.1)
Mapping Cardinality: n m

ConceptNoneRandom0.9212899382439775
type: ConceptAssociation
description: NACE Rev. 2.1 class 20.15 is mapped to NACE Rev. 2 class 20.15
Type: 1:1
Source Concept: Manufacture of fertilisers and nitrogen compounds
Target Concept: http://data.europa.eu/ux2/nace2/2015
in scheme: Statistical Classification of Economic Activities in the European Community, Rev. 2.1 (NACE Rev. 2.1)
scope note: the content of the NACE Rev 2.1 class is fully covered in the corresponding NACE Rev 2 class
top concept of: Statistical Classification of Economic Activities in the European Community, Rev. 2.1 (NACE Rev. 2.1)
Mapping Cardinality: 1 1

Other reservation service and related activities
type: Concept
broader: Travel agency, tour operator and other reservation service and related activities
in scheme: Statistical Classification of Economic Activities in the European Community, Rev. 2.1 (NACE Rev. 2.1)
Notation: 79.9
top concept of: Statistical Classification of Economic Activities in the European Community, Rev. 2.1 (NACE Rev. 2.1)

ConceptNoneRandom0.6920118930704865
type: ConceptAssociation
description: NACE Rev. 2.1 class 23.20 is mapped to NACE Rev. 2 class 23.20
Type: 1:1
Source Concept: Manufacture of refractory products
Target Concept: http://data.europa.eu/ux2/nace2/2320
in scheme: Statistical Classification of Economic Activities in the European Community, Rev. 2.1 (NACE Rev. 2.1)
scope note: the content of the NACE Rev 2.1 class is fully covered in the corresponding NACE Rev 2 class
top concept of: Statistical Classification of Economic Activities in the European Community, Rev. 2.1 (NACE Rev. 2.1)
Mapping Cardinality: 1 1

ConceptNoneRandom0.09110375960281059
type: ConceptAssociation
description: NACE Rev. 2.1 class 24.53 is mapped to NACE Rev. 2 class 24.53
Type: 2:2
Source Concept: Casting of light metals
Target Concept: http://data.europa.eu/ux2/nace2/2453
in scheme: Statistical Classification of Economic Activities in the European Community, Rev. 2.1 (NACE Rev. 2.1)
scope note: the content of the NACE Rev 2.1 class is fully covered in the corresponding NACE Rev 2 class
top concept of: Statistical Classification of Economic Activities in the European Community, Rev. 2.1 (NACE Rev. 2.1)
Mapping Cardinality: n m

ConceptNoneRandom0.6711040693146038
type: ConceptAssociation
description: NACE Rev. 2.1 group 71.2 is mapped to NACE Rev. 2 group 71.2
Type: 1:1
Source Concept: Technical testing and analysis
Target Concept: http://data.europa.eu/ux2/nace2/712
in scheme: Statistical Classification of Economic Activities in the European Community, Rev. 2.1 (NACE Rev. 2.1)
top concept of: Statistical Classification of Economic Activities in the European Community, Rev. 2.1 (NACE Rev. 2.1)
Mapping Cardinality: 1 1

ACCOMMODATION AND FOOD SERVICE ACTIVITIES
type: Concept
CoreContentNote: This section includes the provision of short-term (less than one year) accommodation for visitors and other travellers, temporary accommodation in single or shared rooms or dormitories for students, seasonal workers and other individuals, as well as the provision of meals and drinks fit for immediate consumption. The amount and type of supplementary services provided within this section can vary widely.
Exclusion Note: This section excludes: - the resale of food or drinks through wholesale or retail sale activities, see section G (the preparation of these foods and drinks is classified in manufacturing, see section C) - the provision of long-term (one year or more) accommodation as primary residences, see section M
in scheme: Statistical Classification of Economic Activities in the European Community, Rev. 2.1 (NACE Rev. 2.1)
Notation: I
top concept of: Statistical Classification of Economic Activities in the European Community, Rev. 2.1 (NACE Rev. 2.1)

Intermediation service activities for postal and courier activities
type: Concept
broader: Postal and courier activities
in scheme: Statistical Classification of Economic Activities in the European Community, Rev. 2.1 (NACE Rev. 2.1)
Notation: 53.3
top concept of: Statistical Classification of Economic Activities in the European Community, Rev. 2.1 (NACE Rev. 2.1)

Casting of other non-ferrous metals
type: Concept
Additional Content Note: This class also includes: - casting of dental implements, etc., of other non-ferrous metals
CoreContentNote: This class includes: - activities of foundries of other non-ferrous metals - manufacture of castings made of copper, zinc, lead or nickel alloys - manufacture of castings made of other non-ferrous metals alloys
broader: Casting of metals
in scheme: Statistical Classification of Economic Activities in the European Community, Rev. 2.1 (NACE Rev. 2.1)
Notation: 24.54
top concept of: Statistical Classification of Economic Activities in the European Community, Rev. 2.1 (NACE Rev. 2.1)

ConceptNoneRandom0.3694885765151438
type: ConceptAssociation
description: NACE Rev. 2.1 section C is mapped to NACE Rev. 2 sections C, E, M, N
Type: 18:17
Source Concept: MANUFACTURING
Target Concept: http://data.europa.eu/ux2/nace2/E
Target Concept: http://data.europa.eu/ux2/nace2/M
Target Concept: http://data.europa.eu/ux2/nace2/N
Target Concept: http://data.europa.eu/ux2/nace2/C
in scheme: Statistical Classification of Economic Activities in the European Community, Rev. 2.1 (NACE Rev. 2.1)
top concept of: Statistical Classification of Economic Activities in the European Community, Rev. 2.1 (NACE Rev. 2.1)
Mapping Cardinality: n m

Raising of camels and camelids
type: Concept
CoreContentNote: This class includes: - raising and breeding of camels (dromedary) and camelids
broader: Animal production
in scheme: Statistical Classification of Economic Activities in the European Community, Rev. 2.1 (NACE Rev. 2.1)
Notation: 01.44
top concept of: Statistical Classification of Economic Activities in the European Community, Rev. 2.1 (NACE Rev. 2.1)

Residential care activities
type: Concept
Additional Content Note: This division also includes activities of residential care centres (providing regular residential care in places specially built or adapted for some target groups). Units are classified depending on target groups.
CoreContentNote: This division includes the provision of residential care combined with either nursing, supervisory or other types of care, as required by the residents. Residential care is a mix of health and social services with the health services being largely nursing services. Residential care activities are provided for residents, who can be staying temporarily.
Exclusion Note: This division excludes: - non-residential nursing activities, see 86.94 - non-residential care activities, see division 88
broader: HUMAN HEALTH AND SOCIAL WORK ACTIVITIES
in scheme: Statistical Classification of Economic Activities in the European Community, Rev. 2.1 (NACE Rev. 2.1)
Notation: 87
top concept of: Statistical Classification of Economic Activities in the European Community, Rev. 2.1 (NACE Rev. 2.1)

ConceptNoneRandom0.19282014232846623
type: ConceptAssociation
description: NACE Rev. 2.1 class 46.31 is mapped to NACE Rev. 2 class 46.31
Type: 1:1
Source Concept: Wholesale of fruit and vegetables
Target Concept: http://data.europa.eu/ux2/nace2/4631
in scheme: Statistical Classification of Economic Activities in the European Community, Rev. 2.1 (NACE Rev. 2.1)
scope note: the content of the NACE Rev 2.1 class is fully covered in the corresponding NACE Rev 2 class
top concept of: Statistical Classification of Economic Activities in the European Community, Rev. 2.1 (NACE Rev. 2.1)
Mapping Cardinality: 1 1

ConceptNoneRandom0.6193213542578273
type: ConceptAssociation
description: NACE Rev. 2.1 class 20.14 is mapped to NACE Rev. 2 classes 20.11, 20.14
Type: 4:6
Source Concept: Manufacture of other organic basic chemicals
Target Concept: http://data.europa.eu/ux2/nace2/2011
Target Concept: http://data.europa.eu/ux2/nace2/2014
in scheme: Statistical Classification of Economic Activities in the European Community, Rev. 2.1 (NACE Rev. 2.1)
scope note: 20.11: - manufacture of refrigerant gases 20.14: - manufacture of chemicals using basic processes, such as thermal cracking and distillation. The output of these processes are usually separate chemical elements or separate chemically defined organic compounds - manufacture of basic organic chemicals: • acyclic hydrocarbons, saturated and unsaturated • cyclic hydrocarbons, saturated and unsaturated • acyclic and cyclic alcohols • mono- and polycarboxylic acids, including acetic acid • other oxygen-function compounds, including aldehydes, ketones, quinones and dual or poly oxygen-function compounds • synthetic glycerol • nitrogen-function organic compounds, including amines • fermentation of sugarcane, corn or similar to produce alcohol and esters • other organic compounds, including wood distillation products (e.g. charcoal) etc. - manufacture of synthetic aromatic products - manufacture of methane, not for the provision as a gaseous fuel through a permanent supply network - distillation of coal tar - manufacture of ethyl alcohol, other than for bioethanol fuel
top concept of: Statistical Classification of Economic Activities in the European Community, Rev. 2.1 (NACE Rev. 2.1)
Mapping Cardinality: n m

ConceptNoneRandom0.6284312538739378
type: ConceptAssociation
description: NACE Rev. 2.1 class 47.64 is mapped to NACE Rev. 2 classes 47.65, 47.89, 47.91, 47.99
Type: 78:65
Source Concept: Retail sale of games and toys
Target Concept: http://data.europa.eu/ux2/nace2/4791
Target Concept: http://data.europa.eu/ux2/nace2/4799
Target Concept: http://data.europa.eu/ux2/nace2/4765
Target Concept: http://data.europa.eu/ux2/nace2/4789
in scheme: Statistical Classification of Economic Activities in the European Community, Rev. 2.1 (NACE Rev. 2.1)
scope note: 47.65: - retail sale of games and toys, made of all materials - retail sale of party supplies (e.g. masks, party favour (cotillons, jokes, etc.), magic items) - retail sale of toy drones 47.89: - retail sale via stalls and markets of games and toys, made of all materials - retail sale via stalls and markets of party supplies, e.g. masks, party favour (cotillions, jokes, etc.), magic items - retail sale via stalls and markets of toy drones 47.91: - retail sale via mail order houses or via Internet of games and toys, made of all materials - retail sale via mail order houses or via Internet of party supplies, e.g. masks, party favour (cotillions, jokes, etc.), magic items - retail sale via mail order houses or via Internet of toy drones 47.99: - retail sale not in stores, stalls or markets of games and toys, made of all materials - retail sale not in stores, stalls or markets of party supplies, e.g. masks, party favour (cotillions, jokes, etc.), magic items - retail sale not in stores, stalls or markets of toy drones
top concept of: Statistical Classification of Economic Activities in the European Community, Rev. 2.1 (NACE Rev. 2.1)
Mapping Cardinality: n m

ConceptNoneRandom0.195744484484762
type: ConceptAssociation
description: NACE Rev. 2.1 group 18.2 is mapped to NACE Rev. 2 group 18.2
Type: 1:1
Source Concept: Reproduction of recorded media
Target Concept: http://data.europa.eu/ux2/nace2/182
in scheme: Statistical Classification of Economic Activities in the European Community, Rev. 2.1 (NACE Rev. 2.1)
top concept of: Statistical Classification of Economic Activities in the European Community, Rev. 2.1 (NACE Rev. 2.1)
Mapping Cardinality: 1 1

ConceptNoneRandom0.8472220829659429
type: ConceptAssociation
description: NACE Rev. 2.1 class 01.42 is mapped to NACE Rev. 2 class 01.42
Type: 2:2
Source Concept: Raising of other cattle and buffaloes
Target Concept: http://data.europa.eu/ux2/nace2/0142
in scheme: Statistical Classification of Economic Activities in the European Community, Rev. 2.1 (NACE Rev. 2.1)
scope note: the content of the NACE Rev 2.1 class is fully covered in the corresponding NACE Rev 2 class
top concept of: Statistical Classification of Economic Activities in the European Community, Rev. 2.1 (NACE Rev. 2.1)
Mapping Cardinality: n m

ConceptNoneRandom0.9011512691494658
type: ConceptAssociation
description: NACE Rev. 2.1 class 23.65 is mapped to NACE Rev. 2 class 23.65
Type: 1:1
Source Concept: Manufacture of fibre cement
Target Concept: http://data.europa.eu/ux2/nace2/2365
in scheme: Statistical Classification of Economic Activities in the European Community, Rev. 2.1 (NACE Rev. 2.1)
scope note: the content of the NACE Rev 2.1 class is fully covered in the corresponding NACE Rev 2 class
top concept of: Statistical Classification of Economic Activities in the European Community, Rev. 2.1 (NACE Rev. 2.1)
Mapping Cardinality: 1 1

Central banking
type: Concept
Additional Content Note: This class also includes: - activities of central banks, currency boards and central monetary agencies
CoreContentNote: This class includes: - issuing and managing banknotes and digital currency - conducting monetary policy, including monitoring and control of the money supply - promoting financial stability - taking deposits that are used for clearance between monetary intermediaries - supervising banking or non-banking monetary operations, unless performed by some other entity - holding the country’s international reserves - acting as banker to the government
Exclusion Note: This class excludes: - operation and supervision of financial markets other than by central banks and public authorities, see 66.11 - financial supervisory activities for insurance and pension funding (not by the central bank), see 66.29 - financial regulation relating to the conduct of business and consumer protection and other wider financial regulatory activities, see 84.13 - activities of international organisations (e.g. the World Bank), see 99.00
broader: Monetary intermediation
in scheme: Statistical Classification of Economic Activities in the European Community, Rev. 2.1 (NACE Rev. 2.1)
Notation: 64.11
top concept of: Statistical Classification of Economic Activities in the European Community, Rev. 2.1 (NACE Rev. 2.1)

Social work activities without accommodation for older persons or persons with disabilities
type: Concept
broader: Social work activities without accommodation
in scheme: Statistical Classification of Economic Activities in the European Community, Rev. 2.1 (NACE Rev. 2.1)
Notation: 88.1
top concept of: Statistical Classification of Economic Activities in the European Community, Rev. 2.1 (NACE Rev. 2.1)

ConceptNoneRandom0.11074237233809892
type: ConceptAssociation
description: NACE Rev. 2.1 group 84.2 is mapped to NACE Rev. 2 groups 84.2, 93.2
Type: 5:5
Source Concept: Provision of services to the community as a whole
Target Concept: http://data.europa.eu/ux2/nace2/932
Target Concept: http://data.europa.eu/ux2/nace2/842
in scheme: Statistical Classification of Economic Activities in the European Community, Rev. 2.1 (NACE Rev. 2.1)
top concept of: Statistical Classification of Economic Activities in the European Community, Rev. 2.1 (NACE Rev. 2.1)
Mapping Cardinality: n m

Manufacture of refractory products
type: Concept
Additional Content Note: This class also includes: - manufacture of refractory articles containing magnesium oxide, calcium magnesium oxide or chromite
CoreContentNote: This class includes: - manufacture of intermediate products from mined or quarried non-metallic minerals (e.g. gravel, stone or clay) - manufacture of refractory mortars, concretes, etc. - manufacture of refractory ceramic goods, e.g.: • heat-insulating ceramic goods of siliceous fossil meals • refractory bricks, blocks and tiles, etc. • retorts, crucibles, muffles, nozzles, tubes, pipes, etc.
broader: Manufacture of refractory products
in scheme: Statistical Classification of Economic Activities in the European Community, Rev. 2.1 (NACE Rev. 2.1)
Notation: 23.20
top concept of: Statistical Classification of Economic Activities in the European Community, Rev. 2.1 (NACE Rev. 2.1)

PUBLISHING, BROADCASTING, AND CONTENT PRODUCTION AND DISTRIBUTION ACTIVITIES
type: Concept
Additional Content Note: This section also includes: - the creation and leasing of copyrights for published content
CoreContentNote: This section includes the production and publishing, broadcasting and other distribution of information products. This section includes: book, newspaper, periodical and software publishing activities (division 58); the production of motion picture, video and television programme elements , sound recording and music publishing activities (division 59); radio and television broadcasting as well as television or radio programme production and distribution activities, including the operation of streaming, downloads and content distribution (sharing) platforms not associated with publishing of the content, the operation of blogs and wiki sites, social network sites and online gaming / video game sites (division 60). Publishing refers to the acquisition of copyrights to content (information products) and making this content available to the general public by engaging in (or arranging for) the reproduction and distribution of this content in various forms. Publishers may solely publish and then license rights to others to distribute their content, or they may publish and distribute content they create or own. All the feasible forms of publishing (in print, electronic, digital, analogue, or any other form) and self-publishing activities are included in this section. Individual television programming components (for example, movies, television series) are produced by activities in division 59, while the creation of a complete programme for a television channel, from components produced in division 59 or other components (for example, live news programming), is included in division 60. Division 60 also includes the broadcasting of this programme by the producer.
Exclusion Note: This section excludes: - wholesale and retail sale of recorded media, see section G - activities of providing telecommunication and related service activities, i.e. transmitting voice, data, text, sound and video, computer programming activities, computing infrastructure and hosting activities, and web search portals, see section K - provision of financial and insurance services using published financial and insurance technologies software, see section L - the management of copyrights, see 74.91 - rental of discs, see 77.22 - activities of independent musicians and actors (including influencers appearing in vlogs), writers and bloggers, whose content is published by a third party, and gambling sites, see section S
in scheme: Statistical Classification of Economic Activities in the European Community, Rev. 2.1 (NACE Rev. 2.1)
Notation: J
top concept of: Statistical Classification of Economic Activities in the European Community, Rev. 2.1 (NACE Rev. 2.1)

ConceptNoneRandom0.7490303571309992
type: ConceptAssociation
description: NACE Rev. 2.1 class 32.12 is mapped to NACE Rev. 2 class 32.12
Type: 1:1
Source Concept: Manufacture of jewellery and related articles
Target Concept: http://data.europa.eu/ux2/nace2/3212
in scheme: Statistical Classification of Economic Activities in the European Community, Rev. 2.1 (NACE Rev. 2.1)
scope note: the content of the NACE Rev 2.1 class is fully covered in the corresponding NACE Rev 2 class
top concept of: Statistical Classification of Economic Activities in the European Community, Rev. 2.1 (NACE Rev. 2.1)
Mapping Cardinality: 1 1

Fund management activities
type: Concept
broader: Activities auxiliary to financial services and insurance activities
in scheme: Statistical Classification of Economic Activities in the European Community, Rev. 2.1 (NACE Rev. 2.1)
Notation: 66.3
top concept of: Statistical Classification of Economic Activities in the European Community, Rev. 2.1 (NACE Rev. 2.1)

Casting of light metals
type: Concept
Additional Content Note: This class also includes: - casting of dental implements, etc., of light metals
CoreContentNote: This class includes: - activities of foundries of light metal - manufacture of castings made of aluminium - manufacture of castings made of magnesium - manufacture of castings made of titanium
Exclusion Note: This class excludes: - casting of metals not considered light metals, see 24.51, 24.52, 24.54
broader: Casting of metals
in scheme: Statistical Classification of Economic Activities in the European Community, Rev. 2.1 (NACE Rev. 2.1)
Notation: 24.53
top concept of: Statistical Classification of Economic Activities in the European Community, Rev. 2.1 (NACE Rev. 2.1)

Repair and maintenance of personal and household goods n.e.c.
type: Concept
Additional Content Note: This class also includes: - ‘while-you-wait’ engraving
CoreContentNote: This class includes the repair and maintenance of personal and household goods: - repair and maintenance of bicycles, electric bicycles, monowheels, hoverboards, kickscooters - repair and alteration of clothing - repair of sports goods (except sporting guns) and camping equipment - repair of books - repair of non-historical musical instruments - repair of toys and similar articles - repair of other personal and household goods - piano tuning - knife sharpening - key cutting activities
Exclusion Note: This class excludes: - industrial engraving of metals, see 25.53 - repair of sporting and recreational guns, 33.11 - repair of handheld power tools, see 33.12 - locksmith activities, see 80.09
broader: Repair and maintenance of personal and household goods
in scheme: Statistical Classification of Economic Activities in the European Community, Rev. 2.1 (NACE Rev. 2.1)
Notation: 95.29
top concept of: Statistical Classification of Economic Activities in the European Community, Rev. 2.1 (NACE Rev. 2.1)

Social work activities without accommodation
type: Concept
CoreContentNote: This division includes the provision of a variety of social assistance services directly to clients. The activities in this division do not include accommodation services, except on a temporary basis.
broader: HUMAN HEALTH AND SOCIAL WORK ACTIVITIES
in scheme: Statistical Classification of Economic Activities in the European Community, Rev. 2.1 (NACE Rev. 2.1)
Notation: 88
top concept of: Statistical Classification of Economic Activities in the European Community, Rev. 2.1 (NACE Rev. 2.1)

ConceptNoneRandom0.45564334533292605
type: ConceptAssociation
description: NACE Rev. 2.1 section F is mapped to NACE Rev. 2 sections F, N
Type: 18:17
Source Concept: CONSTRUCTION
Target Concept: http://data.europa.eu/ux2/nace2/F
Target Concept: http://data.europa.eu/ux2/nace2/N
in scheme: Statistical Classification of Economic Activities in the European Community, Rev. 2.1 (NACE Rev. 2.1)
top concept of: Statistical Classification of Economic Activities in the European Community, Rev. 2.1 (NACE Rev. 2.1)
Mapping Cardinality: n m

Raising of dairy cattle
type: Concept
CoreContentNote: This class includes: - raising and breeding of dairy cattle and/or buffaloes - production of raw milk from cows or buffaloes - production of bovine semen of dairy breeds
Exclusion Note: This class excludes: - processing of milk, see 10.51
broader: Animal production
in scheme: Statistical Classification of Economic Activities in the European Community, Rev. 2.1 (NACE Rev. 2.1)
Notation: 01.41
top concept of: Statistical Classification of Economic Activities in the European Community, Rev. 2.1 (NACE Rev. 2.1)

ConceptNoneRandom0.06807317331777474
type: ConceptAssociation
description: NACE Rev. 2.1 class 47.61 is mapped to NACE Rev. 2 classes 47.61, 47.89, 47.91, 47.99
Type: 78:65
Source Concept: Retail sale of books
Target Concept: http://data.europa.eu/ux2/nace2/4791
Target Concept: http://data.europa.eu/ux2/nace2/4799
Target Concept: http://data.europa.eu/ux2/nace2/4789
Target Concept: http://data.europa.eu/ux2/nace2/4761
in scheme: Statistical Classification of Economic Activities in the European Community, Rev. 2.1 (NACE Rev. 2.1)
scope note: 47.61: - retail sale of books, including audio books on physical media 47.89: - retail sale via stalls and markets of books, including audio books on physical media 47.91: - retail sale via mail order houses or via Internet of books, including audio books on physical media 47.99: - retail sale not in stores, stalls or markets of books, including audio books on physical media
top concept of: Statistical Classification of Economic Activities in the European Community, Rev. 2.1 (NACE Rev. 2.1)
Mapping Cardinality: n m

ConceptNoneRandom0.8783853635284905
type: ConceptAssociation
description: NACE Rev. 2.1 class 20.17 is mapped to NACE Rev. 2 class 20.17
Type: 1:1
Source Concept: Manufacture of synthetic rubber in primary forms
Target Concept: http://data.europa.eu/ux2/nace2/2017
in scheme: Statistical Classification of Economic Activities in the European Community, Rev. 2.1 (NACE Rev. 2.1)
scope note: the content of the NACE Rev 2.1 class is fully covered in the corresponding NACE Rev 2 class
top concept of: Statistical Classification of Economic Activities in the European Community, Rev. 2.1 (NACE Rev. 2.1)
Mapping Cardinality: 1 1

ConceptNoneRandom0.7923203292211608
type: ConceptAssociation
description: NACE Rev. 2.1 class 23.66 is mapped to NACE Rev. 2 classes 22.23, 23.69
Type: 17:12
Source Concept: Manufacture of other articles of concrete, cement and plaster
Target Concept: http://data.europa.eu/ux2/nace2/2223
Target Concept: http://data.europa.eu/ux2/nace2/2369
in scheme: Statistical Classification of Economic Activities in the European Community, Rev. 2.1 (NACE Rev. 2.1)
scope note: 22.23: - manufacture of artificial stone (e.g. cultured marble) 23.69: - manufacture of other articles of concrete, plaster or of compositions based on plaster, cement or artificial stone, e.g. statuary, bas- and haut-reliefs, vases, flowerpots - manufacture of ornamented boards or panels of plaster or of compositions based on plaster - other articles of calcium silicate - other articles of autoclaved aerated concrete
top concept of: Statistical Classification of Economic Activities in the European Community, Rev. 2.1 (NACE Rev. 2.1)
Mapping Cardinality: n m

Residential care activities for persons living with or having a diagnosis of a mental illness or substance abuse
type: Concept
CoreContentNote: This class includes the provision of residential care (but not licensed hospital care), protective supervision and counselling to persons living with or having a diagnosis of a mental illness, intellectual disability or substance abuse, irrespective of their age. This class includes activities of: - facilities for the treatment of substance abuse - mental health convalescent homes - residential group homes for the emotionally disturbed - mental health halfway houses - assisted living facilities for persons having a diagnosis of intellectual disability
Exclusion Note: This class excludes: - mental health hospitals, see 86.10 - provision of residential nursing care and rehabilitative services for individuals other than those living with or having a diagnosis of a mental illness, see 87.10, 87.30 - social work activities with accommodation (e.g. temporary homeless shelters), see 87.99 - non-residential care activities for persons living with or having a diagnosis of a mental illness (e.g. mental healthcare centres), see division 88
broader: Residential care activities for persons living with or having a diagnosis of a mental illness or substance abuse
in scheme: Statistical Classification of Economic Activities in the European Community, Rev. 2.1 (NACE Rev. 2.1)
Notation: 87.20
top concept of: Statistical Classification of Economic Activities in the European Community, Rev. 2.1 (NACE Rev. 2.1)

ConceptNoneRandom0.6704500310080378
type: ConceptAssociation
description: NACE Rev. 2.1 class 24.51 is mapped to NACE Rev. 2 class 24.51
Type: 1:1
Source Concept: Casting of iron
Target Concept: http://data.europa.eu/ux2/nace2/2451
in scheme: Statistical Classification of Economic Activities in the European Community, Rev. 2.1 (NACE Rev. 2.1)
scope note: the content of the NACE Rev 2.1 class is fully covered in the corresponding NACE Rev 2 class
top concept of: Statistical Classification of Economic Activities in the European Community, Rev. 2.1 (NACE Rev. 2.1)
Mapping Cardinality: 1 1

ConceptNoneRandom0.3486321897624495
type: ConceptAssociation
description: NACE Rev. 2.1 class 64.19 is mapped to NACE Rev. 2 class 64.19
Type: 1:1
Source Concept: Other monetary intermediation
Target Concept: http://data.europa.eu/ux2/nace2/6419
in scheme: Statistical Classification of Economic Activities in the European Community, Rev. 2.1 (NACE Rev. 2.1)
scope note: the content of the NACE Rev 2.1 class is fully covered in the corresponding NACE Rev 2 class
top concept of: Statistical Classification of Economic Activities in the European Community, Rev. 2.1 (NACE Rev. 2.1)
Mapping Cardinality: 1 1

ConceptNoneRandom0.4295405355340275
type: ConceptAssociation
description: NACE Rev. 2.1 class 01.41 is mapped to NACE Rev. 2 classes 01.41, 01.42
Type: 2:2
Source Concept: Raising of dairy cattle
Target Concept: http://data.europa.eu/ux2/nace2/0141
Target Concept: http://data.europa.eu/ux2/nace2/0142
in scheme: Statistical Classification of Economic Activities in the European Community, Rev. 2.1 (NACE Rev. 2.1)
scope note: 01.41: - raising and breeding of dairy cattle and/or buffaloes - production of raw milk from cows or buffaloes 01.42: - production of bovine semen of dairy breeds
top concept of: Statistical Classification of Economic Activities in the European Community, Rev. 2.1 (NACE Rev. 2.1)
Mapping Cardinality: n m

Manufacture of optical instruments, magnetic and optical media and photographic equipment
type: Concept
CoreContentNote: This class includes the manufacture of optical instruments and lenses (for example, binoculars, microscopes (except electron, proton), telescopes, prisms, lenses (except ophthalmic)); the coating or polishing of lenses (except ophthalmic); the mounting of lenses (except ophthalmic); the manufacture of photographic equipment (for example, cameras and the manufacture of light meters). This class includes: - manufacture of optical mirrors - manufacture of optical gun-sighting equipment - manufacture of optical positioning equipment - manufacture of optical magnifying instruments - manufacture of optical machinist’s precision tools - manufacture of optical comparators - manufacture of film cameras and digital cameras - manufacture of motion picture and slide projectors - manufacture of overhead transparency projectors - manufacture of optical measuring and checking devices and instruments (e.g. fire control equipment, photographic light meters, rangefinders) - manufacture of lenses, optical microscopes, binoculars and telescopes - manufacture of objective lenses for cameras, projectors or photographic enlargers or reducers - manufacture of laser assemblies - manufacture of unrecorded magnetic audio and videotapes - manufacture of unrecorded optical disks
Exclusion Note: This class excludes: - reproduction of recorded media (computer media, sound, video, etc.), see 18.20 - manufacture of computer projectors, see 26.20 - manufacture of television studio and broadcasting equipment, including television cameras, see 26.30 - manufacture of household-type video cameras, see 26.40 - manufacture of fire alarms, see 26.51 - manufacture of complete equipment using laser components, see manufacturing class by type of machinery (e.g. medical laser equipment), see 26.60 - manufacture of photocopy machines, see 28.23 - manufacture of ophthalmic goods, see 32.50
broader: Manufacture of optical instruments, magnetic and optical media and photographic equipment
in scheme: Statistical Classification of Economic Activities in the European Community, Rev. 2.1 (NACE Rev. 2.1)
Notation: 26.70
top concept of: Statistical Classification of Economic Activities in the European Community, Rev. 2.1 (NACE Rev. 2.1)

ConceptNoneRandom0.19086138292468402
type: ConceptAssociation
description: NACE Rev. 2.1 group 84.3 is mapped to NACE Rev. 2 group 84.3
Type: 1:1
Source Concept: Compulsory social security activities
Target Concept: http://data.europa.eu/ux2/nace2/843
in scheme: Statistical Classification of Economic Activities in the European Community, Rev. 2.1 (NACE Rev. 2.1)
top concept of: Statistical Classification of Economic Activities in the European Community, Rev. 2.1 (NACE Rev. 2.1)
Mapping Cardinality: 1 1

Casting of steel
type: Concept
CoreContentNote: This class includes: - manufacture of castings made of alloy or common steel castings - manufacture of castings made of carbon or commercial steel castings - manufacture of castings made of alloy and high alloy castings - manufacture of castings made of stainless-steel castings
broader: Casting of metals
in scheme: Statistical Classification of Economic Activities in the European Community, Rev. 2.1 (NACE Rev. 2.1)
Notation: 24.52
top concept of: Statistical Classification of Economic Activities in the European Community, Rev. 2.1 (NACE Rev. 2.1)

TELECOMMUNICATION, COMPUTER PROGRAMMING, CONSULTING, COMPUTING INFRASTRUCTURE AND OTHER INFORMATION SERVICE ACTIVITIES
type: Concept
CoreContentNote: This section includes telecommunication and related service activities, in other words, transmitting voice, data, text, sound and video (division 61), computer programming, consultancy and related activities (division 62), and the provision of computing infrastructure, data processing, hosting and other information service activities (division 63).
Exclusion Note: This section excludes: - publishing, broadcasting and content production, including software publishing, post-production services to convert audio and video content into streaming formats and independent third-party provision of on-demand audio and video streaming or download distribution services, see section J - provision of financial and insurance services using published financial and insurance technologies software, see section L - activities of gambling sites, see 92.00 - repair and maintenance of computers and communication equipment, see 95.10
in scheme: Statistical Classification of Economic Activities in the European Community, Rev. 2.1 (NACE Rev. 2.1)
Notation: K
top concept of: Statistical Classification of Economic Activities in the European Community, Rev. 2.1 (NACE Rev. 2.1)

Postal activities under universal service obligation
type: Concept
broader: Postal and courier activities
in scheme: Statistical Classification of Economic Activities in the European Community, Rev. 2.1 (NACE Rev. 2.1)
Notation: 53.1
top concept of: Statistical Classification of Economic Activities in the European Community, Rev. 2.1 (NACE Rev. 2.1)

Manufacture of plastics in primary forms
type: Concept
Additional Content Note: This class also includes: - manufacture of cellulose and its chemical derivatives - manufacture of plastic powders, granules or flakes by compounding or transforming plastic resins from recovered plastic waste - manufacture of recycled plastic in flakes or plastic granulates based on pretreated plastic waste following material recovery operations
CoreContentNote: This class includes the manufacture of resins, plastic materials and non-vulcanisable thermoplastic elastomers, the mixing and blending of resins on a custom basis, as well as the manufacture of non-customised synthetic resins. This class includes: - manufacture of plastics in primary forms: • polymers, including those of ethylene, propylene, styrene, vinyl chloride, vinyl acetate and acrylics • polyamides • phenolic and epoxide resins and polyurethanes • alkyd and polyester resins and polyethers • ion exchangers based on polymers - manufacture of silicones in primary forms - plastic compounding activities
Exclusion Note: This class excludes: - manufacture of artificial and synthetic fibres, filaments and yarn, see 20.60 - processing, shredding, cleaning, grinding of plastic waste, see 38.21
broader: Manufacture of basic chemicals, fertilisers and nitrogen compounds, plastics and synthetic rubber in primary forms
in scheme: Statistical Classification of Economic Activities in the European Community, Rev. 2.1 (NACE Rev. 2.1)
Notation: 20.16
top concept of: Statistical Classification of Economic Activities in the European Community, Rev. 2.1 (NACE Rev. 2.1)

Construction of residential and non-residential buildings
type: Concept
Additional Content Note: This class also includes: - complete remodelling or renovating of existing residential or non-residential buildings involving several specialised construction activities - construction of air-supported buildings (e.g. air domes)
CoreContentNote: This class includes the construction of complete residential or non-residential buildings, as well as additions and alterations. Outsourcing parts or the whole construction process is possible. If only specialised parts of the construction process are carried out, the activity is classified in division 43. This class includes: - construction of all types of buildings: • residential buildings • buildings for industrial production (e.g. factories, workshops) • hospital, school and office buildings • hotel, store, shopping centre and restaurant buildings • airport buildings • indoor sports facilities • parking garages, including underground parking garages • warehouse buildings • religious buildings - erection of prefabricated buildings requiring on-site assembly
Exclusion Note: This class excludes: - construction of industrial facilities, except buildings, see 42.99 - development of building projects, for later sale, see 68.12 - architectural and engineering activities, see 71.1 - project management for construction, see 71.1
broader: Construction of residential and non-residential buildings
in scheme: Statistical Classification of Economic Activities in the European Community, Rev. 2.1 (NACE Rev. 2.1)
Notation: 41.00
top concept of: Statistical Classification of Economic Activities in the European Community, Rev. 2.1 (NACE Rev. 2.1)

ConceptNoneRandom0.07131958264132199
type: ConceptAssociation
description: NACE Rev. 2.1 class 32.13 is mapped to NACE Rev. 2 class 32.13
Type: 1:1
Source Concept: Manufacture of imitation jewellery and related articles
Target Concept: http://data.europa.eu/ux2/nace2/3213
in scheme: Statistical Classification of Economic Activities in the European Community, Rev. 2.1 (NACE Rev. 2.1)
scope note: the content of the NACE Rev 2.1 class is fully covered in the corresponding NACE Rev 2 class
top concept of: Statistical Classification of Economic Activities in the European Community, Rev. 2.1 (NACE Rev. 2.1)
Mapping Cardinality: 1 1

Manufacture of synthetic rubber in primary forms
type: Concept
CoreContentNote: This class includes: - manufacture of synthetic rubber in primary forms: • synthetic rubber • factice - manufacture of mixtures of synthetic rubber and natural rubber or rubber-like gums (e.g. balata)
Exclusion Note: This class excludes: - sorting, shredding, cleaning, grinding and pelletising of rubber waste, see 38.21
broader: Manufacture of basic chemicals, fertilisers and nitrogen compounds, plastics and synthetic rubber in primary forms
in scheme: Statistical Classification of Economic Activities in the European Community, Rev. 2.1 (NACE Rev. 2.1)
Notation: 20.17
top concept of: Statistical Classification of Economic Activities in the European Community, Rev. 2.1 (NACE Rev. 2.1)

ConceptNoneRandom0.05649792344578353
type: ConceptAssociation
description: NACE Rev. 2.1 section E is mapped to NACE Rev. 2 section E
Type: 18:17
Source Concept: WATER SUPPLY; SEWERAGE, WASTE MANAGEMENT AND REMEDIATION ACTIVITIES
Target Concept: http://data.europa.eu/ux2/nace2/E
in scheme: Statistical Classification of Economic Activities in the European Community, Rev. 2.1 (NACE Rev. 2.1)
top concept of: Statistical Classification of Economic Activities in the European Community, Rev. 2.1 (NACE Rev. 2.1)
Mapping Cardinality: n m

Raising of other cattle and buffaloes
type: Concept
Additional Content Note: This class also includes: - raising and breeding of draft cattle or buffaloes - raising and breeding of fighting bulls
CoreContentNote: This class includes: - raising and breeding of cattle and buffaloes for meat - production of bovine semen of meat breeds
broader: Animal production
in scheme: Statistical Classification of Economic Activities in the European Community, Rev. 2.1 (NACE Rev. 2.1)
Notation: 01.42
top concept of: Statistical Classification of Economic Activities in the European Community, Rev. 2.1 (NACE Rev. 2.1)

Construction of residential and non-residential buildings
type: Concept
CoreContentNote: This division includes general construction of buildings of all types and sizes. It includes construction, repair, additions and alterations as well as the erection of prefabricated buildings on site and those of a temporary nature. Further included is the construction of entire buildings (for example, homes, offices, stores as well as utility buildings or farm buildings).
broader: CONSTRUCTION
in scheme: Statistical Classification of Economic Activities in the European Community, Rev. 2.1 (NACE Rev. 2.1)
Notation: 41
top concept of: Statistical Classification of Economic Activities in the European Community, Rev. 2.1 (NACE Rev. 2.1)

Activities of households as employers of domestic personnel
type: Concept
CoreContentNote: This class includes households’ employment of domestic personnel (for example, cooks, cleaners, gardeners, chauffeurs, caretakers, babysitters, personal assistants). This allows the employed domestic personnel to state the activity of their employer in censuses or studies, even though the employer is an individual. The product produced by this activity is consumed by the employing household.
Exclusion Note: This class excludes: - provision of personal and household services (e.g. cleaning, ironing, cooking, gardening, homecare services for dependents) by service providers (for-profit, not-for-profit, public organisations or self-employed), see the appropriate NACE class according to the service provided
broader: Activities of households as employers of domestic personnel
in scheme: Statistical Classification of Economic Activities in the European Community, Rev. 2.1 (NACE Rev. 2.1)
Notation: 97.00
top concept of: Statistical Classification of Economic Activities in the European Community, Rev. 2.1 (NACE Rev. 2.1)

ConceptNoneRandom0.363610172983719
type: ConceptAssociation
description: NACE Rev. 2.1 class 47.62 is mapped to NACE Rev. 2 classes 47.62, 47.89, 47.91, 47.99
Type: 78:65
Source Concept: Retail sale of newspapers, and other periodical publications and stationery
Target Concept: http://data.europa.eu/ux2/nace2/4791
Target Concept: http://data.europa.eu/ux2/nace2/4799
Target Concept: http://data.europa.eu/ux2/nace2/4789
Target Concept: http://data.europa.eu/ux2/nace2/4762
in scheme: Statistical Classification of Economic Activities in the European Community, Rev. 2.1 (NACE Rev. 2.1)
scope note: 47.62: - retail sale of newspapers, periodicals and journals - retail sale of stationery, office and school supplies, e.g. pens, pencils, paper 47.89: - retail sale via stalls and markets of periodicals and journals - retail sale via stalls and markets of stationery, office and school supplies, e.g. pens, pencils, paper 47.91: - retail sale via mail order houses or via Internet of periodicals and journals - retail sale via mail order houses or via Internet of stationery, office and school supplies, e.g. pens, pencils, paper 47.99: - retail sale not in stores, stalls or markets of periodicals and journals - retail sale not in stores, stalls or markets of stationery, office and school supplies, e.g. pens, pencils, paper
top concept of: Statistical Classification of Economic Activities in the European Community, Rev. 2.1 (NACE Rev. 2.1)
Mapping Cardinality: n m

ConceptNoneRandom0.30144799832047864
type: ConceptAssociation
description: NACE Rev. 2.1 class 81.10 is mapped to NACE Rev. 2 class 81.10
Type: 1:1
Source Concept: Combined facilities support activities
Target Concept: http://data.europa.eu/ux2/nace2/8110
in scheme: Statistical Classification of Economic Activities in the European Community, Rev. 2.1 (NACE Rev. 2.1)
scope note: the content of the NACE Rev 2.1 class is fully covered in the corresponding NACE Rev 2 class
top concept of: Statistical Classification of Economic Activities in the European Community, Rev. 2.1 (NACE Rev. 2.1)
Mapping Cardinality: 1 1

ConceptNoneRandom0.6869760671810172
type: ConceptAssociation
description: NACE Rev. 2.1 class 46.35 is mapped to NACE Rev. 2 class 46.35
Type: 1:1
Source Concept: Wholesale of tobacco products
Target Concept: http://data.europa.eu/ux2/nace2/4635
in scheme: Statistical Classification of Economic Activities in the European Community, Rev. 2.1 (NACE Rev. 2.1)
scope note: the content of the NACE Rev 2.1 class is fully covered in the corresponding NACE Rev 2 class
top concept of: Statistical Classification of Economic Activities in the European Community, Rev. 2.1 (NACE Rev. 2.1)
Mapping Cardinality: 1 1

Social work activities without accommodation for older persons or persons with disabilities
type: Concept
Additional Content Note: This class also includes: - activities of caregivers (home assistance) - homecare services - home assistance services, such as to carry out domestic tasks, rendered to persons having a diagnosis of temporary medical impairment
CoreContentNote: This class includes: - social, counselling, welfare, referral and similar services which are aimed at older persons or persons with disabilities in their homes or elsewhere and carried out by government offices or by private organisations, national or local self-help organisations and by specialists providing counselling services: • visiting older persons and persons with disabilities • day-care activities for older persons or adults with disabilities • home assistance services for older persons or persons with disabilities • vocational rehabilitation and habilitation activities for persons with physical disabilities where the education component is limited
Exclusion Note: This class excludes: - funding and administration of compulsory social security programmes, see 84.30 - activities similar to those described in this class, but including accommodation, see 87.30 - day-care activities for children with disabilities, see 88.91
broader: Social work activities without accommodation for older persons or persons with disabilities
in scheme: Statistical Classification of Economic Activities in the European Community, Rev. 2.1 (NACE Rev. 2.1)
Notation: 88.10
top concept of: Statistical Classification of Economic Activities in the European Community, Rev. 2.1 (NACE Rev. 2.1)

ELECTRICITY, GAS, STEAM AND AIR CONDITIONING SUPPLY
type: Concept
Additional Content Note: The section also includes heating and cooling (for example, steam and air conditioning supply) through a permanent network.
CoreContentNote: This section includes the generation, storage, control, distribution, trade and brokerage of electric power or of gaseous fuels for energy supply through a permanent network of lines, mains and pipes. Energy supply for industrial parks or residential buildings is included. This section therefore includes the operation of electricity and gas utilities.
Exclusion Note: This section excludes: - extraction of crude natural gas, see 06.20 - water supply and sewerage, see divisions 36, 37 - transport of gas through pipelines, i.e. not through the distribution network, see 49.50
in scheme: Statistical Classification of Economic Activities in the European Community, Rev. 2.1 (NACE Rev. 2.1)
Notation: D
top concept of: Statistical Classification of Economic Activities in the European Community, Rev. 2.1 (NACE Rev. 2.1)

ConceptNoneRandom0.8453442129828934
type: ConceptAssociation
description: NACE Rev. 2.1 class 28.92 is mapped to NACE Rev. 2 class 28.92
Type: 2:2
Source Concept: Manufacture of machinery for mining, quarrying and construction
Target Concept: http://data.europa.eu/ux2/nace2/2892
in scheme: Statistical Classification of Economic Activities in the European Community, Rev. 2.1 (NACE Rev. 2.1)
scope note: the content of the NACE Rev 2.1 class is fully covered in the corresponding NACE Rev 2 class
top concept of: Statistical Classification of Economic Activities in the European Community, Rev. 2.1 (NACE Rev. 2.1)
Mapping Cardinality: n m

ConceptNoneRandom0.7161413074703349
type: ConceptAssociation
description: NACE Rev. 2.1 class 01.44 is mapped to NACE Rev. 2 class 01.44
Type: 1:1
Source Concept: Raising of camels and camelids
Target Concept: http://data.europa.eu/ux2/nace2/0144
in scheme: Statistical Classification of Economic Activities in the European Community, Rev. 2.1 (NACE Rev. 2.1)
scope note: the content of the NACE Rev 2.1 class is fully covered in the corresponding NACE Rev 2 class
top concept of: Statistical Classification of Economic Activities in the European Community, Rev. 2.1 (NACE Rev. 2.1)
Mapping Cardinality: 1 1

Casting of iron
type: Concept
CoreContentNote: This class includes activities of iron foundries. This class includes: - manufacture of castings made of grey iron castings - manufacture of castings made of ductile iron castings (including casting of spheroidal graphite iron castings and malleable iron castings) - manufacture of castings made of other special iron alloys castings
broader: Casting of metals
in scheme: Statistical Classification of Economic Activities in the European Community, Rev. 2.1 (NACE Rev. 2.1)
Notation: 24.51
top concept of: Statistical Classification of Economic Activities in the European Community, Rev. 2.1 (NACE Rev. 2.1)

ConceptNoneRandom0.2070139180362086
type: ConceptAssociation
description: NACE Rev. 2.1 group 80.0 is mapped to NACE Rev. 2 groups 74.9, 80.1, 80.2, 80.3
Type: 2:4
Source Concept: Investigation and security activities
Target Concept: http://data.europa.eu/ux2/nace2/801
Target Concept: http://data.europa.eu/ux2/nace2/803
Target Concept: http://data.europa.eu/ux2/nace2/802
Target Concept: http://data.europa.eu/ux2/nace2/749
in scheme: Statistical Classification of Economic Activities in the European Community, Rev. 2.1 (NACE Rev. 2.1)
top concept of: Statistical Classification of Economic Activities in the European Community, Rev. 2.1 (NACE Rev. 2.1)
Mapping Cardinality: n m

Activities auxiliary to financial services, except insurance and pension funding
type: Concept
CoreContentNote: This group includes the furnishing of physical or electronic marketplaces for the purpose of facilitating the buying and selling of stocks, stock options, bonds or commodity contracts, and trading of crypto-assets with liabilities. It also includes other miscellaneous services, including the provision of financial advisory services, asset management or the provision of equity and debt-based crowdfunding.
broader: Activities auxiliary to financial services and insurance activities
in scheme: Statistical Classification of Economic Activities in the European Community, Rev. 2.1 (NACE Rev. 2.1)
Notation: 66.1
top concept of: Statistical Classification of Economic Activities in the European Community, Rev. 2.1 (NACE Rev. 2.1)

Manufacture of fertilisers and nitrogen compounds
type: Concept
Additional Content Note: This class also includes: - manufacture of potting soil mixtures of natural soil, peat, sand, clays and minerals, with nitrogen, phosphorus or potassium as an essential constituent - manufacture of other fertilisers by the mixing or chemical treatment of animal or vegetable products
CoreContentNote: This class includes: - manufacture of fertilisers: • straight or complex nitrogenous, phosphatic or potassic fertilisers • urea, crude natural phosphates and crude natural potassium salts - manufacture of associated nitrogen products: • nitric and sulphonitric acids, ammonia, ammonium chloride, ammonium carbonate, nitrites and nitrates of potassium
Exclusion Note: This class excludes: - mining of guano, see 08.91 - manufacture of agrochemical products (e.g. pesticides), see 20.20 - manufacture of liming agents, see 20.59 - production of waste compost, see 38.21
broader: Manufacture of basic chemicals, fertilisers and nitrogen compounds, plastics and synthetic rubber in primary forms
in scheme: Statistical Classification of Economic Activities in the European Community, Rev. 2.1 (NACE Rev. 2.1)
Notation: 20.15
top concept of: Statistical Classification of Economic Activities in the European Community, Rev. 2.1 (NACE Rev. 2.1)

Manufacture of furniture
type: Concept
broader: Manufacture of furniture
in scheme: Statistical Classification of Economic Activities in the European Community, Rev. 2.1 (NACE Rev. 2.1)
Notation: 31.0
top concept of: Statistical Classification of Economic Activities in the European Community, Rev. 2.1 (NACE Rev. 2.1)

ConceptNoneRandom0.8921199433806866
type: ConceptAssociation
description: NACE Rev. 2.1 class 35.21 is mapped to NACE Rev. 2 class 35.21
Type: 1:1
Source Concept: Manufacture of gas
Target Concept: http://data.europa.eu/ux2/nace2/3521
in scheme: Statistical Classification of Economic Activities in the European Community, Rev. 2.1 (NACE Rev. 2.1)
scope note: the content of the NACE Rev 2.1 class is fully covered in the corresponding NACE Rev 2 class
top concept of: Statistical Classification of Economic Activities in the European Community, Rev. 2.1 (NACE Rev. 2.1)
Mapping Cardinality: 1 1

Manufacture of other articles of concrete, cement and plaster
type: Concept
Additional Content Note: This class also includes: - manufacture of ornamented boards or panels of plaster or of compositions based on plaster - other articles of calcium silicate - other articles of autoclaved aerated concrete
CoreContentNote: This class includes: - manufacture of other articles of concrete, plaster or of compositions based on plaster, cement or artificial stone (e.g. statuary, bas- and haut-reliefs, vases, flowerpots)
Exclusion Note: This class excludes: - manufacture of precast concrete, cement or artificial stone articles for use in construction, see 23.61
broader: Manufacture of articles of concrete, cement and plaster
in scheme: Statistical Classification of Economic Activities in the European Community, Rev. 2.1 (NACE Rev. 2.1)
Notation: 23.66
top concept of: Statistical Classification of Economic Activities in the European Community, Rev. 2.1 (NACE Rev. 2.1)

Manufacture of imitation jewellery and related articles
type: Concept
CoreContentNote: This class includes: - manufacture of costume or imitation jewellery, not incorporating natural or cultured pearls, precious or semi-precious stones or (except as plating or as minor constituents) precious metal or metal clad with precious metal, e.g.: • rings, bracelets, necklaces, brooches, earrings and similar small objects/articles of personal adornment made from base metals plated with precious metals • imitation jewellery containing imitation stones (e.g. imitation gemstones, imitation diamonds, and similar) - manufacture of metal watch bands (except precious metal)
Exclusion Note: This class excludes: - manufacture of jewellery made from precious metals or clad with precious metals, see 32.12 - manufacture of jewellery containing genuine gemstones, see 32.12 - manufacture of precious metal watch bands, see 32.12
broader: Manufacture of jewellery, bijouterie and related articles
in scheme: Statistical Classification of Economic Activities in the European Community, Rev. 2.1 (NACE Rev. 2.1)
Notation: 32.13
top concept of: Statistical Classification of Economic Activities in the European Community, Rev. 2.1 (NACE Rev. 2.1)

ConceptNoneRandom0.11556677236441582
type: ConceptAssociation
description: NACE Rev. 2.1 group 05.2 is mapped to NACE Rev. 2 group 05.2
Type: 1:1
Source Concept: Mining of lignite
Target Concept: http://data.europa.eu/ux2/nace2/052
in scheme: Statistical Classification of Economic Activities in the European Community, Rev. 2.1 (NACE Rev. 2.1)
top concept of: Statistical Classification of Economic Activities in the European Community, Rev. 2.1 (NACE Rev. 2.1)
Mapping Cardinality: 1 1

Office administrative, office support and other business support activities
type: Concept
Additional Content Note: This division also includes all support service activities typically provided to businesses not elsewhere classified.
CoreContentNote: This division includes the provision of a range of day-to-day office administrative services, as well as ongoing routine business support functions for others, on a contract or fee basis.
broader: ADMINISTRATIVE AND SUPPORT SERVICE ACTIVITIES
in scheme: Statistical Classification of Economic Activities in the European Community, Rev. 2.1 (NACE Rev. 2.1)
Notation: 82
top concept of: Statistical Classification of Economic Activities in the European Community, Rev. 2.1 (NACE Rev. 2.1)

ConceptNoneRandom0.1270298513765994
type: ConceptAssociation
description: NACE Rev. 2.1 class 28.93 is mapped to NACE Rev. 2 classes 28.29, 28.93
Type: 2:2
Source Concept: Manufacture of machinery for food, beverage and tobacco processing
Target Concept: http://data.europa.eu/ux2/nace2/2829
Target Concept: http://data.europa.eu/ux2/nace2/2893
in scheme: Statistical Classification of Economic Activities in the European Community, Rev. 2.1 (NACE Rev. 2.1)
scope note: 28.29: - manufacture of machinery for filtering or purifying beverages 28.93: - manufacture of dryers for agricultural products - manufacture of machinery for the dairy industry, e.g.: • cream separators • milk processing machinery, e.g. homogenisers • milk converting machinery, e.g. butter churns, butter workers and moulding machines • cheese-making machines, e.g. homogenisers, moulders, presse - manufacture of machinery for the grain milling industry, e.g.: • machinery to clean, sort or grade seeds, grain or dried leguminous vegetables, e.g. winnowers, sieving belts, separators, grain brushing machines • machinery to produce flour and meal etc., e.g. grinding mills, feeders, sifters, bran cleaners, blenders, rice hullers, pea splitters - manufacture of presses, crushers etc., e.g.to make wine, cider, fruit juices - manufacture of machinery for the bakery industry or for making macaroni, spaghetti or similar products, e.g.: • bakery ovens, dough mixers, dough-dividers, moulders, slicers, cake depositing machines - manufacture of machines and equipment to process diverse foods, e.g.: • machinery to make confectionery, cocoa or chocolate; to manufacture sugar; for breweries; to process meat or poultry, to prepare fruit, nuts or vegetables; to prepare fish, shellfish or other seafood • other machinery for the industrial preparation or manufacture of food or drink - manufacture of machinery for filtering or purifying food - manufacture of machinery for the extraction or preparation of animal or vegetable fats or oils - manufacture of machinery for the preparation of tobacco and for the making of cigarettes or cigars, or for pipe or chewing tobacco or snuff - manufacture of machinery, plant and equipment for cooking or heating food in hotels and restaurants
top concept of: Statistical Classification of Economic Activities in the European Community, Rev. 2.1 (NACE Rev. 2.1)
Mapping Cardinality: n m

ConceptNoneRandom0.744626835890229
type: ConceptAssociation
description: NACE Rev. 2.1 class 01.43 is mapped to NACE Rev. 2 class 01.43
Type: 1:1
Source Concept: Raising of horses and other equines
Target Concept: http://data.europa.eu/ux2/nace2/0143
in scheme: Statistical Classification of Economic Activities in the European Community, Rev. 2.1 (NACE Rev. 2.1)
scope note: the content of the NACE Rev 2.1 class is fully covered in the corresponding NACE Rev 2 class
top concept of: Statistical Classification of Economic Activities in the European Community, Rev. 2.1 (NACE Rev. 2.1)
Mapping Cardinality: 1 1

Fund management activities
type: Concept
Additional Content Note: This class also includes: - activities of asset management on a fee or contract basis - trustee, fiduciary and custody services on a fee or contract basis
CoreContentNote: This class includes portfolio and fund management activities such as making decisions on which investments to purchase or sell, on a fee or contract basis, for individuals, businesses and others, for example: - management of mutual funds - management of other investment funds - management of pension funds
Exclusion Note: This class excludes: - dealing in financial markets on own account, see 64.99 - management of real estate, see division 68 - management of public funds and public debt services, see 84.11
broader: Fund management activities
in scheme: Statistical Classification of Economic Activities in the European Community, Rev. 2.1 (NACE Rev. 2.1)
Notation: 66.30
top concept of: Statistical Classification of Economic Activities in the European Community, Rev. 2.1 (NACE Rev. 2.1)

WATER SUPPLY; SEWERAGE, WASTE MANAGEMENT AND REMEDIATION ACTIVITIES
type: Concept
CoreContentNote: This section includes activities related to the management, collection, pretreatment, recovery and disposal, of various forms of waste (for example, solid or non-solid industrial or household waste) and its organisation. The output of the waste or sewage treatment process can either be disposed of or become an input into other production processes. Secondary raw materials are materials and products which can be used as raw materials by simple reuse, or via recycling and recovery of waste. Activities of water supply are also grouped in this section, since they are often carried out in connection with, or by units also engaged in, the treatment of sewage. The activities also include remediation of contaminated buildings and sites, soil, surface and groundwater (for example, oceans, mangroves, seas), and so on. Units that usually take over their clients’ waste procedures and become the customer of the waste hauler, and then in turn charge their clients for waste services, are classified in division 38. Even if these units do not render the corresponding services themselves, they are responsible for their fulfilment. This activity is regarded as the complete outsourcing of a service.
Exclusion Note: This section excludes: - waste trade activities as agents, see 46.18 - waste trade activities as wholesalers, see 46.87
in scheme: Statistical Classification of Economic Activities in the European Community, Rev. 2.1 (NACE Rev. 2.1)
Notation: E
top concept of: Statistical Classification of Economic Activities in the European Community, Rev. 2.1 (NACE Rev. 2.1)

ConceptNoneRandom0.6884053890926001
type: ConceptAssociation
description: NACE Rev. 2.1 class 47.69 is mapped to NACE Rev. 2 classes 47.59, 47.63, 47.78, 47.89, 47.91, 47.99
Type: 78:65
Source Concept: Retail sale of cultural and recreational goods n.e.c.
Target Concept: http://data.europa.eu/ux2/nace2/4791
Target Concept: http://data.europa.eu/ux2/nace2/4759
Target Concept: http://data.europa.eu/ux2/nace2/4799
Target Concept: http://data.europa.eu/ux2/nace2/4778
Target Concept: http://data.europa.eu/ux2/nace2/4789
Target Concept: http://data.europa.eu/ux2/nace2/4763
in scheme: Statistical Classification of Economic Activities in the European Community, Rev. 2.1 (NACE Rev. 2.1)
scope note: 47.59: - retail sale of musical instruments, scores and related accessories, e.g. strings, music stands, metronomes 47.63: - retail sale of recorded media 47.78: - retail sale of philately, numismatics and collectors’ items, e.g. stamps and coins - activities of commercial art galleries - retail sale of art supplies, including beads, clay, canvasses, oil and water colours etc. 47.89: - retail sale via stalls and markets of recorded media - retail sale via stalls and markets of musical instruments, scores and related accessories, e.g. strings, music stands, metronomes - retail sale via stalls and markets of philately, numismatics and collectors’ items, e.g. stamps and coins - retail sale via stalls and markets of art supplies, including beads, clay, canvasses, oil and water colours etc. 47.91: - retail sale via mail order houses or via Internet of recorded media - retail sale via mail order houses or via Internet of musical instruments, scores and related accessories, e.g. strings, music stands, metronomes - retail sale via mail order houses or via Internet of philately, numismatics and collectors’ items, e.g. stamps and coins - retail sale via mail order houses or via Internet of art supplies, including beads, clay, canvasses, oil and water colours etc. 47.99: - retail sale not in stores, stalls or markets of recorded media - retail sale not in stores, stalls or markets of musical instruments, scores and related accessories, e.g. strings, music stands, metronomes - retail sale not in stores, stalls or markets of philately, numismatics and collectors’ items, e.g. stamps and coins - retail sale not in stores, stalls or markets of art supplies, including beads, clay, canvasses, oil and water colours etc.
top concept of: Statistical Classification of Economic Activities in the European Community, Rev. 2.1 (NACE Rev. 2.1)
Mapping Cardinality: n m

ConceptNoneRandom0.250599447902926
type: ConceptAssociation
description: NACE Rev. 2.1 class 46.36 is mapped to NACE Rev. 2 class 46.36
Type: 1:1
Source Concept: Wholesale of sugar, chocolate and sugar confectionery
Target Concept: http://data.europa.eu/ux2/nace2/4636
in scheme: Statistical Classification of Economic Activities in the European Community, Rev. 2.1 (NACE Rev. 2.1)
scope note: the content of the NACE Rev 2.1 class is fully covered in the corresponding NACE Rev 2 class
top concept of: Statistical Classification of Economic Activities in the European Community, Rev. 2.1 (NACE Rev. 2.1)
Mapping Cardinality: 1 1

Wholesale of motor vehicles
type: Concept
Additional Content Note: This class also includes: - wholesale of off-road motor vehicles
CoreContentNote: This class includes: - wholesale of new and used motor vehicles, including electric vehicles: • passenger motor vehicles, including specialised passenger motor vehicles (e.g. ambulances, minibuses) • lorries, trailers and semi-trailers • camping vehicles (e.g. caravans, motorhomes)
Exclusion Note: This class excludes: - activities of agents involved in the wholesale of cars and light motor vehicles, see 46.18 - wholesale of electric bicycles and their related parts and accessories, see 46.49 - wholesale of motorised transport equipment (e.g. ships, yachts, planes, trains), see 46.64 - wholesale of parts and accessories for motor vehicles, see 46.72 - on-demand passenger transport service activities by vehicle with a driver, see 49.33 - rental and leasing of cars and light motor vehicles without a driver, see 77.11 - maintenance and repair of motor vehicles, see 95.31
broader: Wholesale of motor vehicles, motorcycles and related parts and accessories
in scheme: Statistical Classification of Economic Activities in the European Community, Rev. 2.1 (NACE Rev. 2.1)
Notation: 46.71
top concept of: Statistical Classification of Economic Activities in the European Community, Rev. 2.1 (NACE Rev. 2.1)

ConceptNoneRandom0.5340594678044072
type: ConceptAssociation
description: NACE Rev. 2.1 class 10.39 is mapped to NACE Rev. 2 class 10.39
Type: 1:1
Source Concept: Other processing and preserving of fruit and vegetables
Target Concept: http://data.europa.eu/ux2/nace2/1039
in scheme: Statistical Classification of Economic Activities in the European Community, Rev. 2.1 (NACE Rev. 2.1)
scope note: the content of the NACE Rev 2.1 class is fully covered in the corresponding NACE Rev 2 class
top concept of: Statistical Classification of Economic Activities in the European Community, Rev. 2.1 (NACE Rev. 2.1)
Mapping Cardinality: 1 1

Activities auxiliary to insurance and pension funding
type: Concept
CoreContentNote: This group includes acting as agents (in other words, brokers) in selling annuities and insurance policies or providing other employee benefits and insurance and pension-related services (for example, claims adjustment, third-party administration).
Exclusion Note: This group excludes: - pooling and assuming insurance risks by underwriting, see division 65
broader: Activities auxiliary to financial services and insurance activities
in scheme: Statistical Classification of Economic Activities in the European Community, Rev. 2.1 (NACE Rev. 2.1)
Notation: 66.2
top concept of: Statistical Classification of Economic Activities in the European Community, Rev. 2.1 (NACE Rev. 2.1)

Manufacture of fibre cement
type: Concept
CoreContentNote: This class includes: - manufacture of panels, boards, tiles, blocks and similar articles of vegetable substances (e.g. wood wool, straw, reeds, rushes) agglomerated with cement, plaster or other mineral binders - manufacture of articles of asbestos cement or cellulose fibre cement, e.g.: • corrugated sheets, other sheets, panels, tiles, tubes, pipes, reservoirs, troughs, basins, sinks, jars, window frames
Exclusion Note: This class excludes: - manufacture of insulating fibreboards of wood or other ligneous fibres, whether or not bonded with resins or other organic substances, see 16.21
broader: Manufacture of articles of concrete, cement and plaster
in scheme: Statistical Classification of Economic Activities in the European Community, Rev. 2.1 (NACE Rev. 2.1)
Notation: 23.65
top concept of: Statistical Classification of Economic Activities in the European Community, Rev. 2.1 (NACE Rev. 2.1)

Manufacture of other organic basic chemicals
type: Concept
CoreContentNote: This class includes the manufacture of chemicals using basic processes (for example, thermal cracking, distillation). The output of these processes is usually separate chemically defined organic compounds. This class includes: - manufacture of basic organic chemicals: • acyclic hydrocarbons, saturated and unsaturated • cyclic hydrocarbons, saturated and unsaturated • acyclic and cyclic alcohols • mono- and polycarboxylic acids, including acetic acid • other oxygen-function compounds, including aldehydes, ketones, quinones and dual or poly oxygen-function compounds • synthetic glycerol • nitrogen-function organic compounds, including amines • fermentation of sugar cane, corn or similar to produce alcohol and esters • other organic compounds, including wood distillation products (e.g. charcoal), etc. - manufacture of synthetic aromatic products - manufacture of methane, not for the provision as a gaseous fuel through a permanent supply network - distillation of coal tar - manufacture of ethyl alcohol, other than for bioethanol fuel - manufacture of refrigerant gases
Exclusion Note: This class excludes: - extraction of natural gas, consisting predominantly of methane, see 06.20 - manufacture of plastics in primary forms, see 20.16 - manufacture of synthetic rubber in primary forms, see 20.17 - manufacture of crude glycerol, see 20.41 - manufacture of liquid biofuels (e.g. bioethanol fuel), see 20.51 - manufacture of natural essential oils, see 20.59 - manufacture of salicylic and O-acetylsalicylic acids, see 21.10 - manufacture of ethanol from biomass, see 20.51 - production of methane for the provision as a gaseous fuel through a permanent supply network, see 35.21
broader: Manufacture of basic chemicals, fertilisers and nitrogen compounds, plastics and synthetic rubber in primary forms
in scheme: Statistical Classification of Economic Activities in the European Community, Rev. 2.1 (NACE Rev. 2.1)
Notation: 20.14
top concept of: Statistical Classification of Economic Activities in the European Community, Rev. 2.1 (NACE Rev. 2.1)

ConceptNoneRandom0.20571203788922832
type: ConceptAssociation
description: NACE Rev. 2.1 class 35.22 is mapped to NACE Rev. 2 class 35.22
Type: 1:1
Source Concept: Distribution of gaseous fuels through mains
Target Concept: http://data.europa.eu/ux2/nace2/3522
in scheme: Statistical Classification of Economic Activities in the European Community, Rev. 2.1 (NACE Rev. 2.1)
scope note: the content of the NACE Rev 2.1 class is fully covered in the corresponding NACE Rev 2 class
top concept of: Statistical Classification of Economic Activities in the European Community, Rev. 2.1 (NACE Rev. 2.1)
Mapping Cardinality: 1 1

ConceptNoneRandom0.7278920520588543
type: ConceptAssociation
description: NACE Rev. 2.1 class 35.23 is mapped to NACE Rev. 2 class 35.23
Type: 3:2
Source Concept: Trade of gas through mains
Target Concept: http://data.europa.eu/ux2/nace2/3523
in scheme: Statistical Classification of Economic Activities in the European Community, Rev. 2.1 (NACE Rev. 2.1)
scope note: the content of the NACE Rev 2.1 class is fully covered in the corresponding NACE Rev 2 class
top concept of: Statistical Classification of Economic Activities in the European Community, Rev. 2.1 (NACE Rev. 2.1)
Mapping Cardinality: n m

Manufacture of jewellery and related articles
type: Concept
Additional Content Note: This class also includes: - engraving of personal precious and non-precious metal products
CoreContentNote: This class includes: - production of worked pearls - production of precious and semi-precious stones in the worked state, including the working of industrial quality stones and synthetic or reconstructed precious or semi-precious stones - working of diamonds - manufacture of jewellery of precious metal or of base metals clad with precious metals, or precious or semi-precious stones, or of combinations of precious metal and precious or semi-precious stones - manufacture of goldsmiths’ articles of precious metals or of base metals clad with precious metals, e.g.: • dinnerware, flatware, hollowware, toilet articles, office or desk articles, articles for religious use - manufacture of technical or laboratory articles of precious metal (except instruments and parts thereof), e.g.: • crucibles, spatulas, electroplating anodes - manufacture of precious metal watch bands, wristbands, watch straps and cigarette-cases
Exclusion Note: This class excludes: - manufacture of non-metallic watch bands (e.g. fabric, leather, plastic), see 15.12 - manufacture of base metals clad with silver, gold or platinum, not further worked, see 24.41 - manufacture of statuettes and other ornaments of base metal plated with precious metal, see 25.99 - manufacture of watch cases, whether or not of precious metal, see 26.52 - manufacture of (non-precious) metal watch bands, see 32.13 - manufacture of imitation jewellery, whether or not plated with precious metal, see 32.13 - repair of jewellery, see 95.25
broader: Manufacture of jewellery, bijouterie and related articles
in scheme: Statistical Classification of Economic Activities in the European Community, Rev. 2.1 (NACE Rev. 2.1)
Notation: 32.12
top concept of: Statistical Classification of Economic Activities in the European Community, Rev. 2.1 (NACE Rev. 2.1)

ConceptNoneRandom0.5985753849652842
type: ConceptAssociation
description: NACE Rev. 2.1 group 27.1 is mapped to NACE Rev. 2 groups 27.1, 27.9
Type: 18:19
Source Concept: Manufacture of electric motors, generators, transformers and electricity distribution and control apparatus
Target Concept: http://data.europa.eu/ux2/nace2/271
Target Concept: http://data.europa.eu/ux2/nace2/279
in scheme: Statistical Classification of Economic Activities in the European Community, Rev. 2.1 (NACE Rev. 2.1)
top concept of: Statistical Classification of Economic Activities in the European Community, Rev. 2.1 (NACE Rev. 2.1)
Mapping Cardinality: n m

ConceptNoneRandom0.5222847190030143
type: ConceptAssociation
description: NACE Rev. 2.1 class 24.54 is mapped to NACE Rev. 2 classes 24.53, 24.54
Type: 2:2
Source Concept: Casting of other non-ferrous metals
Target Concept: http://data.europa.eu/ux2/nace2/2453
Target Concept: http://data.europa.eu/ux2/nace2/2454
in scheme: Statistical Classification of Economic Activities in the European Community, Rev. 2.1 (NACE Rev. 2.1)
scope note: 24.53: - manufacture of castings made of zinc 24.54: - activities of foundries of other non-ferrous metals - manufacture of castings made of copper, lead or nickel alloys - manufacture of castings made of other non-ferrous metals alloys - casting of dental implements etc. of other non-ferrous metals
top concept of: Statistical Classification of Economic Activities in the European Community, Rev. 2.1 (NACE Rev. 2.1)
Mapping Cardinality: n m

ConceptNoneRandom0.3028806807849047
type: ConceptAssociation
description: NACE Rev. 2.1 class 68.12 is mapped to NACE Rev. 2 classes 41.10, 42.99
Type: 23:16
Source Concept: Development of building projects
Target Concept: http://data.europa.eu/ux2/nace2/4110
Target Concept: http://data.europa.eu/ux2/nace2/4299
in scheme: Statistical Classification of Economic Activities in the European Community, Rev. 2.1 (NACE Rev. 2.1)
scope note: 41.10: - development of building projects for self-owned residential and non-residential buildings or civil engineering works by bringing together financial, technical and physical means to realise the building projects for later sale - re-development of building projects for self-owned residential and non-residential buildings or civil engineering works to realise the building projects for later sale 42.99: - subdividing and improving of self-owned land for later sale
top concept of: Statistical Classification of Economic Activities in the European Community, Rev. 2.1 (NACE Rev. 2.1)
Mapping Cardinality: n m

ConceptNoneRandom0.6086695847954876
type: ConceptAssociation
description: NACE Rev. 2.1 group 93.1 is mapped to NACE Rev. 2 groups 85.5, 93.1, 93.2
Type: 5:5
Source Concept: Sports activities
Target Concept: http://data.europa.eu/ux2/nace2/855
Target Concept: http://data.europa.eu/ux2/nace2/932
Target Concept: http://data.europa.eu/ux2/nace2/931
in scheme: Statistical Classification of Economic Activities in the European Community, Rev. 2.1 (NACE Rev. 2.1)
top concept of: Statistical Classification of Economic Activities in the European Community, Rev. 2.1 (NACE Rev. 2.1)
Mapping Cardinality: n m

Manufacture of mortars
type: Concept
CoreContentNote: This class includes: - manufacture of non-refractory mortars and of concrete not yet mixed with water
Exclusion Note: This class excludes: - manufacture of refractory mortars, see 23.20 - manufacture of ready-mixed concrete and concrete ready to pour, see 23.63
broader: Manufacture of articles of concrete, cement and plaster
in scheme: Statistical Classification of Economic Activities in the European Community, Rev. 2.1 (NACE Rev. 2.1)
Notation: 23.64
top concept of: Statistical Classification of Economic Activities in the European Community, Rev. 2.1 (NACE Rev. 2.1)

Electrical installation
type: Concept
Additional Content Note: This class also includes: - connecting of electric appliances and household equipment, including baseboard heating
CoreContentNote: This class includes the installation, repair and maintenance of electrical systems in all types of buildings and civil engineering structures. This class includes: - installation of: • electrical wiring and fittings • telecommunication wiring • computer network and cable television wiring, including fibre-optic • satellite dishes • lighting systems • fire alarms • burglar-alarm systems • street lighting and electrical signals • airport runway lighting • photovoltaic systems on buildings • power storage systems - installation of chargers for electric vehicles
Exclusion Note: This class excludes: - construction of distribution lines for electricity and telecommunication, see 42.22 - construction of solar and wind energy farms, see 42.22 - construction of stations for distribution of electricity (e.g. for electric vehicles), see 42.22 - installation of lightning conductors, see 43.24 - monitoring and remote monitoring of electronic security systems (e.g. burglar alarms and fire alarms, including their installation and maintenance), see 80.09
broader: Electrical, plumbing and other construction installation activities
in scheme: Statistical Classification of Economic Activities in the European Community, Rev. 2.1 (NACE Rev. 2.1)
Notation: 43.21
top concept of: Statistical Classification of Economic Activities in the European Community, Rev. 2.1 (NACE Rev. 2.1)

Wholesale of motor vehicle parts and accessories
type: Concept
CoreContentNote: This class includes: - wholesale of new and used motor vehicle parts, equipment and related accessories like tyres, etc. - wholesale of batteries and accumulators for motor vehicles
Exclusion Note: This class excludes: - activities of agents involved in the wholesale of cars and light motor vehicles parts and accessories, see 46.18 - wholesale of boats, planes, trains, including parts and accessories, see 46.64
broader: Wholesale of motor vehicles, motorcycles and related parts and accessories
in scheme: Statistical Classification of Economic Activities in the European Community, Rev. 2.1 (NACE Rev. 2.1)
Notation: 46.72
top concept of: Statistical Classification of Economic Activities in the European Community, Rev. 2.1 (NACE Rev. 2.1)

CONSTRUCTION
type: Concept
Additional Content Note: This section also includes: - renovation, renewal, reconstruction and retrofitting of historical and archaeological sites and buildings
CoreContentNote: This section includes general construction and specialised construction activities for buildings and civil engineering works. It includes new work, repair, additions and alterations, the erection of prefabricated buildings or structures on the site as well as construction of a temporary nature. General construction is the construction of entire buildings (for example, homes, offices, stores as well as utility buildings or farm buildings). It also includes the construction of civil engineering works (for example, motorways, streets, bridges, tunnels, railways, airfields, harbours and other water projects, irrigation systems, sewerage systems, industrial facilities, pipelines and electric lines, sports facilities). This work can be carried out on own account or on a fee or contract basis. Portions of the work and sometimes even the whole practical work can be subcontracted out. A main contractor that carries the overall responsibility for a construction project is classified here. Further included is the repair of buildings and engineering works. Maintenance, repair and installation of equipment that forms an integral part of buildings (for example, escalators or air-conditioning systems) is classified as construction in section F, if carried out at the construction site. This section includes the complete construction of buildings (division 41), the complete construction of civil engineering works (division 42), as well as specialised construction activities, if carried out only as a part of the construction process (division 43). The rental of construction equipment with an operator is classified with the specific construction activity carried out with this equipment.
Exclusion Note: This section excludes: - manufacturing operations not performed at the construction site, see section C - manufacture and deliverance of structures and prefabricated building parts in wood or metal with minimal on-site construction work, see divisions 16, 25 - archaeological excavations, see 72.20 - conservation, restoration and other cultural heritage support activities, see 91.30
in scheme: Statistical Classification of Economic Activities in the European Community, Rev. 2.1 (NACE Rev. 2.1)
Notation: F
top concept of: Statistical Classification of Economic Activities in the European Community, Rev. 2.1 (NACE Rev. 2.1)

Manufacture of other inorganic basic chemicals
type: Concept
Additional Content Note: This class also includes: - enrichment of uranium and thorium ores - manufacture of lithium hydroxide - manufacture of decolourising agents
CoreContentNote: This class includes the manufacture of chemicals using basic processes. The output of these processes is usually separate chemical elements or separate chemically defined compounds. This class includes: - manufacture of chemical elements (except industrial gases and basic metals) - manufacture of inorganic acids, except nitric acid - manufacture of alkalis, lyes and other inorganic bases, except ammonia - manufacture of other inorganic compounds - roasting of iron pyrites - manufacture of distilled water
Exclusion Note: This class excludes: - manufacture of industrial gases, see 20.11 - manufacture of nitrogenous fertilisers and nitrogen compounds, see 20.15 - manufacture of ammonia, see 20.15 - manufacture of ammonium chloride, see 20.15 - manufacture of nitrites and nitrates of potassium, see 20.15 - manufacture of ammonium carbonates, see 20.15 - manufacture of aromatic distilled water, see 20.59 - manufacture of basic metals, see division 24
broader: Manufacture of basic chemicals, fertilisers and nitrogen compounds, plastics and synthetic rubber in primary forms
in scheme: Statistical Classification of Economic Activities in the European Community, Rev. 2.1 (NACE Rev. 2.1)
Notation: 20.13
top concept of: Statistical Classification of Economic Activities in the European Community, Rev. 2.1 (NACE Rev. 2.1)

Public administration and defence; compulsory social security
type: Concept
broader: PUBLIC ADMINISTRATION AND DEFENCE; COMPULSORY SOCIAL SECURITY
in scheme: Statistical Classification of Economic Activities in the European Community, Rev. 2.1 (NACE Rev. 2.1)
Notation: 84
top concept of: Statistical Classification of Economic Activities in the European Community, Rev. 2.1 (NACE Rev. 2.1)

ConceptNoneRandom0.045018131409619855
type: ConceptAssociation
description: NACE Rev. 2.1 section B is mapped to NACE Rev. 2 section B
Type: 1:1
Source Concept: MINING AND QUARRYING
Target Concept: http://data.europa.eu/ux2/nace2/B
in scheme: Statistical Classification of Economic Activities in the European Community, Rev. 2.1 (NACE Rev. 2.1)
top concept of: Statistical Classification of Economic Activities in the European Community, Rev. 2.1 (NACE Rev. 2.1)
Mapping Cardinality: 1 1

Manufacture of fruit and vegetable juice
type: Concept
Additional Content Note: This class also includes: - production of concentrates from fresh fruits and vegetables
CoreContentNote: This class includes: - manufacture of fruit or vegetable juices
Exclusion Note: This class excludes: - manufacture of beverages produced with fruit nectars, see 11.07
broader: Processing and preserving of fruit and vegetables
in scheme: Statistical Classification of Economic Activities in the European Community, Rev. 2.1 (NACE Rev. 2.1)
Notation: 10.32
top concept of: Statistical Classification of Economic Activities in the European Community, Rev. 2.1 (NACE Rev. 2.1)

ConceptNoneRandom0.2182926760579259
type: ConceptAssociation
description: NACE Rev. 2.1 class 68.11 is mapped to NACE Rev. 2 class 68.10
Type: 1:1
Source Concept: Buying and selling of own real estate
Target Concept: http://data.europa.eu/ux2/nace2/6810
in scheme: Statistical Classification of Economic Activities in the European Community, Rev. 2.1 (NACE Rev. 2.1)
scope note: the content of the NACE Rev 2.1 class is fully covered in the corresponding NACE Rev 2 class
top concept of: Statistical Classification of Economic Activities in the European Community, Rev. 2.1 (NACE Rev. 2.1)
Mapping Cardinality: 1 1

ConceptNoneRandom0.27237460520375667
type: ConceptAssociation
description: NACE Rev. 2.1 class 01.47 is mapped to NACE Rev. 2 classes 01.47, 01.49, 01.62
Type: 10:9
Source Concept: Raising of poultry
Target Concept: http://data.europa.eu/ux2/nace2/0149
Target Concept: http://data.europa.eu/ux2/nace2/0162
Target Concept: http://data.europa.eu/ux2/nace2/0147
in scheme: Statistical Classification of Economic Activities in the European Community, Rev. 2.1 (NACE Rev. 2.1)
scope note: 01.47: - raising and breeding of poultry, e.g.: • chickens, turkeys, ducks, geese, quails, ostriches, guinea fowls - production of eggs from poultry - operation of poultry hatcheries 01.49: - raising and breeding of poultry, e.g.: • quails, ostriches 01.62: - automated egg hatching for poultry
top concept of: Statistical Classification of Economic Activities in the European Community, Rev. 2.1 (NACE Rev. 2.1)
Mapping Cardinality: n m

Striking of coins
type: Concept
CoreContentNote: This class includes: - manufacture of coins, including coins for use as legal tender, whether or not of precious metal
broader: Manufacture of jewellery, bijouterie and related articles
in scheme: Statistical Classification of Economic Activities in the European Community, Rev. 2.1 (NACE Rev. 2.1)
Notation: 32.11
top concept of: Statistical Classification of Economic Activities in the European Community, Rev. 2.1 (NACE Rev. 2.1)

ConceptNoneRandom0.3809216659418173
type: ConceptAssociation
description: NACE Rev. 2.1 class 46.32 is mapped to NACE Rev. 2 classes 46.32, 46.38
Type: 2:2
Source Concept: Wholesale of meat, meat products, fish and fish products
Target Concept: http://data.europa.eu/ux2/nace2/4638
Target Concept: http://data.europa.eu/ux2/nace2/4632
in scheme: Statistical Classification of Economic Activities in the European Community, Rev. 2.1 (NACE Rev. 2.1)
scope note: 46.32: - wholesale of meat and meat products - wholesale of poultry and game 46.38: - wholesale of fish and fish products - wholesale of seafood - wholesale of tripe, delicatessen (charcuterie), salted meat - wholesale of snails - wholesale of algae and seaweed
top concept of: Statistical Classification of Economic Activities in the European Community, Rev. 2.1 (NACE Rev. 2.1)
Mapping Cardinality: n m

ConceptNoneRandom0.5856670581072525
type: ConceptAssociation
description: NACE Rev. 2.1 class 02.30 is mapped to NACE Rev. 2 class 02.30
Type: 1:1
Source Concept: Gathering of wild growing non-wood products
Target Concept: http://data.europa.eu/ux2/nace2/0230
in scheme: Statistical Classification of Economic Activities in the European Community, Rev. 2.1 (NACE Rev. 2.1)
scope note: the content of the NACE Rev 2.1 class is fully covered in the corresponding NACE Rev 2 class
top concept of: Statistical Classification of Economic Activities in the European Community, Rev. 2.1 (NACE Rev. 2.1)
Mapping Cardinality: 1 1

ConceptNoneRandom0.7967569254565624
type: ConceptAssociation
description: NACE Rev. 2.1 class 46.34 is mapped to NACE Rev. 2 class 46.34
Type: 1:1
Source Concept: Wholesale of beverages
Target Concept: http://data.europa.eu/ux2/nace2/4634
in scheme: Statistical Classification of Economic Activities in the European Community, Rev. 2.1 (NACE Rev. 2.1)
scope note: the content of the NACE Rev 2.1 class is fully covered in the corresponding NACE Rev 2 class
top concept of: Statistical Classification of Economic Activities in the European Community, Rev. 2.1 (NACE Rev. 2.1)
Mapping Cardinality: 1 1

ConceptNoneRandom0.6094048932551192
type: ConceptAssociation
description: NACE Rev. 2.1 class 25.40 is mapped to NACE Rev. 2 class 25.50
Type: 1:1
Source Concept: Forging and shaping metal and powder metallurgy
Target Concept: http://data.europa.eu/ux2/nace2/2550
in scheme: Statistical Classification of Economic Activities in the European Community, Rev. 2.1 (NACE Rev. 2.1)
scope note: the content of the NACE Rev 2.1 class is fully covered in the corresponding NACE Rev 2 class
top concept of: Statistical Classification of Economic Activities in the European Community, Rev. 2.1 (NACE Rev. 2.1)
Mapping Cardinality: 1 1

Manufacture of other textiles
type: Concept
CoreContentNote: This group includes the manufacture of products produced from textiles, except wearing apparel (for example, made-up textile articles, carpets and rugs, rope, narrow woven fabrics, trimmings).
broader: Manufacture of textiles
in scheme: Statistical Classification of Economic Activities in the European Community, Rev. 2.1 (NACE Rev. 2.1)
Notation: 13.9
top concept of: Statistical Classification of Economic Activities in the European Community, Rev. 2.1 (NACE Rev. 2.1)

ConceptNoneRandom0.8021122248357327
type: ConceptAssociation
description: NACE Rev. 2.1 class 01.45 is mapped to NACE Rev. 2 class 01.45
Type: 1:1
Source Concept: Raising of sheep and goats
Target Concept: http://data.europa.eu/ux2/nace2/0145
in scheme: Statistical Classification of Economic Activities in the European Community, Rev. 2.1 (NACE Rev. 2.1)
scope note: the content of the NACE Rev 2.1 class is fully covered in the corresponding NACE Rev 2 class
top concept of: Statistical Classification of Economic Activities in the European Community, Rev. 2.1 (NACE Rev. 2.1)
Mapping Cardinality: 1 1

ConceptNoneRandom0.5247742247333542
type: ConceptAssociation
description: NACE Rev. 2.1 group 09.9 is mapped to NACE Rev. 2 group 09.9
Type: 1:1
Source Concept: Support activities for other mining and quarrying
Target Concept: http://data.europa.eu/ux2/nace2/099
in scheme: Statistical Classification of Economic Activities in the European Community, Rev. 2.1 (NACE Rev. 2.1)
top concept of: Statistical Classification of Economic Activities in the European Community, Rev. 2.1 (NACE Rev. 2.1)
Mapping Cardinality: 1 1

ConceptNoneRandom0.12342167555894956
type: ConceptAssociation
description: NACE Rev. 2.1 class 28.91 is mapped to NACE Rev. 2 class 28.91
Type: 1:1
Source Concept: Manufacture of machinery for metallurgy
Target Concept: http://data.europa.eu/ux2/nace2/2891
in scheme: Statistical Classification of Economic Activities in the European Community, Rev. 2.1 (NACE Rev. 2.1)
scope note: the content of the NACE Rev 2.1 class is fully covered in the corresponding NACE Rev 2 class
top concept of: Statistical Classification of Economic Activities in the European Community, Rev. 2.1 (NACE Rev. 2.1)
Mapping Cardinality: 1 1

Manufacture of ready-mixed concrete
type: Concept
CoreContentNote: This class includes: - manufacture of concrete ready to pour, i.e. to which water has already been added and which is usually transported in concrete mixer lorries
Exclusion Note: This class excludes: - manufacture of refractory cements, see 23.20
broader: Manufacture of articles of concrete, cement and plaster
in scheme: Statistical Classification of Economic Activities in the European Community, Rev. 2.1 (NACE Rev. 2.1)
Notation: 23.63
top concept of: Statistical Classification of Economic Activities in the European Community, Rev. 2.1 (NACE Rev. 2.1)

Manufacture of dyes and pigments
type: Concept
Additional Content Note: This class also includes: - manufacture of products, of a kind used as fluorescent brightening agents or as luminophores
CoreContentNote: This class includes: - manufacture of dyes and pigments from any source in basic form or as concentrate - manufacture of pure calcium oxide and calcium hydroxide
Exclusion Note: This class excludes: - manufacture of prepared dyes and pigments, see 20.30
broader: Manufacture of basic chemicals, fertilisers and nitrogen compounds, plastics and synthetic rubber in primary forms
in scheme: Statistical Classification of Economic Activities in the European Community, Rev. 2.1 (NACE Rev. 2.1)
Notation: 20.12
top concept of: Statistical Classification of Economic Activities in the European Community, Rev. 2.1 (NACE Rev. 2.1)

ConceptNoneRandom0.43252177541231507
type: ConceptAssociation
description: NACE Rev. 2.1 group 93.2 is mapped to NACE Rev. 2 groups 82.3, 93.1, 93.2
Type: 5:5
Source Concept: Amusement and recreation activities
Target Concept: http://data.europa.eu/ux2/nace2/823
Target Concept: http://data.europa.eu/ux2/nace2/932
Target Concept: http://data.europa.eu/ux2/nace2/931
in scheme: Statistical Classification of Economic Activities in the European Community, Rev. 2.1 (NACE Rev. 2.1)
top concept of: Statistical Classification of Economic Activities in the European Community, Rev. 2.1 (NACE Rev. 2.1)
Mapping Cardinality: n m

ConceptNoneRandom0.002904157627041437
type: ConceptAssociation
description: NACE Rev. 2.1 class 56.12 is mapped to NACE Rev. 2 class 56.10
Type: 2:1
Source Concept: Mobile food service activities
Target Concept: http://data.europa.eu/ux2/nace2/5610
in scheme: Statistical Classification of Economic Activities in the European Community, Rev. 2.1 (NACE Rev. 2.1)
scope note: the content of the NACE Rev 2.1 class is fully covered in the corresponding NACE Rev 2 class
top concept of: Statistical Classification of Economic Activities in the European Community, Rev. 2.1 (NACE Rev. 2.1)
Mapping Cardinality: n 1

Plumbing, heat and air-conditioning installation
type: Concept
Additional Content Note: This class also includes: - installation of medical gas distribution systems in hospitals
CoreContentNote: This class includes the installation, repair and maintenance of plumbing, heating and air-conditioning systems, including additions and alterations. This class includes: - installation, maintenance and repair of: • heating systems (e.g. heat pumps, solar thermal collectors) • furnaces, cooling towers • plumbing and sanitary equipment • ventilation and air-conditioning equipment and ducts • gas fittings • steam piping • sprinkler systems (e.g. fire and lawn sprinkler systems) - construction or installation of masonry heater stoves - ductwork installation
Exclusion Note: This class excludes: - installation of electric baseboard heating, see 43.21 - camera inspections in air ducts, water and gas pipes, and other liquids without repair or installation, see 71.20
broader: Electrical, plumbing and other construction installation activities
in scheme: Statistical Classification of Economic Activities in the European Community, Rev. 2.1 (NACE Rev. 2.1)
Notation: 43.22
top concept of: Statistical Classification of Economic Activities in the European Community, Rev. 2.1 (NACE Rev. 2.1)

Wholesale of motorcycles, motorcycle parts and accessories
type: Concept
CoreContentNote: This class includes: - wholesale of new and used motorcycles, including mopeds - wholesale of parts and accessories for motorcycles - wholesale of protective gear for motorcyclists
Exclusion Note: This class excludes: - activities of commission agents specialised in the wholesale of motorcycles, see 46.18 - wholesale of bicycles, electric bicycles and their related parts and accessories, see 46.49 - rental of motorcycles, see 77.11 - repair and maintenance of motorcycles, see 95.32
broader: Wholesale of motor vehicles, motorcycles and related parts and accessories
in scheme: Statistical Classification of Economic Activities in the European Community, Rev. 2.1 (NACE Rev. 2.1)
Notation: 46.73
top concept of: Statistical Classification of Economic Activities in the European Community, Rev. 2.1 (NACE Rev. 2.1)

WHOLESALE AND RETAIL TRADE
type: Concept
Additional Content Note: This section also includes: - transit trade activities consisting of buying commodities, moving them from one customs territory to another. Transit trade represents a triangular transaction in which the transit trader carries out export and import transactions between two or more different countries outside their own economic territory. The transit trader owns the commodity during its transport (different to intermediaries that do not take ownership of the intermediated goods) - specialised and non-specialised intermediation service activities for retail sale, see 47.9 - sale of food and beverages via vending machines or automated points of sale
CoreContentNote: This section includes wholesale and retail sale (in other words, sale without transformation) of any type of physical goods and rendering services incidental to the sale of merchandise. Goods are physical, produced objects for which a demand exists, over which ownership rights can be established and whose ownership can be transferred from one unit to another by engaging in transactions on markets. This is consistent with the definitions and concepts applied in the balance of payments domain, the G20 Digital Economy Task Force, the Handbook on Measuring Digital Trade, and so on. Wholesale and retail sale are the final steps in the distribution of merchandise. For this purpose, ancillary activities (see introductory guidelines, Chapter xx) are carried out, which include a number of usual operations (or manipulations) associated with trade, without transforming the goods. These operations (or manipulations) include, for example, sorting, grading and assembling of goods, mixing or blending of goods (for example, sand), bottling (with or without preceding bottle cleaning), packaging, breaking bulk and repacking for distribution in smaller lots, storage (whether or not frozen or chilled). If not carried out as usual operations (or manipulations) associated with trade, the mentioned activities can be carried out as principal, secondary or ancillary activities in other sections of NACE. The distinction between wholesale (division 46) and retail sale (division 47) is based on the type of customer. Wholesale is the resale of new and used goods to retailers, business-to-business trade (for example, to industrial, commercial, institutional or professional users) or other wholesalers, or it involves acting as an agent or broker in buying merchandise for, or selling merchandise to, such persons or companies. The principal types of businesses included are merchant wholesalers, in other words, wholesalers who take title to the goods they sell, such as wholesale merchants or jobbers…
Exclusion Note: This section excludes: - trade of electricity, see 35.15 - trade of gaseous fuels for energy supply through mains, see 35.23 - the commerce of digital goods, streaming and downloading of content on digital platforms (e.g. e-books, audio), see section J - activities of resellers of prepaid calling cards and services, see 61.20 - repair of motor vehicles and motorcycles, see division 95 - cooperative associations; these are classified to their predominant activity
in scheme: Statistical Classification of Economic Activities in the European Community, Rev. 2.1 (NACE Rev. 2.1)
Notation: G
top concept of: Statistical Classification of Economic Activities in the European Community, Rev. 2.1 (NACE Rev. 2.1)

ConceptNoneRandom0.056281228350211765
type: ConceptAssociation
description: NACE Rev. 2.1 group 62.9 is mapped to NACE Rev. 2 group 62.0
Type: 3:1
Source Concept: Other information technology and computer service activities
Target Concept: http://data.europa.eu/ux2/nace2/620
in scheme: Statistical Classification of Economic Activities in the European Community, Rev. 2.1 (NACE Rev. 2.1)
top concept of: Statistical Classification of Economic Activities in the European Community, Rev. 2.1 (NACE Rev. 2.1)
Mapping Cardinality: n 1

Education
type: Concept
broader: EDUCATION
in scheme: Statistical Classification of Economic Activities in the European Community, Rev. 2.1 (NACE Rev. 2.1)
Notation: 85
top concept of: Statistical Classification of Economic Activities in the European Community, Rev. 2.1 (NACE Rev. 2.1)

ConceptNoneRandom0.5952033959367142
type: ConceptAssociation
description: NACE Rev. 2.1 section A is mapped to NACE Rev. 2 sections A, C
Type: 18:17
Source Concept: AGRICULTURE, FORESTRY AND FISHING
Target Concept: http://data.europa.eu/ux2/nace2/A
Target Concept: http://data.europa.eu/ux2/nace2/C
in scheme: Statistical Classification of Economic Activities in the European Community, Rev. 2.1 (NACE Rev. 2.1)
top concept of: Statistical Classification of Economic Activities in the European Community, Rev. 2.1 (NACE Rev. 2.1)
Mapping Cardinality: n m

ConceptNoneRandom0.4822371440619546
type: ConceptAssociation
description: NACE Rev. 2.1 group 05.1 is mapped to NACE Rev. 2 group 05.1
Type: 1:1
Source Concept: Mining of hard coal
Target Concept: http://data.europa.eu/ux2/nace2/051
in scheme: Statistical Classification of Economic Activities in the European Community, Rev. 2.1 (NACE Rev. 2.1)
top concept of: Statistical Classification of Economic Activities in the European Community, Rev. 2.1 (NACE Rev. 2.1)
Mapping Cardinality: 1 1

ConceptNoneRandom0.2966446899837313
type: ConceptAssociation
description: NACE Rev. 2.1 class 01.46 is mapped to NACE Rev. 2 class 01.46
Type: 1:1
Source Concept: Raising of swine and pigs
Target Concept: http://data.europa.eu/ux2/nace2/0146
in scheme: Statistical Classification of Economic Activities in the European Community, Rev. 2.1 (NACE Rev. 2.1)
scope note: the content of the NACE Rev 2.1 class is fully covered in the corresponding NACE Rev 2 class
top concept of: Statistical Classification of Economic Activities in the European Community, Rev. 2.1 (NACE Rev. 2.1)
Mapping Cardinality: 1 1

Holiday and other short-stay accommodation
type: Concept
CoreContentNote: This class includes the provision of short-term accommodation, typically on a daily or weekly basis, in self-contained furnished rooms or areas for living/dining and sleeping. Typically, no on-the-spot customer service and minimal complementary services, if any, are provided. This class includes accommodation in, for example: - holiday homes and apartments - visitor flats and bungalows - cottages and cabins without housekeeping services - hostels - bed and breakfast units - guest rooms provided by private households - mountain huts and lodges
Exclusion Note: This class excludes: - accommodation with daily cleaning, bed-making and on-the-spot customer service, see 55.10 - intermediation service activities for accommodation, see 55.40
broader: Holiday and other short-stay accommodation
in scheme: Statistical Classification of Economic Activities in the European Community, Rev. 2.1 (NACE Rev. 2.1)
Notation: 55.20
top concept of: Statistical Classification of Economic Activities in the European Community, Rev. 2.1 (NACE Rev. 2.1)

ConceptNoneRandom0.958168992939537
type: ConceptAssociation
description: NACE Rev. 2.1 class 46.33 is mapped to NACE Rev. 2 class 46.33
Type: 1:1
Source Concept: Wholesale of dairy products, eggs and edible oils and fats
Target Concept: http://data.europa.eu/ux2/nace2/4633
in scheme: Statistical Classification of Economic Activities in the European Community, Rev. 2.1 (NACE Rev. 2.1)
scope note: the content of the NACE Rev 2.1 class is fully covered in the corresponding NACE Rev 2 class
top concept of: Statistical Classification of Economic Activities in the European Community, Rev. 2.1 (NACE Rev. 2.1)
Mapping Cardinality: 1 1

ConceptNoneRandom0.5856690949736906
type: ConceptAssociation
description: NACE Rev. 2.1 class 49.42 is mapped to NACE Rev. 2 class 49.42
Type: 1:1
Source Concept: Removal services
Target Concept: http://data.europa.eu/ux2/nace2/4942
in scheme: Statistical Classification of Economic Activities in the European Community, Rev. 2.1 (NACE Rev. 2.1)
scope note: the content of the NACE Rev 2.1 class is fully covered in the corresponding NACE Rev 2 class
top concept of: Statistical Classification of Economic Activities in the European Community, Rev. 2.1 (NACE Rev. 2.1)
Mapping Cardinality: 1 1

ConceptNoneRandom0.9152396581113879
type: ConceptAssociation
description: NACE Rev. 2.1 group 98.1 is mapped to NACE Rev. 2 group 98.1
Type: 1:1
Source Concept: Undifferentiated goods-producing activities of private households for own use
Target Concept: http://data.europa.eu/ux2/nace2/981
in scheme: Statistical Classification of Economic Activities in the European Community, Rev. 2.1 (NACE Rev. 2.1)
top concept of: Statistical Classification of Economic Activities in the European Community, Rev. 2.1 (NACE Rev. 2.1)
Mapping Cardinality: 1 1

ConceptNoneRandom0.08317338882948688
type: ConceptAssociation
description: NACE Rev. 2.1 class 26.30 is mapped to NACE Rev. 2 class 26.30
Type: 2:2
Source Concept: Manufacture of communication equipment
Target Concept: http://data.europa.eu/ux2/nace2/2630
in scheme: Statistical Classification of Economic Activities in the European Community, Rev. 2.1 (NACE Rev. 2.1)
scope note: the content of the NACE Rev 2.1 class is fully covered in the corresponding NACE Rev 2 class
top concept of: Statistical Classification of Economic Activities in the European Community, Rev. 2.1 (NACE Rev. 2.1)
Mapping Cardinality: n m

ConceptNoneRandom0.5307026392458309
type: ConceptAssociation
description: NACE Rev. 2.1 class 47.24 is mapped to NACE Rev. 2 classes 47.24, 47.81, 47.91, 47.99
Type: 78:65
Source Concept: Retail sale of bread, cake and confectionery
Target Concept: http://data.europa.eu/ux2/nace2/4791
Target Concept: http://data.europa.eu/ux2/nace2/4781
Target Concept: http://data.europa.eu/ux2/nace2/4799
Target Concept: http://data.europa.eu/ux2/nace2/4724
in scheme: Statistical Classification of Economic Activities in the European Community, Rev. 2.1 (NACE Rev. 2.1)
scope note: 47.24: - retail sale of bread and rolls baked on the premises from pre-baked products - retail sale by automatic machines of ready-to-eat bread prepared by the machine itself 47.81: - retail sale via stalls and markets of bread and rolls baked on the premises from pre-baked products - retail sale via stalls and markets by automatic machines of ready-to-eat bread prepared by the machine itself 47.91: - retail sale via mail order houses or via Internet of bread, cake and confectionery - retail sale via mail order houses or via Internet of bread and rolls baked on the premises from pre-baked products - retail sale via mail order houses or via Internet by automatic machines of ready-to-eat bread prepared by the machine itself 47.99: - retail sale not in stores, stalls or markets of bread, cake and confectionery - retail sale not in stores, stalls or markets of bread and rolls baked on the premises from pre-baked products - retail sale not in stores, stalls or markets by automatic machines of ready-to-eat bread prepared by the machine itself
top concept of: Statistical Classification of Economic Activities in the European Community, Rev. 2.1 (NACE Rev. 2.1)
Mapping Cardinality: n m

ConceptNoneRandom0.12122644535087157
type: ConceptAssociation
description: NACE Rev. 2.1 class 95.32 is mapped to NACE Rev. 2 class 45.40
Type: 78:65
Source Concept: Repair and maintenance of motorcycles
Target Concept: http://data.europa.eu/ux2/nace2/4540
in scheme: Statistical Classification of Economic Activities in the European Community, Rev. 2.1 (NACE Rev. 2.1)
scope note: the content of the NACE Rev 2.1 class is fully covered in the corresponding NACE Rev 2 class
top concept of: Statistical Classification of Economic Activities in the European Community, Rev. 2.1 (NACE Rev. 2.1)
Mapping Cardinality: n m

ConceptNoneRandom0.9463058238024554
type: ConceptAssociation
description: NACE Rev. 2.1 class 46.39 is mapped to NACE Rev. 2 class 46.39
Type: 1:1
Source Concept: Non-specialised wholesale of food, beverages and tobacco
Target Concept: http://data.europa.eu/ux2/nace2/4639
in scheme: Statistical Classification of Economic Activities in the European Community, Rev. 2.1 (NACE Rev. 2.1)
scope note: the content of the NACE Rev 2.1 class is fully covered in the corresponding NACE Rev 2 class
top concept of: Statistical Classification of Economic Activities in the European Community, Rev. 2.1 (NACE Rev. 2.1)
Mapping Cardinality: 1 1

Masonry and bricklaying activities
type: Concept
CoreContentNote: This class includes: - bricklaying, block laying, stone setting and other masonry works
broader: Other specialised construction activities
in scheme: Statistical Classification of Economic Activities in the European Community, Rev. 2.1 (NACE Rev. 2.1)
Notation: 43.91
top concept of: Statistical Classification of Economic Activities in the European Community, Rev. 2.1 (NACE Rev. 2.1)

Real estate activities with own property and development of building projects
type: Concept
CoreContentNote: This group includes the activities of buying, developing and selling of self-owned real estate.
Exclusion Note: This group excludes: - general construction and specialised construction activities for buildings and civil engineering works, see section F - architectural and engineering activities and related technical consultancy, see 71.1 - provision of architectural or engineering project management services for construction projects, see 71.1
broader: Real estate activities
in scheme: Statistical Classification of Economic Activities in the European Community, Rev. 2.1 (NACE Rev. 2.1)
Notation: 68.1
top concept of: Statistical Classification of Economic Activities in the European Community, Rev. 2.1 (NACE Rev. 2.1)

ConceptNoneRandom0.3724730471871476
type: ConceptAssociation
description: NACE Rev. 2.1 division 95 is mapped to NACE Rev. 2 divisions 45, 82, 95
Type: 48:49
Source Concept: Repair and maintenance of computers, personal and household goods, and motor vehicles and motorcycles
Target Concept: http://data.europa.eu/ux2/nace2/82
Target Concept: http://data.europa.eu/ux2/nace2/95
Target Concept: http://data.europa.eu/ux2/nace2/45
in scheme: Statistical Classification of Economic Activities in the European Community, Rev. 2.1 (NACE Rev. 2.1)
top concept of: Statistical Classification of Economic Activities in the European Community, Rev. 2.1 (NACE Rev. 2.1)
Mapping Cardinality: n m

General secondary education
type: Concept
CoreContentNote: This class includes the provision of education that lays the foundation for lifelong learning and human development and is capable of furthering education opportunities. Activities classified in this class are based on programmes that are usually on a more subject-oriented curriculum using more specialised teachers and more often employing several teachers conducting classes in their field of specialisation. Subject specialisation at this level often begins to have some influence even on the educational experience of those pursuing a general programme. Such programmes are designed to qualify students either for technical and vocational education or for entrance to higher education without any special subject prerequisite. This class includes: - lower general secondary education corresponding more or less to compulsory school age - upper general secondary education, whether granting access or not to higher education
Exclusion Note: This class excludes: - non-formal education and training, see 85.5
broader: Secondary and post-secondary non-tertiary education
in scheme: Statistical Classification of Economic Activities in the European Community, Rev. 2.1 (NACE Rev. 2.1)
Notation: 85.31
top concept of: Statistical Classification of Economic Activities in the European Community, Rev. 2.1 (NACE Rev. 2.1)

Wholesale of food, beverages and tobacco
type: Concept
CoreContentNote: This group includes: - wholesale of fresh, preserved and frozen food - specialised and non-specialised wholesale of food, beverages and tobacco
Exclusion Note: This group excludes: - activities of wholesalers who do not assume ownership of the goods they trade, see 46.1
broader: Wholesale trade
in scheme: Statistical Classification of Economic Activities in the European Community, Rev. 2.1 (NACE Rev. 2.1)
Notation: 46.3
top concept of: Statistical Classification of Economic Activities in the European Community, Rev. 2.1 (NACE Rev. 2.1)

Growing of spices, aromatic, drug and pharmaceutical crops
type: Concept
Additional Content Note: This class also includes: - sun drying of spices and aromatic, drug and pharmaceutical plants when associated with the growing of the plants
CoreContentNote: This class includes: - growing of perennial and non-perennial spices and aromatic crops: • pepper (Piper spp.) • nutmeg, mace and cardamoms • anise, badian and fennel as a spice or aromatic plant • cinnamon (Canella) • cloves • ginger • vanilla • hops • caraway - growing of drug and narcotic crops
Exclusion Note: This class excludes: - drying of spices and aromatic, drug and pharmaceutical plants by third parties, see 01.63
broader: Growing of perennial crops
in scheme: Statistical Classification of Economic Activities in the European Community, Rev. 2.1 (NACE Rev. 2.1)
Notation: 01.28
top concept of: Statistical Classification of Economic Activities in the European Community, Rev. 2.1 (NACE Rev. 2.1)

ConceptNoneRandom0.6216923293090058
type: ConceptAssociation
description: NACE Rev. 2.1 class 72.20 is mapped to NACE Rev. 2 class 72.20
Type: 1:1
Source Concept: Research and experimental development on social sciences and humanities
Target Concept: http://data.europa.eu/ux2/nace2/7220
in scheme: Statistical Classification of Economic Activities in the European Community, Rev. 2.1 (NACE Rev. 2.1)
scope note: the content of the NACE Rev 2.1 class is fully covered in the corresponding NACE Rev 2 class
top concept of: Statistical Classification of Economic Activities in the European Community, Rev. 2.1 (NACE Rev. 2.1)
Mapping Cardinality: 1 1

ConceptNoneRandom0.43490657115577647
type: ConceptAssociation
description: NACE Rev. 2.1 group 10.9 is mapped to NACE Rev. 2 group 10.9
Type: 1:1
Source Concept: Manufacture of prepared animal feeds
Target Concept: http://data.europa.eu/ux2/nace2/109
in scheme: Statistical Classification of Economic Activities in the European Community, Rev. 2.1 (NACE Rev. 2.1)
top concept of: Statistical Classification of Economic Activities in the European Community, Rev. 2.1 (NACE Rev. 2.1)
Mapping Cardinality: 1 1

Casting of metals
type: Concept
CoreContentNote: This group includes activities of foundries employing different casting processes to produce castings with all ferrous and non-ferrous metal alloys. Subsequent trimming or descaling of the castings might be included, but without any further processing. This group includes the manufacture of castings used in various industries.
Exclusion Note: This group excludes: - manufacture of products obtained by production processes other than from castings (e.g. as forged, pressed, drawn and stamped parts, rolled rings or powder metallurgy products), see division 25 - manufacture of finished products by further processing of castings, e.g.: • boilers and radiators, see 25.21 • cast household items, anchors, ships’ propellers and bells, see 25.99
broader: Manufacture of basic metals
in scheme: Statistical Classification of Economic Activities in the European Community, Rev. 2.1 (NACE Rev. 2.1)
Notation: 24.5
top concept of: Statistical Classification of Economic Activities in the European Community, Rev. 2.1 (NACE Rev. 2.1)

Activities of agents involved in non-specialised wholesale
type: Concept
Exclusion Note: This class excludes: - wholesale on own account, see 46.2 to 46.9 - activities of commission agents who assume ownership of the goods, even if they are acting in the name of a third party, see 46.2 to 46.9 - activities of real estate agents, see 68.31 - activities of agents involved in the sale of services for goods (transport, insurance, advertising), see relevant NACE classes according to that particular service
broader: Wholesale on a fee or contract basis
in scheme: Statistical Classification of Economic Activities in the European Community, Rev. 2.1 (NACE Rev. 2.1)
Notation: 46.19
top concept of: Statistical Classification of Economic Activities in the European Community, Rev. 2.1 (NACE Rev. 2.1)

ConceptNoneRandom0.3008875632711555
type: ConceptAssociation
description: NACE Rev. 2.1 section L is mapped to NACE Rev. 2 section K
Type: 1:1
Source Concept: FINANCIAL AND INSURANCE ACTIVITIES
Target Concept: http://data.europa.eu/ux2/nace2/K
in scheme: Statistical Classification of Economic Activities in the European Community, Rev. 2.1 (NACE Rev. 2.1)
top concept of: Statistical Classification of Economic Activities in the European Community, Rev. 2.1 (NACE Rev. 2.1)
Mapping Cardinality: 1 1

Sea and coastal freight water transport
type: Concept
Additional Content Note: This class also includes: - rental of vessels with crew for sea and coastal freight water transport - ferry transport of unaccompanied vehicles
CoreContentNote: This class includes: - transport of freight over sea and coastal waters - transport by towing or pushing of barges, oil rigs, etc.
Exclusion Note: This class excludes: - ferry transport of passengers with or without a vehicle, see 50.10 - storage of freight, see 52.10 - harbour operations and other auxiliary activities (e.g. docking, pilotage, lighterage, vessel salvage), see 52.22 - cargo handling, see 52.24 - rental of commercial ships or boats without crew, see 77.34
broader: Sea and coastal freight water transport
in scheme: Statistical Classification of Economic Activities in the European Community, Rev. 2.1 (NACE Rev. 2.1)
Notation: 50.20
top concept of: Statistical Classification of Economic Activities in the European Community, Rev. 2.1 (NACE Rev. 2.1)

ConceptNoneRandom0.7663473079964093
type: ConceptAssociation
description: NACE Rev. 2.1 class 28.97 is mapped to NACE Rev. 2 classes 28.96, 28.99
Type: 3:2
Source Concept: Manufacture of additive manufacturing machinery
Target Concept: http://data.europa.eu/ux2/nace2/2899
Target Concept: http://data.europa.eu/ux2/nace2/2896
in scheme: Statistical Classification of Economic Activities in the European Community, Rev. 2.1 (NACE Rev. 2.1)
scope note: 28.96: - manufacture of machines for additive manufacturing by plastics or rubber deposit 28.99: - manufacture of machines for additive manufacturing by metal, plastics, rubber, plaster, cement, ceramic deposit, etc.
top concept of: Statistical Classification of Economic Activities in the European Community, Rev. 2.1 (NACE Rev. 2.1)
Mapping Cardinality: n m

Manufacture of knitted and crocheted apparel
type: Concept
Additional Content Note: This class also includes: - manufacture of medical stockings and hosiery - manufacture of footwear without applied soles, knitted or crocheted
CoreContentNote: This class includes: - manufacture of hosiery, including socks, tights and pantyhose - manufacture of knitted or crocheted wearing apparel (e.g. pullovers, cardigans, jerseys, shirts, T-shirts, blouses, waistcoats, nightwear, underwear, including babies’ wear) - manufacture of knitted and crocheted sportswear and swimwear
Exclusion Note: This class excludes: - manufacture of knitted and crocheted fabrics, see 13.91 - manufacture of knitted or crocheted brassieres and corsets, see 14.22
broader: Manufacture of knitted and crocheted apparel
in scheme: Statistical Classification of Economic Activities in the European Community, Rev. 2.1 (NACE Rev. 2.1)
Notation: 14.10
top concept of: Statistical Classification of Economic Activities in the European Community, Rev. 2.1 (NACE Rev. 2.1)

ConceptNoneRandom0.2128518011911077
type: ConceptAssociation
description: NACE Rev. 2.1 class 49.41 is mapped to NACE Rev. 2 class 49.41
Type: 2:2
Source Concept: Freight transport by road
Target Concept: http://data.europa.eu/ux2/nace2/4941
in scheme: Statistical Classification of Economic Activities in the European Community, Rev. 2.1 (NACE Rev. 2.1)
scope note: the content of the NACE Rev 2.1 class is fully covered in the corresponding NACE Rev 2 class
top concept of: Statistical Classification of Economic Activities in the European Community, Rev. 2.1 (NACE Rev. 2.1)
Mapping Cardinality: n m

ConceptNoneRandom0.7817171845329173
type: ConceptAssociation
description: NACE Rev. 2.1 class 85.51 is mapped to NACE Rev. 2 class 85.51
Type: 2:2
Source Concept: Sports and recreation education
Target Concept: http://data.europa.eu/ux2/nace2/8551
in scheme: Statistical Classification of Economic Activities in the European Community, Rev. 2.1 (NACE Rev. 2.1)
scope note: the content of the NACE Rev 2.1 class is fully covered in the corresponding NACE Rev 2 class
top concept of: Statistical Classification of Economic Activities in the European Community, Rev. 2.1 (NACE Rev. 2.1)
Mapping Cardinality: n m

ConceptNoneRandom0.7126581628920278
type: ConceptAssociation
description: NACE Rev. 2.1 class 50.40 is mapped to NACE Rev. 2 class 50.40
Type: 1:1
Source Concept: Inland freight water transport
Target Concept: http://data.europa.eu/ux2/nace2/5040
in scheme: Statistical Classification of Economic Activities in the European Community, Rev. 2.1 (NACE Rev. 2.1)
scope note: the content of the NACE Rev 2.1 class is fully covered in the corresponding NACE Rev 2 class
top concept of: Statistical Classification of Economic Activities in the European Community, Rev. 2.1 (NACE Rev. 2.1)
Mapping Cardinality: 1 1

ConceptNoneRandom0.6457161428819177
type: ConceptAssociation
description: NACE Rev. 2.1 class 47.25 is mapped to NACE Rev. 2 classes 47.25, 47.81, 47.91, 47.99
Type: 78:65
Source Concept: Retail sale of beverages
Target Concept: http://data.europa.eu/ux2/nace2/4791
Target Concept: http://data.europa.eu/ux2/nace2/4781
Target Concept: http://data.europa.eu/ux2/nace2/4725
Target Concept: http://data.europa.eu/ux2/nace2/4799
in scheme: Statistical Classification of Economic Activities in the European Community, Rev. 2.1 (NACE Rev. 2.1)
scope note: 47.25: - retail sale of alcoholic and non-alcoholic beverages, not for consumption or manufactured on the premises - retail sale of fruit and vegetable juices 47.81: - retail sale via stalls and markets of alcoholic and non-alcoholic beverages, not for consumption or manufactured on the premises - retail sale via stalls and markets of fruit and vegetable juices 47.91: - retail sale via mail order houses or via Internet of alcoholic and non-alcoholic beverages, not for consumption or manufactured on the premises - retail sale via mail order houses or via Internet of fruit and vegetable juices 47.99: - retail sale not in stores, stalls or markets of alcoholic and non-alcoholic beverages, not for consumption or manufactured on the premises - retail sale not in stores, stalls or markets of fruit and vegetable juices
top concept of: Statistical Classification of Economic Activities in the European Community, Rev. 2.1 (NACE Rev. 2.1)
Mapping Cardinality: n m

ConceptNoneRandom0.5793206655356605
type: ConceptAssociation
description: NACE Rev. 2.1 group 63.1 is mapped to NACE Rev. 2 groups 52.1, 63.1
Type: 42:34
Source Concept: Computing infrastructure, data processing, hosting and related activities
Target Concept: http://data.europa.eu/ux2/nace2/631
Target Concept: http://data.europa.eu/ux2/nace2/521
in scheme: Statistical Classification of Economic Activities in the European Community, Rev. 2.1 (NACE Rev. 2.1)
top concept of: Statistical Classification of Economic Activities in the European Community, Rev. 2.1 (NACE Rev. 2.1)
Mapping Cardinality: n m

ConceptNoneRandom0.14293364842550615
type: ConceptAssociation
description: NACE Rev. 2.1 group 98.2 is mapped to NACE Rev. 2 group 98.2
Type: 1:1
Source Concept: Undifferentiated service-producing activities of private households for own use
Target Concept: http://data.europa.eu/ux2/nace2/982
in scheme: Statistical Classification of Economic Activities in the European Community, Rev. 2.1 (NACE Rev. 2.1)
top concept of: Statistical Classification of Economic Activities in the European Community, Rev. 2.1 (NACE Rev. 2.1)
Mapping Cardinality: 1 1

ConceptNoneRandom0.05730194079899553
type: ConceptAssociation
description: NACE Rev. 2.1 class 93.13 is mapped to NACE Rev. 2 classes 85.51, 93.13
Type: 2:2
Source Concept: Activities of fitness centres
Target Concept: http://data.europa.eu/ux2/nace2/9313
Target Concept: http://data.europa.eu/ux2/nace2/8551
in scheme: Statistical Classification of Economic Activities in the European Community, Rev. 2.1 (NACE Rev. 2.1)
scope note: 85.51: - activities of yoga studios - activities of pilates studios - activities of tai chi studios 93.13: - activities of fitness clubs
top concept of: Statistical Classification of Economic Activities in the European Community, Rev. 2.1 (NACE Rev. 2.1)
Mapping Cardinality: n m

Vocational secondary education
type: Concept
Additional Content Note: This class also includes programmes corresponding to the definition of formal education and training as, for example, in the following fields: - instruction for tourist guides - instruction for chefs, hoteliers and restaurateurs - cosmetology and hairdresser/barber schools - computer repair training - education activities of driving schools for occupational drivers (e.g. of trucks, buses, coaches) and of schools for forklift drivers and professional pilots (including instructions for drone pilots)
CoreContentNote: This class includes the provision of education typically emphasising subject-matter specialisation and instruction in both a theoretical background and practical skills that are generally associated with present or prospective employment. The aim of a programme can vary from preparation for a general field of employment to a very specific job. This class includes: - technical and vocational education below the level of post-secondary non-tertiary education as defined in 85.33
Exclusion Note: This class excludes: - technical and vocational post-secondary non-tertiary education, see 85.33 - technical and vocational higher education, see 85.40 - non-formal vocational education and training, see 85.5 - performing arts instruction for recreation, hobby and self-development purposes, see 85.52 - education activities of driving schools not intended for occupational drivers, see 85.53 - job training forming part of social work activities without accommodation, see 88.10, 88.99
broader: Secondary and post-secondary non-tertiary education
in scheme: Statistical Classification of Economic Activities in the European Community, Rev. 2.1 (NACE Rev. 2.1)
Notation: 85.32
top concept of: Statistical Classification of Economic Activities in the European Community, Rev. 2.1 (NACE Rev. 2.1)

ConceptNoneRandom0.27293782810756584
type: ConceptAssociation
description: NACE Rev. 2.1 division 94 is mapped to NACE Rev. 2 division 94
Type: 1:1
Source Concept: Activities of membership organisations
Target Concept: http://data.europa.eu/ux2/nace2/94
in scheme: Statistical Classification of Economic Activities in the European Community, Rev. 2.1 (NACE Rev. 2.1)
top concept of: Statistical Classification of Economic Activities in the European Community, Rev. 2.1 (NACE Rev. 2.1)
Mapping Cardinality: 1 1

Repair and maintenance of fabricated metal products, machinery and equipment
type: Concept
CoreContentNote: This group includes the specialised repair of goods produced in the manufacturing sector with the aim to restore these metal products, machinery, equipment and other products to working order. The provision of general or routine maintenance (in other words, servicing) on such products to ensure they work efficiently and to prevent breakdown and unnecessary repairs is included.
Exclusion Note: This group excludes: - rebuilding or remanufacture of machinery and equipment, see corresponding class in divisions 25 to 30 - cleaning of industrial machinery, see 81.22 - repair and maintenance of computers and communication equipment, see 95.10 - repair and maintenance of household goods, see 95.2
broader: Repair, maintenance and installation of machinery and equipment
in scheme: Statistical Classification of Economic Activities in the European Community, Rev. 2.1 (NACE Rev. 2.1)
Notation: 33.1
top concept of: Statistical Classification of Economic Activities in the European Community, Rev. 2.1 (NACE Rev. 2.1)

Rental and operating of own or leased real estate
type: Concept
broader: Real estate activities
in scheme: Statistical Classification of Economic Activities in the European Community, Rev. 2.1 (NACE Rev. 2.1)
Notation: 68.2
top concept of: Statistical Classification of Economic Activities in the European Community, Rev. 2.1 (NACE Rev. 2.1)

Growing of other perennial crops
type: Concept
CoreContentNote: This class includes: - growing of rubber trees for harvesting of latex - growing of Christmas trees - growing of trees for extraction of sap - growing of vegetable materials of a kind used primarily for plaiting
Exclusion Note: This class excludes: - growing of flowers, cutting of flower buds and growing of flower seeds, see 01.19 - gathering of tree sap or rubber-like gums in the wild, see 02.30
broader: Growing of perennial crops
in scheme: Statistical Classification of Economic Activities in the European Community, Rev. 2.1 (NACE Rev. 2.1)
Notation: 01.29
top concept of: Statistical Classification of Economic Activities in the European Community, Rev. 2.1 (NACE Rev. 2.1)

ConceptNoneRandom0.8791213889403646
type: ConceptAssociation
description: NACE Rev. 2.1 class 95.31 is mapped to NACE Rev. 2 class 45.20
Type: 1:1
Source Concept: Repair and maintenance of motor vehicles
Target Concept: http://data.europa.eu/ux2/nace2/4520
in scheme: Statistical Classification of Economic Activities in the European Community, Rev. 2.1 (NACE Rev. 2.1)
scope note: the content of the NACE Rev 2.1 class is fully covered in the corresponding NACE Rev 2 class
top concept of: Statistical Classification of Economic Activities in the European Community, Rev. 2.1 (NACE Rev. 2.1)
Mapping Cardinality: 1 1

Wholesale of household goods
type: Concept
CoreContentNote: This group includes the wholesale of household goods, including textiles and furniture.
Exclusion Note: This group excludes: - activities of wholesalers who do not assume ownership of the goods they trade, see 46.1 - wholesale of garden and landscaping equipment (e.g. lawn mowers), see 46.61
broader: Wholesale trade
in scheme: Statistical Classification of Economic Activities in the European Community, Rev. 2.1 (NACE Rev. 2.1)
Notation: 46.4
top concept of: Statistical Classification of Economic Activities in the European Community, Rev. 2.1 (NACE Rev. 2.1)

Electricity, gas, steam and air conditioning supply
type: Concept
broader: ELECTRICITY, GAS, STEAM AND AIR CONDITIONING SUPPLY
in scheme: Statistical Classification of Economic Activities in the European Community, Rev. 2.1 (NACE Rev. 2.1)
Notation: 35
top concept of: Statistical Classification of Economic Activities in the European Community, Rev. 2.1 (NACE Rev. 2.1)

Other accommodation
type: Concept
CoreContentNote: This class includes the provision of temporary accommodation in homes, flats or apartments, as well as single or shared rooms or dormitories for students, seasonal workers and other individuals. This class includes accommodation in: - homes and furnished or unfurnished flats or apartments, for a period shorter than a year - dormitories for workers - boarding houses - student accommodation provided for less than one year at a time - railway sleeping cars when not operated by railway companies
Exclusion Note: This class excludes: - operation of railway sleeping cars as an integrated operation of railway companies, see 49.11 - operation of cruise ships, see 50.10, 50.30 - intermediaries for accommodation, see 55.40 - all forms of accommodation for a period of one year or longer, see 68.20 - intermediation or sale of a combination of accommodation, travel and food, i.e. travel agencies and tour operators, see 79.11, 79.12
broader: Other accommodation
in scheme: Statistical Classification of Economic Activities in the European Community, Rev. 2.1 (NACE Rev. 2.1)
Notation: 55.90
top concept of: Statistical Classification of Economic Activities in the European Community, Rev. 2.1 (NACE Rev. 2.1)

ConceptNoneRandom0.6546362429877391
type: ConceptAssociation
description: NACE Rev. 2.1 section K is mapped to NACE Rev. 2 sections H, J, N
Type: 18:17
Source Concept: TELECOMMUNICATION, COMPUTER PROGRAMMING, CONSULTING, COMPUTING INFRASTRUCTURE AND OTHER INFORMATION SERVICE ACTIVITIES
Target Concept: http://data.europa.eu/ux2/nace2/H
Target Concept: http://data.europa.eu/ux2/nace2/J
Target Concept: http://data.europa.eu/ux2/nace2/N
in scheme: Statistical Classification of Economic Activities in the European Community, Rev. 2.1 (NACE Rev. 2.1)
top concept of: Statistical Classification of Economic Activities in the European Community, Rev. 2.1 (NACE Rev. 2.1)
Mapping Cardinality: n m

ConceptNoneRandom0.21001878210250224
type: ConceptAssociation
description: NACE Rev. 2.1 class 60.20 is mapped to NACE Rev. 2 classes 60.20, 63.11
Type: 78:65
Source Concept: Television programming, broadcasting and video distribution activities
Target Concept: http://data.europa.eu/ux2/nace2/6311
Target Concept: http://data.europa.eu/ux2/nace2/6020
in scheme: Statistical Classification of Economic Activities in the European Community, Rev. 2.1 (NACE Rev. 2.1)
scope note: 60.20: - creation of a complete television channel programme, from purchased programme components (e.g. movies, documentaries etc.), self-produced programme components (e.g. local news, live reports) or a combination thereof. - programming that is made freely available to users, as well as programming that is available only on a subscription basis - programming of video-on-demand channels - data broadcasting integrated with television broadcasting - video streaming and download service activities not associated with its publishing - broadcasting of live performances and events 63.11: - operation of video game streaming sites
top concept of: Statistical Classification of Economic Activities in the European Community, Rev. 2.1 (NACE Rev. 2.1)
Mapping Cardinality: n m

ConceptNoneRandom0.1454202147641046
type: ConceptAssociation
description: NACE Rev. 2.1 class 85.52 is mapped to NACE Rev. 2 class 85.52
Type: 1:1
Source Concept: Cultural education
Target Concept: http://data.europa.eu/ux2/nace2/8552
in scheme: Statistical Classification of Economic Activities in the European Community, Rev. 2.1 (NACE Rev. 2.1)
scope note: the content of the NACE Rev 2.1 class is fully covered in the corresponding NACE Rev 2 class
top concept of: Statistical Classification of Economic Activities in the European Community, Rev. 2.1 (NACE Rev. 2.1)
Mapping Cardinality: 1 1

ConceptNoneRandom0.16711038652748011
type: ConceptAssociation
description: NACE Rev. 2.1 class 01.48 is mapped to NACE Rev. 2 classes 01.49, 03.22
Type: 10:9
Source Concept: Raising of other animals
Target Concept: http://data.europa.eu/ux2/nace2/0149
Target Concept: http://data.europa.eu/ux2/nace2/0322
in scheme: Statistical Classification of Economic Activities in the European Community, Rev. 2.1 (NACE Rev. 2.1)
scope note: 01.49: - raising and breeding of semi-domesticated or other live animals: • birds (except poultry and ostriches) • insects • rabbits and other fur animals • reindeer - production of bird skins from ranching operations or skins from farming reptiles, e.g. snakes and turtles - raising and breeding of reptiles, except crocodiles - operation of land worm farms, land mollusc farms, land snail farms etc. - raising of silk worms, production of silk worm cocoons - beekeeping; production of bees’ byproducts (e.g. honey, beeswax, propolis, bee venom or honeycomb); bee propagation for sale - raising and breeding of pets (except fish), e.g.: • cats and dogs • birds, e.g. parakeets • hamsters 03.22: - aquatic reptiles (saltwater or freshwater)
top concept of: Statistical Classification of Economic Activities in the European Community, Rev. 2.1 (NACE Rev. 2.1)
Mapping Cardinality: n m

ConceptNoneRandom0.3603622958020585
type: ConceptAssociation
description: NACE Rev. 2.1 class 24.10 is mapped to NACE Rev. 2 class 24.10
Type: 1:1
Source Concept: Manufacture of basic iron and steel and of ferro-alloys
Target Concept: http://data.europa.eu/ux2/nace2/2410
in scheme: Statistical Classification of Economic Activities in the European Community, Rev. 2.1 (NACE Rev. 2.1)
scope note: the content of the NACE Rev 2.1 class is fully covered in the corresponding NACE Rev 2 class
top concept of: Statistical Classification of Economic Activities in the European Community, Rev. 2.1 (NACE Rev. 2.1)
Mapping Cardinality: 1 1

Other publishing activities, except software publishing
type: Concept
CoreContentNote: This class includes: - publishing in any format, including print, digital or on the internet, e.g.: • directories and mailing lists • compilations (e.g. case law, pharmaceutical compendia) • catalogues • photographs, engravings and postcards • calendars • greeting cards • forms • posters • reproductions of works of art • non-bound leaflets and advertising material • statistics and other information • datasets/databases without associated data processing services
Exclusion Note: This class excludes: - retail sale of software on physical media, see 47.40 - publishing of advertising newspapers, see 58.12 - publishing of software, see 58.2 - production of video content, see 59.11 - operation of content distribution (sharing) platforms, including blogs and wiki sites, social network sites and online gaming / video game sites, not associated with publishing of the content, see 60.39 - application hosting, see 63.10 - operation of web search portals, see 63.91 - compiling of information or directories on a fee or contract basis, see 63.92
broader: Publishing of books, newspapers and other publishing activities, except software publishing
in scheme: Statistical Classification of Economic Activities in the European Community, Rev. 2.1 (NACE Rev. 2.1)
Notation: 58.19
top concept of: Statistical Classification of Economic Activities in the European Community, Rev. 2.1 (NACE Rev. 2.1)

ConceptNoneRandom0.6073698038311155
type: ConceptAssociation
description: NACE Rev. 2.1 class 47.22 is mapped to NACE Rev. 2 classes 47.22, 47.81, 47.91, 47.99
Type: 78:65
Source Concept: Retail sale of meat and meat products
Target Concept: http://data.europa.eu/ux2/nace2/4791
Target Concept: http://data.europa.eu/ux2/nace2/4781
Target Concept: http://data.europa.eu/ux2/nace2/4722
Target Concept: http://data.europa.eu/ux2/nace2/4799
in scheme: Statistical Classification of Economic Activities in the European Community, Rev. 2.1 (NACE Rev. 2.1)
scope note: 47.22: - retail sale of meat and meat products, including poultry and game - retail sale of tripe, delicatessen (charcuterie), salted meat - retail sale of snail 47.81: - retail sale via stalls and markets of meat and meat products, including poultry and game - retail sale via stalls and markets of tripe, delicatessen (charcuterie), salted meat - retail sale via stalls and markets of snails 47.91: - retail sale via mail order houses or via Internet of meat and meat products, including poultry and game - retail sale via mail order houses or via Internet of tripe, delicatessen (charcuterie), salted meat - retail sale via mail order houses or via Internet of snails 47.99: - retail sale not in stores, stalls or markets of meat and meat products, including poultry and game - retail sale not in stores, stalls or markets of tripe, delicatessen (charcuterie), salted meat - retail sale not in stores, stalls or markets of snails
top concept of: Statistical Classification of Economic Activities in the European Community, Rev. 2.1 (NACE Rev. 2.1)
Mapping Cardinality: n m

ConceptNoneRandom0.9176323697242529
type: ConceptAssociation
description: NACE Rev. 2.1 class 28.94 is mapped to NACE Rev. 2 class 28.94
Type: 1:1
Source Concept: Manufacture of machinery for textile, apparel and leather production
Target Concept: http://data.europa.eu/ux2/nace2/2894
in scheme: Statistical Classification of Economic Activities in the European Community, Rev. 2.1 (NACE Rev. 2.1)
scope note: the content of the NACE Rev 2.1 class is fully covered in the corresponding NACE Rev 2 class
top concept of: Statistical Classification of Economic Activities in the European Community, Rev. 2.1 (NACE Rev. 2.1)
Mapping Cardinality: 1 1

ConceptNoneRandom0.9346257148819936
type: ConceptAssociation
description: NACE Rev. 2.1 class 46.37 is mapped to NACE Rev. 2 class 46.37
Type: 1:1
Source Concept: Wholesale of coffee, tea, cocoa and spices
Target Concept: http://data.europa.eu/ux2/nace2/4637
in scheme: Statistical Classification of Economic Activities in the European Community, Rev. 2.1 (NACE Rev. 2.1)
scope note: the content of the NACE Rev 2.1 class is fully covered in the corresponding NACE Rev 2 class
top concept of: Statistical Classification of Economic Activities in the European Community, Rev. 2.1 (NACE Rev. 2.1)
Mapping Cardinality: 1 1

Manufacture of malt
type: Concept
CoreContentNote: This class includes: - manufacture of malt from barley, wheat, or other grains
Exclusion Note: This class excludes: - manufacture of malt extracts and syrups, see 10.89
broader: Manufacture of beverages
in scheme: Statistical Classification of Economic Activities in the European Community, Rev. 2.1 (NACE Rev. 2.1)
Notation: 11.06
top concept of: Statistical Classification of Economic Activities in the European Community, Rev. 2.1 (NACE Rev. 2.1)

ConceptNoneRandom0.32489456429299024
type: ConceptAssociation
description: NACE Rev. 2.1 group 32.5 is mapped to NACE Rev. 2 groups 32.5, 32.9
Type: 18:19
Source Concept: Manufacture of medical and dental instruments and supplies
Target Concept: http://data.europa.eu/ux2/nace2/325
Target Concept: http://data.europa.eu/ux2/nace2/329
in scheme: Statistical Classification of Economic Activities in the European Community, Rev. 2.1 (NACE Rev. 2.1)
top concept of: Statistical Classification of Economic Activities in the European Community, Rev. 2.1 (NACE Rev. 2.1)
Mapping Cardinality: n m

ConceptNoneRandom0.8994246464165712
type: ConceptAssociation
description: NACE Rev. 2.1 group 41.0 is mapped to NACE Rev. 2 group 41.2
Type: 26:18
Source Concept: Construction of residential and non-residential buildings
Target Concept: http://data.europa.eu/ux2/nace2/412
in scheme: Statistical Classification of Economic Activities in the European Community, Rev. 2.1 (NACE Rev. 2.1)
top concept of: Statistical Classification of Economic Activities in the European Community, Rev. 2.1 (NACE Rev. 2.1)
Mapping Cardinality: n m

Wholesale on a fee or contract basis
type: Concept
Additional Content Note: This group also includes: - activities of central purchasing units if they are only intermediaries and do not own the goods - activities of wholesale auctioneering houses for third-party goods, including internet wholesale auctions
CoreContentNote: This group includes intermediation service activities, in other words, the facilitation of transactions between sellers and buyers for the ordering of goods for a fee or commission without taking ownership of the goods intermediated, including: - activities of commission agents, commodity brokers and other wholesalers trading on the account of others without owning the intermediated goods at any time - activities of bringing sellers and buyers together - activities of undertaking commercial transactions on the account of a principal, including on the internet
Exclusion Note: This group excludes: - wholesale on own account, see 46.2 to 46.9 - activities of commission agents who assume ownership of the goods, even if they are acting in the name of a third party, see 46.2 to 46.9 - intermediation service activities for retail sale, see 47.9 - intermediation service activities for real estate activities, see 68.31 - operation of websites providing searches for goods that link customers to sellers, see the corresponding classes for intermediation service activities - activities of advertising, market research and public relations, see division 73
broader: Wholesale trade
in scheme: Statistical Classification of Economic Activities in the European Community, Rev. 2.1 (NACE Rev. 2.1)
Notation: 46.1
top concept of: Statistical Classification of Economic Activities in the European Community, Rev. 2.1 (NACE Rev. 2.1)

Manufacture of beverages
type: Concept
broader: Manufacture of beverages
in scheme: Statistical Classification of Economic Activities in the European Community, Rev. 2.1 (NACE Rev. 2.1)
Notation: 11.0
top concept of: Statistical Classification of Economic Activities in the European Community, Rev. 2.1 (NACE Rev. 2.1)

Manufacture of other products of first processing of steel
type: Concept
CoreContentNote: This group includes manufacturing other products by cold processing of steel.
broader: Manufacture of basic metals
in scheme: Statistical Classification of Economic Activities in the European Community, Rev. 2.1 (NACE Rev. 2.1)
Notation: 24.3
top concept of: Statistical Classification of Economic Activities in the European Community, Rev. 2.1 (NACE Rev. 2.1)

ConceptNoneRandom0.4527828489928125
type: ConceptAssociation
description: NACE Rev. 2.1 division 97 is mapped to NACE Rev. 2 division 97
Type: 1:1
Source Concept: Activities of households as employers of domestic personnel
Target Concept: http://data.europa.eu/ux2/nace2/97
in scheme: Statistical Classification of Economic Activities in the European Community, Rev. 2.1 (NACE Rev. 2.1)
top concept of: Statistical Classification of Economic Activities in the European Community, Rev. 2.1 (NACE Rev. 2.1)
Mapping Cardinality: 1 1

ConceptNoneRandom0.45145646306685827
type: ConceptAssociation
description: NACE Rev. 2.1 class 59.20 is mapped to NACE Rev. 2 class 59.20
Type: 1:1
Source Concept: Sound recording and music publishing activities
Target Concept: http://data.europa.eu/ux2/nace2/5920
in scheme: Statistical Classification of Economic Activities in the European Community, Rev. 2.1 (NACE Rev. 2.1)
scope note: the content of the NACE Rev 2.1 class is fully covered in the corresponding NACE Rev 2 class
top concept of: Statistical Classification of Economic Activities in the European Community, Rev. 2.1 (NACE Rev. 2.1)
Mapping Cardinality: 1 1

Sewerage
type: Concept
Additional Content Note: This division also includes the operation of wastewater treatment facilities for reuse (for example, agricultural, industrial and road cleaning wastewater or collected rainwater).
CoreContentNote: This division includes the operation of sewerage systems or sewage treatment facilities, which collect, treat and discharge sewage into water bodies or operate surface impoundment.
broader: WATER SUPPLY; SEWERAGE, WASTE MANAGEMENT AND REMEDIATION ACTIVITIES
in scheme: Statistical Classification of Economic Activities in the European Community, Rev. 2.1 (NACE Rev. 2.1)
Notation: 37
top concept of: Statistical Classification of Economic Activities in the European Community, Rev. 2.1 (NACE Rev. 2.1)

Manufacture of lighting equipment
type: Concept
CoreContentNote: This class includes the manufacture of electric light bulbs and tubes, and parts and components thereof (except glass blanks for electric light bulbs), electric lighting and other fixtures, and lighting fixture components (except current-carrying wiring devices). This class includes: - manufacture of lamps, fixtures and bulbs (e.g. discharge, incandescent, fluorescent, ultraviolet, infra-red, light-emitting diode (LED)) - manufacture of ceiling or wall lighting fixtures (e.g. chandeliers) - manufacture of table or floor-standing lamps (i.e. lighting fixtures) - manufacture of light chains - manufacture of electric fireplace logs - manufacture of flashlights - manufacture of electric insect lamps - manufacture of lanterns (e.g. carbide, electric, gas, gasoline, kerosene) - manufacture of spotlights - manufacture of street lighting fixtures (except traffic signals) - manufacture of lighting equipment for transport equipment (e.g. for motor vehicles, aircraft, boats) - manufacture of solar lighting equipment
Exclusion Note: This class excludes: - manufacture of glassware and glass parts for lighting fixtures, see 23.15 - manufacture of light-emitting diodes (LEDs), see 26.11 - manufacture of current-carrying and non-current-carrying wiring devices for lighting fixtures, see 27.33 - manufacture of ceiling fans or bath fans with integrated lighting fixtures, see 27.51 - manufacture of electrical signalling equipment (e.g. traffic lights and pedestrian signalling equipment), see 27.90 - manufacture of electrical signs, see 27.90
broader: Manufacture of lighting equipment
in scheme: Statistical Classification of Economic Activities in the European Community, Rev. 2.1 (NACE Rev. 2.1)
Notation: 27.40
top concept of: Statistical Classification of Economic Activities in the European Community, Rev. 2.1 (NACE Rev. 2.1)

ConceptNoneRandom0.03159703793962054
type: ConceptAssociation
description: NACE Rev. 2.1 group 10.7 is mapped to NACE Rev. 2 groups 10.7, 10.8
Type: 4:4
Source Concept: Manufacture of bakery and farinaceous products
Target Concept: http://data.europa.eu/ux2/nace2/108
Target Concept: http://data.europa.eu/ux2/nace2/107
in scheme: Statistical Classification of Economic Activities in the European Community, Rev. 2.1 (NACE Rev. 2.1)
top concept of: Statistical Classification of Economic Activities in the European Community, Rev. 2.1 (NACE Rev. 2.1)
Mapping Cardinality: n m

Growing of oleaginous fruits
type: Concept
CoreContentNote: This class includes: - growing of oleaginous fruits, e.g.: • coconuts • olives • oil palms
Exclusion Note: This class excludes: - growing of soya beans, groundnuts and other oil seeds, see 01.11 - growing of nuts for oil (e.g. walnuts, almonds, hazelnuts, pine nuts or pistachios), see 01.25
broader: Growing of perennial crops
in scheme: Statistical Classification of Economic Activities in the European Community, Rev. 2.1 (NACE Rev. 2.1)
Notation: 01.26
top concept of: Statistical Classification of Economic Activities in the European Community, Rev. 2.1 (NACE Rev. 2.1)

Manufacture of other tanks, reservoirs and containers of metal
type: Concept
CoreContentNote: This class includes: - manufacture of reservoirs, tanks, vats and similar containers of metal of a capacity exceeding 300 litres, whether or not lined or heat-insulated - manufacture of metal containers for compressed or liquefied gas
Exclusion Note: This class excludes: - manufacture of metal casks, drums, cans, pails, boxes, etc., of a kind normally used for carrying and packing of goods, of a capacity not exceeding 300 litres, see 25.91, 25.92 - manufacture of transport containers, see 29.20 - manufacture of tanks (armoured military vehicles), see 30.40
broader: Manufacture of tanks, reservoirs and containers of metal
in scheme: Statistical Classification of Economic Activities in the European Community, Rev. 2.1 (NACE Rev. 2.1)
Notation: 25.22
top concept of: Statistical Classification of Economic Activities in the European Community, Rev. 2.1 (NACE Rev. 2.1)

ConceptNoneRandom0.2644284777621114
type: ConceptAssociation
description: NACE Rev. 2.1 class 85.53 is mapped to NACE Rev. 2 class 85.53
Type: 1:1
Source Concept: Driving school activities
Target Concept: http://data.europa.eu/ux2/nace2/8553
in scheme: Statistical Classification of Economic Activities in the European Community, Rev. 2.1 (NACE Rev. 2.1)
scope note: the content of the NACE Rev 2.1 class is fully covered in the corresponding NACE Rev 2 class
top concept of: Statistical Classification of Economic Activities in the European Community, Rev. 2.1 (NACE Rev. 2.1)
Mapping Cardinality: 1 1

ConceptNoneRandom0.44173761010945867
type: ConceptAssociation
description: NACE Rev. 2.1 class 35.24 is mapped to NACE Rev. 2 class 52.10
Type: 78:65
Source Concept: Storage of gas as part of network supply services
Target Concept: http://data.europa.eu/ux2/nace2/5210
in scheme: Statistical Classification of Economic Activities in the European Community, Rev. 2.1 (NACE Rev. 2.1)
scope note: the content of the NACE Rev 2.1 class is fully covered in the corresponding NACE Rev 2 class
top concept of: Statistical Classification of Economic Activities in the European Community, Rev. 2.1 (NACE Rev. 2.1)
Mapping Cardinality: n m

Water collection, treatment and supply
type: Concept
CoreContentNote: This division includes the collection, treatment and distribution of water to the end user. Collection of water from various sources, as well as distribution by various means is included.
broader: WATER SUPPLY; SEWERAGE, WASTE MANAGEMENT AND REMEDIATION ACTIVITIES
in scheme: Statistical Classification of Economic Activities in the European Community, Rev. 2.1 (NACE Rev. 2.1)
Notation: 36
top concept of: Statistical Classification of Economic Activities in the European Community, Rev. 2.1 (NACE Rev. 2.1)

Silviculture and other forestry activities
type: Concept
CoreContentNote: This class includes: - growing of standing timber: planting, replanting, transplanting, thinning and conserving of forests, and timber tracts - growing of coppice, pulpwood and firewood - operation of forest tree nurseries - growing of poplar and willow These activities can be carried out in natural, semi-natural or planted forests.
Exclusion Note: This class excludes: - growing of Christmas trees, see 01.29 - operation of tree nurseries, except for forest trees, see 01.30 - gathering of mushrooms and other wild growing non-wood forest products, see 02.30 - production of wood chips and particles, not associated with forestry activities, see 16.11 - production of wood fire logs not associated with forestry activities, see 16.26 - activities relating to amenity tree care and arboriculture, see 81.30 - conservation and maintenance services of national parks, nature parks and reserves, see 91.42
broader: Silviculture and other forestry activities
in scheme: Statistical Classification of Economic Activities in the European Community, Rev. 2.1 (NACE Rev. 2.1)
Notation: 02.10
top concept of: Statistical Classification of Economic Activities in the European Community, Rev. 2.1 (NACE Rev. 2.1)

ConceptNoneRandom0.8392095277753767
type: ConceptAssociation
description: NACE Rev. 2.1 section N is mapped to NACE Rev. 2 section M
Type: 18:17
Source Concept: PROFESSIONAL, SCIENTIFIC AND TECHNICAL ACTIVITIES
Target Concept: http://data.europa.eu/ux2/nace2/M
in scheme: Statistical Classification of Economic Activities in the European Community, Rev. 2.1 (NACE Rev. 2.1)
top concept of: Statistical Classification of Economic Activities in the European Community, Rev. 2.1 (NACE Rev. 2.1)
Mapping Cardinality: n m

ConceptNoneRandom0.2746310312309307
type: ConceptAssociation
description: NACE Rev. 2.1 class 47.21 is mapped to NACE Rev. 2 classes 47.21, 47.81, 47.91, 47.99
Type: 78:65
Source Concept: Retail sale of fruit and vegetables
Target Concept: http://data.europa.eu/ux2/nace2/4791
Target Concept: http://data.europa.eu/ux2/nace2/4781
Target Concept: http://data.europa.eu/ux2/nace2/4799
Target Concept: http://data.europa.eu/ux2/nace2/4721
in scheme: Statistical Classification of Economic Activities in the European Community, Rev. 2.1 (NACE Rev. 2.1)
scope note: 47.21: - retail sale of fresh fruit and vegetables, including cut fresh fruit and vegetables - retail sale of dried and preserved fruits and vegetables 47.81: - retail sale via stalls and markets of fresh fruit and vegetables, including cut fresh fruit and vegetables - retail sale via stalls and markets of dried and preserved fruits and vegetables 47.91: - retail sale via mail order houses or via Internet of fresh fruit and vegetables, including cut fresh fruit and vegetables - retail sale via mail order houses or via Internet of dried and preserved fruits and vegetables 47.99: - retail sale not in stores, stalls or markets of fresh fruit and vegetables, including cut fresh fruit and vegetables - retail sale not in stores, stalls or markets of dried and preserved fruits and vegetables
top concept of: Statistical Classification of Economic Activities in the European Community, Rev. 2.1 (NACE Rev. 2.1)
Mapping Cardinality: n m

ConceptNoneRandom0.07119462314463032
type: ConceptAssociation
description: NACE Rev. 2.1 class 47.23 is mapped to NACE Rev. 2 classes 47.23, 47.81, 47.91, 47.99
Type: 78:65
Source Concept: Retail sale of fish, crustaceans and molluscs
Target Concept: http://data.europa.eu/ux2/nace2/4791
Target Concept: http://data.europa.eu/ux2/nace2/4781
Target Concept: http://data.europa.eu/ux2/nace2/4799
Target Concept: http://data.europa.eu/ux2/nace2/4723
in scheme: Statistical Classification of Economic Activities in the European Community, Rev. 2.1 (NACE Rev. 2.1)
scope note: 47.23: - retail sale of fish, seafood, seafood products and preparations thereof - retail sale of algae and seaweed 47.81: - retail sale via stalls and markets of fish, seafood, seafood products and preparations thereof - retail sale via stalls and markets of algae and seaweed 47.91: - retail sale via mail order houses or via Internet of fish, seafood, seafood products and preparations thereof - retail sale via mail order houses or via Internet of algae and seaweed 47.99: - retail sale not in stores, stalls or markets of fish, seafood, seafood products and preparations thereof - retail sale not in stores, stalls or markets of algae and seaweed
top concept of: Statistical Classification of Economic Activities in the European Community, Rev. 2.1 (NACE Rev. 2.1)
Mapping Cardinality: n m

Security activities n.e.c.
type: Concept
Additional Content Note: This class also includes: - security consultants’ activities - activities in an emergency call and service centre or alarm receiving centre (ARC) - monitoring and remote monitoring of electronic security systems (e.g. burglar alarms, video surveillance systems, fire alarms) - monitoring and remote monitoring of mechanical or electronic locking devices, safes and vaults - installation and maintenance of electronic security systems, (e.g. burglar or theft alarms, video surveillance systems, fire alarms), if provided in connection with later monitoring and remote monitoring services - installation, repair, modification and adaptation of mechanical or electronic locking devices, electronic security systems, safes and vaults, if provided in connection with later monitoring and remote monitoring services
CoreContentNote: This class includes the provision of one or more of the following services: security system services as part of security service centres or alarm receiving centres (ARC); remote monitoring and video surveillance systems services; and – only if provided in connection with later monitoring and remote monitoring services – installation, repair and maintenance of electronic security systems.
Exclusion Note: This class excludes: - installation of security systems (e.g. burglar alarms, surveillance systems, fire alarms), without later monitoring and remote monitoring services, see 43.21 - retail sale of electrical security alarm systems, mechanical or electronic locking devices, safes and security vaults, without later monitoring, installation or maintenance services, see 47.52 - cybersecurity consulting activities, see 62.20 - public order and safety activities (e.g. policing), see 84.24 - providing key duplication services, see 95.29
broader: Investigation and security activities
in scheme: Statistical Classification of Economic Activities in the European Community, Rev. 2.1 (NACE Rev. 2.1)
Notation: 80.09
top concept of: Statistical Classification of Economic Activities in the European Community, Rev. 2.1 (NACE Rev. 2.1)

Manufacture of soft drinks and bottled waters
type: Concept
Additional Content Note: This class also includes: - manufacture of beverages produced with fruit nectars - production of plant-based milk substitutes (e.g. coconut, rice, almond, soya-based beverages)
CoreContentNote: This class includes the manufacture of non-alcoholic beverages (except non-alcoholic beer and wine): - production of natural mineral waters and other bottled waters - manufacture of soft drinks: • non-alcoholic flavoured and/or sweetened waters: lemonade, orangeade, cola, fruit drinks, tonic waters, etc. - manufacture of other non-alcoholic beverages
Exclusion Note: This class excludes: - production of fruit and vegetable juice, see 10.32 - production of concentrates from fresh fruits and vegetables, see 10.32 - manufacture of milk-based drinks, see 10.51 - manufacture of coffee, tea and maté products, see 10.83 - manufacture of alcohol-based drinks, see 11.01 to 11.05 - manufacture of non-alcoholic wine, see 11.02 - manufacture of non-alcoholic beer, see 11.05 - merely bottling and labelling, see 46.34 (if performed as part of wholesale) and 82.92 (if performed on a fee or contract basis)
broader: Manufacture of beverages
in scheme: Statistical Classification of Economic Activities in the European Community, Rev. 2.1 (NACE Rev. 2.1)
Notation: 11.07
top concept of: Statistical Classification of Economic Activities in the European Community, Rev. 2.1 (NACE Rev. 2.1)

ConceptNoneRandom0.8430024480972659
type: ConceptAssociation
description: NACE Rev. 2.1 class 28.95 is mapped to NACE Rev. 2 class 28.95
Type: 1:1
Source Concept: Manufacture of machinery for paper and paperboard production
Target Concept: http://data.europa.eu/ux2/nace2/2895
in scheme: Statistical Classification of Economic Activities in the European Community, Rev. 2.1 (NACE Rev. 2.1)
scope note: the content of the NACE Rev 2.1 class is fully covered in the corresponding NACE Rev 2 class
top concept of: Statistical Classification of Economic Activities in the European Community, Rev. 2.1 (NACE Rev. 2.1)
Mapping Cardinality: 1 1

ConceptNoneRandom0.10170655217518165
type: ConceptAssociation
description: NACE Rev. 2.1 class 46.38 is mapped to NACE Rev. 2 class 46.38
Type: 2:2
Source Concept: Wholesale of other food
Target Concept: http://data.europa.eu/ux2/nace2/4638
in scheme: Statistical Classification of Economic Activities in the European Community, Rev. 2.1 (NACE Rev. 2.1)
scope note: the content of the NACE Rev 2.1 class is fully covered in the corresponding NACE Rev 2 class
top concept of: Statistical Classification of Economic Activities in the European Community, Rev. 2.1 (NACE Rev. 2.1)
Mapping Cardinality: n m

ConceptNoneRandom0.9686519878778691
type: ConceptAssociation
description: NACE Rev. 2.1 division 96 is mapped to NACE Rev. 2 divisions 81, 82, 96
Type: 48:49
Source Concept: Personal service activities
Target Concept: http://data.europa.eu/ux2/nace2/81
Target Concept: http://data.europa.eu/ux2/nace2/82
Target Concept: http://data.europa.eu/ux2/nace2/96
in scheme: Statistical Classification of Economic Activities in the European Community, Rev. 2.1 (NACE Rev. 2.1)
top concept of: Statistical Classification of Economic Activities in the European Community, Rev. 2.1 (NACE Rev. 2.1)
Mapping Cardinality: n m

Wholesale of agricultural raw materials and live animals
type: Concept
Exclusion Note: This group excludes: - activities of wholesalers who do not assume ownership of the goods they trade, see 46.1
broader: Wholesale trade
in scheme: Statistical Classification of Economic Activities in the European Community, Rev. 2.1 (NACE Rev. 2.1)
Notation: 46.2
top concept of: Statistical Classification of Economic Activities in the European Community, Rev. 2.1 (NACE Rev. 2.1)

Waste collection, recovery and disposal activities
type: Concept
Additional Content Note: This division also includes: - local hauling of waste materials and the operation of materials recovery facilities, i.e. facilities that transform waste, including scrap, whether sorted or not, into secondary raw materials - activities of units implementing producer responsibility obligations for the management of waste on behalf of the original waste producers. These organisations usually bear the responsibility for the treatment of waste, delegated to them from the original producers of products or packaging. Activities may include the operation of return, collection and recovery systems for used packaging or packaging waste or for the acceptance and treatment of returned or used products.
CoreContentNote: This division includes the collection, pretreatment for recovery or disposal, recovery and disposal of waste materials and its organisation. Collection of waste which solely supports the subsequent recovery or disposal of the collected waste by the same unit is to be regarded as waste recovery or as a disposal activity.
Exclusion Note: This division excludes: - wholesale of waste, see division 46
broader: WATER SUPPLY; SEWERAGE, WASTE MANAGEMENT AND REMEDIATION ACTIVITIES
in scheme: Statistical Classification of Economic Activities in the European Community, Rev. 2.1 (NACE Rev. 2.1)
Notation: 38
top concept of: Statistical Classification of Economic Activities in the European Community, Rev. 2.1 (NACE Rev. 2.1)

Computer consultancy and computer facilities management activities
type: Concept
Additional Content Note: This class also includes: - cybersecurity network and system monitoring, testing and analysis - provision of advice on software requirements and procurement of the hardware and software components of a computer system
CoreContentNote: This class includes: - computer hardware, software and systems consultancy activities, including cybersecurity consultancy activities - planning and designing of computer systems which integrate computer hardware, software and communication technologies - provision of on-site management and operation of clients’ computer systems and/or data processing facilities, as well as related support services - installation of computer systems and provision of training and support to users of such systems - activities of auditing and certification of computing and data processing infrastructures and services
Exclusion Note: This class excludes: - installation of mainframe and similar computers, see 33.20 - sale of computer hardware or software on physical media, see 46.50, 47.40 - software publishing, see 58.2 - installation (setting-up) of personal computers, see 62.90 - software installation, see 62.90 - computer disaster recovery services, see 62.90 - general cybersecurity training, see 85.59
broader: Computer consultancy and computer facilities management activities
in scheme: Statistical Classification of Economic Activities in the European Community, Rev. 2.1 (NACE Rev. 2.1)
Notation: 62.20
top concept of: Statistical Classification of Economic Activities in the European Community, Rev. 2.1 (NACE Rev. 2.1)

Growing of beverage crops
type: Concept
CoreContentNote: This class includes: - growing of beverage crops e.g.: • coffee • tea • maté • cocoa
Exclusion Note: This class excludes: - growing of grapes, see 01.21 - growing of hops, see 01.28
broader: Growing of perennial crops
in scheme: Statistical Classification of Economic Activities in the European Community, Rev. 2.1 (NACE Rev. 2.1)
Notation: 01.27
top concept of: Statistical Classification of Economic Activities in the European Community, Rev. 2.1 (NACE Rev. 2.1)

Manufacture of basic precious and other non-ferrous metals
type: Concept
broader: Manufacture of basic metals
in scheme: Statistical Classification of Economic Activities in the European Community, Rev. 2.1 (NACE Rev. 2.1)
Notation: 24.4
top concept of: Statistical Classification of Economic Activities in the European Community, Rev. 2.1 (NACE Rev. 2.1)

ConceptNoneRandom0.25875118975524314
type: ConceptAssociation
description: NACE Rev. 2.1 group 10.8 is mapped to NACE Rev. 2 group 10.8
Type: 4:4
Source Concept: Manufacture of other food products
Target Concept: http://data.europa.eu/ux2/nace2/108
in scheme: Statistical Classification of Economic Activities in the European Community, Rev. 2.1 (NACE Rev. 2.1)
top concept of: Statistical Classification of Economic Activities in the European Community, Rev. 2.1 (NACE Rev. 2.1)
Mapping Cardinality: n m

Manufacture of central heating radiators, steam generators and boilers
type: Concept
CoreContentNote: This class includes: - manufacture of radiators for central heating, non-electrically heated - manufacture of steam or other vapour generating boilers - manufacture of auxiliary plant for use with steam or other vapour generating boilers (e.g. economisers, super heaters, steam collectors and accumulators) - manufacture of condensers for steam or other vapour power units - manufacture of nuclear reactors, except isotope separators - manufacture of marine or power boilers
Exclusion Note: This class excludes: - manufacture of electrical ovens and water heaters, see 27.51 - manufacture of boiler turbine sets, see 28.11 - manufacture of household heating equipment, see 28.21 - manufacture of isotope separators, see 28.99
broader: Manufacture of tanks, reservoirs and containers of metal
in scheme: Statistical Classification of Economic Activities in the European Community, Rev. 2.1 (NACE Rev. 2.1)
Notation: 25.21
top concept of: Statistical Classification of Economic Activities in the European Community, Rev. 2.1 (NACE Rev. 2.1)

Scope Note

ConceptNoneRandom0.2318680060275894
type: ConceptAssociation
description: NACE Rev. 2.1 class 84.21 is mapped to NACE Rev. 2 class 84.21
Type: 1:1
Source Concept: Foreign affairs
Target Concept: http://data.europa.eu/ux2/nace2/8421
in scheme: Statistical Classification of Economic Activities in the European Community, Rev. 2.1 (NACE Rev. 2.1)
scope note: the content of the NACE Rev 2.1 class is fully covered in the corresponding NACE Rev 2 class
top concept of: Statistical Classification of Economic Activities in the European Community, Rev. 2.1 (NACE Rev. 2.1)
Mapping Cardinality: 1 1

Repair and maintenance of computers and communication equipment
type: Concept
Additional Content Note: This class also includes: - repair and maintenance of computer terminals like automatic teller machines (ATMs) and point-of-sale (POS) terminals, not mechanically operated - repair and maintenance of handheld computers (personal digital assistants (PDAs))
CoreContentNote: This class includes the repair and maintenance of electronic equipment (for example, computers and computing machinery, peripheral and communication equipment). This class includes the repair and maintenance of: - desktop computers - laptop computers - magnetic disc drives and flash drives - optical disc drives - renovation of discs - printers - monitors - keyboards - webcams - headsets, including in-ear wireless headsets - mice, joysticks and trackball accessories - internal and external computer modems - dedicated computer terminals - computer servers - scanners, including barcode scanners - smart card readers - virtual reality helmets/headsets - computer projectors - cordless telephones - smart telephones and tablets - telecommunication carrier equipment - communication transmission equipment (e.g. routers, bridges, modems) - two-way radios - commercial television and video cameras
Exclusion Note: This class excludes: - refilling of ink and toner cartridges by retail sellers, see 47.40 - repair and maintenance of consumer electronics, see 95.21
broader: Repair and maintenance of computers and communication equipment
in scheme: Statistical Classification of Economic Activities in the European Community, Rev. 2.1 (NACE Rev. 2.1)
Notation: 95.10
top concept of: Statistical Classification of Economic Activities in the European Community, Rev. 2.1 (NACE Rev. 2.1)

ConceptNoneRandom0.5174123023120932
type: ConceptAssociation
description: NACE Rev. 2.1 section M is mapped to NACE Rev. 2 sections F, L
Type: 18:17
Source Concept: REAL ESTATE ACTIVITIES
Target Concept: http://data.europa.eu/ux2/nace2/F
Target Concept: http://data.europa.eu/ux2/nace2/L
in scheme: Statistical Classification of Economic Activities in the European Community, Rev. 2.1 (NACE Rev. 2.1)
top concept of: Statistical Classification of Economic Activities in the European Community, Rev. 2.1 (NACE Rev. 2.1)
Mapping Cardinality: n m

ConceptNoneRandom0.3462771959438642
type: ConceptAssociation
description: NACE Rev. 2.1 class 28.96 is mapped to NACE Rev. 2 class 28.96
Type: 3:2
Source Concept: Manufacture of plastics and rubber machinery
Target Concept: http://data.europa.eu/ux2/nace2/2896
in scheme: Statistical Classification of Economic Activities in the European Community, Rev. 2.1 (NACE Rev. 2.1)
scope note: the content of the NACE Rev 2.1 class is fully covered in the corresponding NACE Rev 2 class
top concept of: Statistical Classification of Economic Activities in the European Community, Rev. 2.1 (NACE Rev. 2.1)
Mapping Cardinality: n m

Manufacture of other non-distilled fermented beverages
type: Concept
CoreContentNote: This class includes: - manufacture of aromatised wine of fresh grapes, flavoured with aromatic substances (e.g. vermouth)
Exclusion Note: This class excludes: - merely bottling and labelling, see 46.34 (if performed as part of wholesale) and 82.92 (if performed on a fee or contract basis)
broader: Manufacture of beverages
in scheme: Statistical Classification of Economic Activities in the European Community, Rev. 2.1 (NACE Rev. 2.1)
Notation: 11.04
top concept of: Statistical Classification of Economic Activities in the European Community, Rev. 2.1 (NACE Rev. 2.1)

ConceptNoneRandom0.6476224009585783
type: ConceptAssociation
description: NACE Rev. 2.1 class 08.91 is mapped to NACE Rev. 2 class 08.91
Type: 1:1
Source Concept: Mining of chemical and fertiliser minerals
Target Concept: http://data.europa.eu/ux2/nace2/0891
in scheme: Statistical Classification of Economic Activities in the European Community, Rev. 2.1 (NACE Rev. 2.1)
scope note: the content of the NACE Rev 2.1 class is fully covered in the corresponding NACE Rev 2 class
top concept of: Statistical Classification of Economic Activities in the European Community, Rev. 2.1 (NACE Rev. 2.1)
Mapping Cardinality: 1 1

ConceptNoneRandom0.16600680434500914
type: ConceptAssociation
description: NACE Rev. 2.1 group 50.1 is mapped to NACE Rev. 2 group 50.1
Type: 1:1
Source Concept: Sea and coastal passenger water transport
Target Concept: http://data.europa.eu/ux2/nace2/501
in scheme: Statistical Classification of Economic Activities in the European Community, Rev. 2.1 (NACE Rev. 2.1)
top concept of: Statistical Classification of Economic Activities in the European Community, Rev. 2.1 (NACE Rev. 2.1)
Mapping Cardinality: 1 1

ConceptNoneRandom0.4631923917006955
type: ConceptAssociation
description: NACE Rev. 2.1 division 91 is mapped to NACE Rev. 2 divisions 33, 41, 90, 91
Type: 48:49
Source Concept: Libraries, archives, museums and other cultural activities
Target Concept: http://data.europa.eu/ux2/nace2/90
Target Concept: http://data.europa.eu/ux2/nace2/91
Target Concept: http://data.europa.eu/ux2/nace2/41
Target Concept: http://data.europa.eu/ux2/nace2/33
in scheme: Statistical Classification of Economic Activities in the European Community, Rev. 2.1 (NACE Rev. 2.1)
top concept of: Statistical Classification of Economic Activities in the European Community, Rev. 2.1 (NACE Rev. 2.1)
Mapping Cardinality: n m

ConceptNoneRandom0.2159125854530628
type: ConceptAssociation
description: NACE Rev. 2.1 group 85.2 is mapped to NACE Rev. 2 group 85.2
Type: 1:1
Source Concept: Primary education
Target Concept: http://data.europa.eu/ux2/nace2/852
in scheme: Statistical Classification of Economic Activities in the European Community, Rev. 2.1 (NACE Rev. 2.1)
top concept of: Statistical Classification of Economic Activities in the European Community, Rev. 2.1 (NACE Rev. 2.1)
Mapping Cardinality: 1 1

Sound recording and music publishing activities
type: Concept
broader: Motion picture, video and television programme production, sound recording and music publishing activities
in scheme: Statistical Classification of Economic Activities in the European Community, Rev. 2.1 (NACE Rev. 2.1)
Notation: 59.2
top concept of: Statistical Classification of Economic Activities in the European Community, Rev. 2.1 (NACE Rev. 2.1)

Gathering of wild growing non-wood products
type: Concept
broader: Forestry and logging
in scheme: Statistical Classification of Economic Activities in the European Community, Rev. 2.1 (NACE Rev. 2.1)
Notation: 02.3
top concept of: Statistical Classification of Economic Activities in the European Community, Rev. 2.1 (NACE Rev. 2.1)

Manufacture of basic iron and steel and of ferro-alloys
type: Concept
broader: Manufacture of basic metals
in scheme: Statistical Classification of Economic Activities in the European Community, Rev. 2.1 (NACE Rev. 2.1)
Notation: 24.1
top concept of: Statistical Classification of Economic Activities in the European Community, Rev. 2.1 (NACE Rev. 2.1)

ConceptNoneRandom0.24905263782175358
type: ConceptAssociation
description: NACE Rev. 2.1 class 38.33 is mapped to NACE Rev. 2 classes 38.21, 38.22
Type: 7:5
Source Concept: Other waste disposal
Target Concept: http://data.europa.eu/ux2/nace2/3821
Target Concept: http://data.europa.eu/ux2/nace2/3822
in scheme: Statistical Classification of Economic Activities in the European Community, Rev. 2.1 (NACE Rev. 2.1)
scope note: 38.21: - release of liquid waste to seas/oceans or other water body including sea-bed insertion - injection of pumpable discards into wells, salt domes or naturally occurring repositories 38.22: - release of liquid waste to seas/oceans or other water body including sea-bed insertion - injection of pumpable discards into wells, salt domes or naturally occurring repositories
top concept of: Statistical Classification of Economic Activities in the European Community, Rev. 2.1 (NACE Rev. 2.1)
Mapping Cardinality: n m

ConceptNoneRandom0.43427882479148516
type: ConceptAssociation
description: NACE Rev. 2.1 class 37.00 is mapped to NACE Rev. 2 class 37.00
Type: 1:1
Source Concept: Sewerage
Target Concept: http://data.europa.eu/ux2/nace2/3700
in scheme: Statistical Classification of Economic Activities in the European Community, Rev. 2.1 (NACE Rev. 2.1)
scope note: the content of the NACE Rev 2.1 class is fully covered in the corresponding NACE Rev 2 class
top concept of: Statistical Classification of Economic Activities in the European Community, Rev. 2.1 (NACE Rev. 2.1)
Mapping Cardinality: 1 1

Manufacture of other special-purpose machinery
type: Concept
Additional Content Note: While most of this special-purpose machinery is used in other manufacturing processes (for example, food manufacturing or textile manufacturing), this group also includes the manufacture of machinery specific for other non-manufacturing industries (for example, aircraft launching gear or amusement park equipment).
CoreContentNote: This group includes the manufacture of special-purpose machinery, in other words, machinery for exclusive use in a NACE industry or a small cluster of NACE industries.
broader: Manufacture of machinery and equipment n.e.c.
in scheme: Statistical Classification of Economic Activities in the European Community, Rev. 2.1 (NACE Rev. 2.1)
Notation: 28.9
top concept of: Statistical Classification of Economic Activities in the European Community, Rev. 2.1 (NACE Rev. 2.1)

Employment activities
type: Concept
CoreContentNote: This division includes activities of listing employment vacancies and referring or placing applicants for employment where the individuals referred or placed are not employees of the employment agencies, activities supplying workers to clients’ businesses for periods of time to supplement the workforce of the client, and activities of providing other human resources. This division includes: - personnel search and placement activities - activities of theatrical casting agencies - activities of recruitment agencies - headhunting activities
Exclusion Note: This division excludes: - activities of agents for individual artists, see 74.99
broader: ADMINISTRATIVE AND SUPPORT SERVICE ACTIVITIES
in scheme: Statistical Classification of Economic Activities in the European Community, Rev. 2.1 (NACE Rev. 2.1)
Notation: 78
top concept of: Statistical Classification of Economic Activities in the European Community, Rev. 2.1 (NACE Rev. 2.1)

ConceptNoneRandom0.13710745206441277
type: ConceptAssociation
description: NACE Rev. 2.1 class 61.10 is mapped to NACE Rev. 2 classes 61.10, 61.20, 61.30
Type: 78:65
Source Concept: Wired, wireless, and satellite telecommunication activities
Target Concept: http://data.europa.eu/ux2/nace2/6120
Target Concept: http://data.europa.eu/ux2/nace2/6130
Target Concept: http://data.europa.eu/ux2/nace2/6110
in scheme: Statistical Classification of Economic Activities in the European Community, Rev. 2.1 (NACE Rev. 2.1)
scope note: 61.10: - operating, maintaining or providing access to facilities for the transmission of voice, data, text, sound and video using a wired telecommunication infrastructure, including: • operating and maintaining switching and transmission facilities to provide point-to-point communication via landlines, microwave or a combination of landlines and satellite linkups • operating of cable distribution systems (e.g. for distribution of data and television signals) • furnishing telegraph and other non-vocal communications using own facilities - provision of internet access by the operator of the wired infrastructure 61.20: - operating, maintaining or providing access to facilities for the transmission of voice, data, text, sound, and video using a wireless telecommunication infrastructure - maintaining and operating paging as well as cellular and other wireless telecommunications networks - purchasing access and network capacity from owners and operators of networks and providing wireless telecommunications services (except satellite) using this capacity to businesses and households - provision of internet access by the operator of the wireless infrastructure 61.30: - operating, maintaining or providing access to facilities for the transmission of voice, data, text, sound and video using a satellite telecommunication infrastructure - delivery of visual, aural or textual programming received from cable networks, local television stations or radio networks to consumers via direct-to-home satellite systems. (The units classified here do not generally originate programming material.) - provision of internet access by the operator of the satellite infrastructure - voice over internet protocol (VoIP) provision by the operator of the infrastructure
top concept of: Statistical Classification of Economic Activities in the European Community, Rev. 2.1 (NACE Rev. 2.1)
Mapping Cardinality: n m

Growing of citrus fruits
type: Concept
CoreContentNote: This class includes: - growing of citrus fruits, e.g.: • grapefruit and pomelo • lemons and limes • oranges • tangerines, mandarins and clementines
broader: Growing of perennial crops
in scheme: Statistical Classification of Economic Activities in the European Community, Rev. 2.1 (NACE Rev. 2.1)
Notation: 01.23
top concept of: Statistical Classification of Economic Activities in the European Community, Rev. 2.1 (NACE Rev. 2.1)

ConceptNoneRandom0.9747634885894204
type: ConceptAssociation
description: NACE Rev. 2.1 class 15.20 is mapped to NACE Rev. 2 classes 15.20, 16.29, 22.19, 22.29
Type: 17:12
Source Concept: Manufacture of footwear
Target Concept: http://data.europa.eu/ux2/nace2/2219
Target Concept: http://data.europa.eu/ux2/nace2/2229
Target Concept: http://data.europa.eu/ux2/nace2/1629
Target Concept: http://data.europa.eu/ux2/nace2/1520
in scheme: Statistical Classification of Economic Activities in the European Community, Rev. 2.1 (NACE Rev. 2.1)
scope note: 15.20: - manufacture of footwear for all purposes, of any material, by any process, including moulding (see below for exceptions) - manufacture of leather parts of footwear e.g. manufacture of uppers and parts of uppers, outer and inner soles, heels - manufacture of gaiters, chaps and similar articles - manufacture of rubber, wooden or plastic parts of footwear 16.29: - manufacture of wooden shoe parts 22.19: - manufacture of rubber parts of footwear 22.29: - manufacture of plastic parts of footwear
top concept of: Statistical Classification of Economic Activities in the European Community, Rev. 2.1 (NACE Rev. 2.1)
Mapping Cardinality: n m

Manufacture of other transport equipment
type: Concept
CoreContentNote: This division includes the manufacture of transport equipment (for example, shipbuilding and boat manufacturing, the manufacture of railway rolling stock and locomotives, air and spacecraft, motorcycles, bicycles and other cycles, and the manufacture of parts thereof) whose manufacture is not elsewhere classified.
broader: MANUFACTURING
in scheme: Statistical Classification of Economic Activities in the European Community, Rev. 2.1 (NACE Rev. 2.1)
Notation: 30
top concept of: Statistical Classification of Economic Activities in the European Community, Rev. 2.1 (NACE Rev. 2.1)

Other reservation service and related activities
type: Concept
CoreContentNote: This class includes: - visitor assistance services: • provision of travel information to visitors • activities of independent tourist guides - activities of tourism promotion
Exclusion Note: This class excludes: - fee-based reservation activities for passenger transport, see 52.32 - timeshare exchange services, see 55.40 - activities of travel agencies, see 79.11 - activities of tour operators, see 79.12 - organisation and management of events (e.g. meetings, conventions and conferences, including transport, accommodation, ticketing if managed by the organiser itself), see 82.30 - intermediation service activities for theatrical, sports, amusement and entertainment tickets, see 82.40
broader: Other reservation service and related activities
in scheme: Statistical Classification of Economic Activities in the European Community, Rev. 2.1 (NACE Rev. 2.1)
Notation: 79.90
top concept of: Statistical Classification of Economic Activities in the European Community, Rev. 2.1 (NACE Rev. 2.1)

ConceptNoneRandom0.19946171327789552
type: ConceptAssociation
description: NACE Rev. 2.1 section H is mapped to NACE Rev. 2 sections H, N, S
Type: 18:17
Source Concept: TRANSPORTATION AND STORAGE
Target Concept: http://data.europa.eu/ux2/nace2/H
Target Concept: http://data.europa.eu/ux2/nace2/N
Target Concept: http://data.europa.eu/ux2/nace2/S
in scheme: Statistical Classification of Economic Activities in the European Community, Rev. 2.1 (NACE Rev. 2.1)
top concept of: Statistical Classification of Economic Activities in the European Community, Rev. 2.1 (NACE Rev. 2.1)
Mapping Cardinality: n m

ConceptNoneRandom0.9815620325848671
type: ConceptAssociation
description: NACE Rev. 2.1 class 27.20 is mapped to NACE Rev. 2 class 27.20
Type: 1:1
Source Concept: Manufacture of batteries and accumulators
Target Concept: http://data.europa.eu/ux2/nace2/2720
in scheme: Statistical Classification of Economic Activities in the European Community, Rev. 2.1 (NACE Rev. 2.1)
scope note: the content of the NACE Rev 2.1 class is fully covered in the corresponding NACE Rev 2 class
top concept of: Statistical Classification of Economic Activities in the European Community, Rev. 2.1 (NACE Rev. 2.1)
Mapping Cardinality: 1 1

Manufacture of cider and other fruit fermented beverages
type: Concept
Additional Content Note: This class also includes: - manufacture of mixtures of fermented beverages and non-alcoholic beverages n.e.c. - manufacture of fruit kefir and water kefir
CoreContentNote: This class includes: - manufacture of fermented but not distilled alcoholic beverages: mead, sake, cider, perry and other fruit wines - manufacture of wine from raisins
Exclusion Note: This class excludes: - manufacture of wine from grapes, see 11.02 - merely bottling and labelling, see 46.34 (if performed as part of wholesale) and 82.92 (if performed on a fee or contract basis)
broader: Manufacture of beverages
in scheme: Statistical Classification of Economic Activities in the European Community, Rev. 2.1 (NACE Rev. 2.1)
Notation: 11.03
top concept of: Statistical Classification of Economic Activities in the European Community, Rev. 2.1 (NACE Rev. 2.1)

Manufacture of beer
type: Concept
Additional Content Note: This class also includes: - manufacture of low alcohol or non-alcoholic beer
CoreContentNote: This class includes: - manufacture of malt liquors (e.g. beer, ale, porter, stout)
broader: Manufacture of beverages
in scheme: Statistical Classification of Economic Activities in the European Community, Rev. 2.1 (NACE Rev. 2.1)
Notation: 11.05
top concept of: Statistical Classification of Economic Activities in the European Community, Rev. 2.1 (NACE Rev. 2.1)

ConceptNoneRandom0.1992702893252648
type: ConceptAssociation
description: NACE Rev. 2.1 class 03.21 is mapped to NACE Rev. 2 class 03.21
Type: 10:9
Source Concept: Marine aquaculture
Target Concept: http://data.europa.eu/ux2/nace2/0321
in scheme: Statistical Classification of Economic Activities in the European Community, Rev. 2.1 (NACE Rev. 2.1)
scope note: the content of the NACE Rev 2.1 class is fully covered in the corresponding NACE Rev 2 class
top concept of: Statistical Classification of Economic Activities in the European Community, Rev. 2.1 (NACE Rev. 2.1)
Mapping Cardinality: n m

ConceptNoneRandom0.9061377361493366
type: ConceptAssociation
description: NACE Rev. 2.1 division 90 is mapped to NACE Rev. 2 division 90
Type: 48:49
Source Concept: Arts creation and performing arts activities
Target Concept: http://data.europa.eu/ux2/nace2/90
in scheme: Statistical Classification of Economic Activities in the European Community, Rev. 2.1 (NACE Rev. 2.1)
top concept of: Statistical Classification of Economic Activities in the European Community, Rev. 2.1 (NACE Rev. 2.1)
Mapping Cardinality: n m

General medical practice activities
type: Concept
CoreContentNote: This class includes: - medical consultation and treatment in the field of general medicine carried out by general practitioners
Exclusion Note: This class excludes: - inpatient hospital activities, see 86.10 - medical specialists’ activities, see 86.22 - nursing and midwifery activities, see 86.94 - physiotherapy activities, see 86.95 - traditional, complementary and alternative medicine activities, see 86.96
broader: Medical and dental practice activities
in scheme: Statistical Classification of Economic Activities in the European Community, Rev. 2.1 (NACE Rev. 2.1)
Notation: 86.21
top concept of: Statistical Classification of Economic Activities in the European Community, Rev. 2.1 (NACE Rev. 2.1)

ConceptNoneRandom0.5322394523852618
type: ConceptAssociation
description: NACE Rev. 2.1 group 85.3 is mapped to NACE Rev. 2 groups 85.3, 85.4
Type: 2:2
Source Concept: Secondary and post-secondary non-tertiary education
Target Concept: http://data.europa.eu/ux2/nace2/854
Target Concept: http://data.europa.eu/ux2/nace2/853
in scheme: Statistical Classification of Economic Activities in the European Community, Rev. 2.1 (NACE Rev. 2.1)
top concept of: Statistical Classification of Economic Activities in the European Community, Rev. 2.1 (NACE Rev. 2.1)
Mapping Cardinality: n m

Manufacture of tubes, pipes, hollow profiles and related fittings, of steel
type: Concept
broader: Manufacture of basic metals
in scheme: Statistical Classification of Economic Activities in the European Community, Rev. 2.1 (NACE Rev. 2.1)
Notation: 24.2
top concept of: Statistical Classification of Economic Activities in the European Community, Rev. 2.1 (NACE Rev. 2.1)

ConceptNoneRandom0.8726150405457412
type: ConceptAssociation
description: NACE Rev. 2.1 group 50.2 is mapped to NACE Rev. 2 group 50.2
Type: 1:1
Source Concept: Sea and coastal freight water transport
Target Concept: http://data.europa.eu/ux2/nace2/502
in scheme: Statistical Classification of Economic Activities in the European Community, Rev. 2.1 (NACE Rev. 2.1)
top concept of: Statistical Classification of Economic Activities in the European Community, Rev. 2.1 (NACE Rev. 2.1)
Mapping Cardinality: 1 1

Manufacture of watches and clocks
type: Concept
CoreContentNote: This class includes the manufacture of watches, clocks and timing mechanisms, and parts thereof. This class includes: - manufacture of watches and clocks of all kinds, including instrument panel clocks - manufacture of watch and clock cases, including cases of precious metals - manufacture of time-recording equipment and equipment for measuring, recording and otherwise displaying intervals of time with a watch or clock movement or with synchronous motor, e.g.: • parking meters • time clocks • time/date stamps • process timers - manufacture of time switches and other releases with a watch or clock movement or with synchronous motor: • time locks - manufacture of components for clocks and watches, e.g.: • movements of all kinds for watches and clocks • springs, jewels, dials, hands, plates, bridges and other parts • watch and clock cases and housings of all materials
Exclusion Note: This class excludes: - manufacture of non-metallic watch bands (e.g. fabric, leather, plastic), see 15.12 - manufacture of smartwatches, see 26.30 - manufacture of watch bands of precious metal, see 32.12 - manufacture of watch bands of non-precious metal, see 32.13
broader: Manufacture of measuring testing instruments, clocks and watches
in scheme: Statistical Classification of Economic Activities in the European Community, Rev. 2.1 (NACE Rev. 2.1)
Notation: 26.52
top concept of: Statistical Classification of Economic Activities in the European Community, Rev. 2.1 (NACE Rev. 2.1)

Cold drawing of wire
type: Concept
CoreContentNote: This class includes: - manufacture of drawn steel wire, by cold drawing of steel wire rod
Exclusion Note: This class excludes: - drawing of bars and solid sections of steel, see 24.31 - manufacture of derived wire products, see 25.93
broader: Manufacture of other products of first processing of steel
in scheme: Statistical Classification of Economic Activities in the European Community, Rev. 2.1 (NACE Rev. 2.1)
Notation: 24.34
top concept of: Statistical Classification of Economic Activities in the European Community, Rev. 2.1 (NACE Rev. 2.1)

Support services to forestry
type: Concept
broader: Forestry and logging
in scheme: Statistical Classification of Economic Activities in the European Community, Rev. 2.1 (NACE Rev. 2.1)
Notation: 02.4
top concept of: Statistical Classification of Economic Activities in the European Community, Rev. 2.1 (NACE Rev. 2.1)

Growing of other tree and bush fruits and nuts
type: Concept
CoreContentNote: This class includes: - growing of berries, e.g.: • blueberries • fresh currants • gooseberries • kiwi fruit • raspberries • strawberries • sea buckthorn - growing of fruit seeds - growing of edible nuts, e.g.: • almonds • cashew nuts • chestnuts • hazelnuts • pistachios • walnuts • pine nuts - growing of other tree and bush fruits, e.g.: • locust beans
Exclusion Note: This class excludes: - growing of coconuts, see 01.26
broader: Growing of perennial crops
in scheme: Statistical Classification of Economic Activities in the European Community, Rev. 2.1 (NACE Rev. 2.1)
Notation: 01.25
top concept of: Statistical Classification of Economic Activities in the European Community, Rev. 2.1 (NACE Rev. 2.1)

Growing of pome fruits and stone fruits
type: Concept
CoreContentNote: This class includes: - growing of pome fruits and stone fruits, e.g.: • apples • apricots • cherries and sour cherries • peaches and nectarines • pears and quinces • plums and sloes
Exclusion Note: This class excludes: - growing of mangoes, rambutans and lychees, see 01.22 - growing of olives, see 01.26
broader: Growing of perennial crops
in scheme: Statistical Classification of Economic Activities in the European Community, Rev. 2.1 (NACE Rev. 2.1)
Notation: 01.24
top concept of: Statistical Classification of Economic Activities in the European Community, Rev. 2.1 (NACE Rev. 2.1)

Travel agency, tour operator and other reservation service and related activities
type: Concept
Additional Content Note: This division also includes: - activities of tourist guides and for tourism promotion - intermediation services for travel
CoreContentNote: This division includes the activities of agencies, primarily engaged in the sale and operation of pre-packaged or custom-packaged travel packages, comprising transport, accommodation, amusement and entertainment, tour guide and other services to the general public and commercial clients, and the activities of arranging and assembling tours that are sold through travel agencies or directly by agents (for example, tour operators) and other travel-related services, including reservation services.
Exclusion Note: This division excludes: - intermediation service activities for passenger transport only, see 52.32 - intermediation service activities for accommodation only, see 55.40 - intermediation service activities for food and beverage service activities, see 56.40 - intermediation service activities for the rental of cars, motorhomes, and caravans, see 77.51 - intermediation service activities for amusement, sport and theatrical tickets, see 82.40
broader: ADMINISTRATIVE AND SUPPORT SERVICE ACTIVITIES
in scheme: Statistical Classification of Economic Activities in the European Community, Rev. 2.1 (NACE Rev. 2.1)
Notation: 79
top concept of: Statistical Classification of Economic Activities in the European Community, Rev. 2.1 (NACE Rev. 2.1)

Manufacture of furniture
type: Concept
CoreContentNote: This division includes the manufacture of furniture and parts thereof, except of sheets and slabs of glass, stone, concrete or similar material as parts of furniture. The processes used in the manufacture of furniture are standard methods of forming materials and assembling components, including cutting, moulding and laminating. The design of the article, for both aesthetic and functional qualities, is an important aspect of the production process. Some of the processes used in furniture manufacturing are similar to processes that are used in other segments of manufacturing (for example, cutting and assembly occurs in the production of wood trusses that are classified in division 16). However, the multiple processes distinguish wood furniture manufacturing from wood product manufacturing. Similarly, metal furniture manufacturing uses techniques that are also employed in the manufacture of roll-formed products classified in division 25. The moulding process for plastic furniture is similar to the moulding of other plastic products. However, the manufacture of plastic furniture tends to be a specialised activity.
broader: MANUFACTURING
in scheme: Statistical Classification of Economic Activities in the European Community, Rev. 2.1 (NACE Rev. 2.1)
Notation: 31
top concept of: Statistical Classification of Economic Activities in the European Community, Rev. 2.1 (NACE Rev. 2.1)

ConceptNoneRandom0.2812345385090691
type: ConceptAssociation
description: NACE Rev. 2.1 class 03.22 is mapped to NACE Rev. 2 class 03.22
Type: 10:9
Source Concept: Freshwater aquaculture
Target Concept: http://data.europa.eu/ux2/nace2/0322
in scheme: Statistical Classification of Economic Activities in the European Community, Rev. 2.1 (NACE Rev. 2.1)
scope note: the content of the NACE Rev 2.1 class is fully covered in the corresponding NACE Rev 2 class
top concept of: Statistical Classification of Economic Activities in the European Community, Rev. 2.1 (NACE Rev. 2.1)
Mapping Cardinality: n m

Photographic activities
type: Concept
Additional Content Note: This class also includes: - microfilming of documents - digitising photographs, uploading video to the cloud - object scanning in 3D
CoreContentNote: This class includes: - commercial and consumer photography: • portrait photography for passports, schools, weddings, etc. • photography for commercials, publishers, fashion, real estate or tourism purposes • aerial and underwater photography • videotaping of events: weddings, meetings, etc. - film processing: • developing, printing and enlarging from client-taken negatives or cine-films • film developing and photo printing laboratories • one-hour photo shops (not part of shops selling cameras) • mounting of slides • copying and restoring or transparency retouching in connection with photographs - activities of photojournalists - activities of artistic photographs
Exclusion Note: This class excludes: - activities of printing photographs (from mobile telephones, memory cards, universal serial bus (USB) and other electronic supports), see 18.12 - processing motion picture film related to motion picture and television industries, see 59.12 - cartographic and spatial information activities, see 71.12 - photogrammetric surveying activities, see 71.12 - operation of coin-operated (self-service) photo machines, see 96.99
broader: Photographic activities
in scheme: Statistical Classification of Economic Activities in the European Community, Rev. 2.1 (NACE Rev. 2.1)
Notation: 74.20
top concept of: Statistical Classification of Economic Activities in the European Community, Rev. 2.1 (NACE Rev. 2.1)

ConceptNoneRandom0.5652790078626613
type: ConceptAssociation
description: NACE Rev. 2.1 section G is mapped to NACE Rev. 2 sections G, N
Type: 18:17
Source Concept: WHOLESALE AND RETAIL TRADE
Target Concept: http://data.europa.eu/ux2/nace2/G
Target Concept: http://data.europa.eu/ux2/nace2/N
in scheme: Statistical Classification of Economic Activities in the European Community, Rev. 2.1 (NACE Rev. 2.1)
top concept of: Statistical Classification of Economic Activities in the European Community, Rev. 2.1 (NACE Rev. 2.1)
Mapping Cardinality: n m

Passenger air transport
type: Concept
Additional Content Note: This class also includes: - rental of air transport equipment with an operator for the purpose of passenger transport
CoreContentNote: This class includes: - scheduled air transport of passengers over regular routes - charter flights for passengers - sightseeing flights
Exclusion Note: This class excludes: - rental of air transport equipment without an operator, see 77.35 - air ambulances, see 86.92
broader: Passenger air transport
in scheme: Statistical Classification of Economic Activities in the European Community, Rev. 2.1 (NACE Rev. 2.1)
Notation: 51.10
top concept of: Statistical Classification of Economic Activities in the European Community, Rev. 2.1 (NACE Rev. 2.1)

Computing infrastructure, data processing, hosting and related activities
type: Concept
CoreContentNote: This class includes: - provision of computing infrastructure, including cloud infrastructure and platform provision (IaaS, PaaS) - cloud computing (except software publishing and computer systems design), whether or not in combination with infrastructure provision - provision of technical infrastructure related to streaming services, data processing services and related activities: • complete processing of data supplied by clients • generation of specialised reports from data supplied by clients • blockchain / distributed ledger technology (DLT) data processing activities - specialised hosting activities, e.g.: • web hosting • application hosting - general time-share provision of mainframe facilities to clients - digitalisation of files (for further processing of data) - provision of data entry services - data centre colocation activities (i.e. rental of server and networking space in data centres, including routine monitoring of servers) - digital data storage - issuing of crypto-assets without a corresponding liability (not by a monetary authority)
Exclusion Note: This class excludes: - software publishing, see 58.2 - provision of applications by downloads or by streaming, see 58.2 - post-production services to convert video content into streaming formats, see 59.12 - post-production services to convert audio content into streaming formats, see 59.20 - audio streaming and download distribution service activities not associated with publishing, see 60.10 - video streaming and download distribution service activities not associated with publishing, see 60.20 - computer systems design, see 62.20 - electronic storage of archival material for access by the general public, see 91.12 - repair and maintenance of computers and communication equipment, see 95.10 - activities where the service provider uses computers only as a tool are classified according to the nature of the services rendered
broader: Computing infrastructure, data processing, hosting and related activities
in scheme: Statistical Classification of Economic Activities in the European Community, Rev. 2.1 (NACE Rev. 2.1)
Notation: 63.10
top concept of: Statistical Classification of Economic Activities in the European Community, Rev. 2.1 (NACE Rev. 2.1)

ConceptNoneRandom0.5712930519968659
type: ConceptAssociation
description: NACE Rev. 2.1 class 93.12 is mapped to NACE Rev. 2 classes 93.11, 93.12, 93.29
Type: 7:7
Source Concept: Activities of sports clubs
Target Concept: http://data.europa.eu/ux2/nace2/9311
Target Concept: http://data.europa.eu/ux2/nace2/9312
Target Concept: http://data.europa.eu/ux2/nace2/9329
in scheme: Statistical Classification of Economic Activities in the European Community, Rev. 2.1 (NACE Rev. 2.1)
scope note: 93.11: - organisation and operation of outdoor or indoor sports events for professionals or amateurs by sports clubs 93.12: - activities of sports clubs, which, whether professional, semi-professional or amateur clubs, give their members the opportunity to engage in sporting activities - operation of sports club, e.g.: • football clubs • bowling clubs • swimming clubs • golf clubs • boxing clubs • winter sports clubs • chess clubs • track and field clubs • shooting clubs, etc. • card games clubs, e.g. bridge clubs - provision of clubhouse services by sports clubs - sports training by sports clubs 93.29: - operation of e-sports clubs
top concept of: Statistical Classification of Economic Activities in the European Community, Rev. 2.1 (NACE Rev. 2.1)
Mapping Cardinality: n m

Post-secondary non-tertiary education
type: Concept
CoreContentNote: This class includes the provision of post-secondary education and training programmes (both general and vocational) which cannot be considered tertiary education; these are post-secondary non-tertiary education and training programmes. It may also include the provision of supplementary post-secondary education to prepare for tertiary education or for post-secondary non-tertiary vocational education.
Exclusion Note: This class excludes: - technical and vocational higher education, see 85.40 - non-formal education and training, see 85.5
broader: Secondary and post-secondary non-tertiary education
in scheme: Statistical Classification of Economic Activities in the European Community, Rev. 2.1 (NACE Rev. 2.1)
Notation: 85.33
top concept of: Statistical Classification of Economic Activities in the European Community, Rev. 2.1 (NACE Rev. 2.1)

ConceptNoneRandom0.6852500820422526
type: ConceptAssociation
description: NACE Rev. 2.1 class 47.26 is mapped to NACE Rev. 2 classes 47.26, 47.81, 47.91, 47.99
Type: 78:65
Source Concept: Retail sale of tobacco products
Target Concept: http://data.europa.eu/ux2/nace2/4791
Target Concept: http://data.europa.eu/ux2/nace2/4781
Target Concept: http://data.europa.eu/ux2/nace2/4726
Target Concept: http://data.europa.eu/ux2/nace2/4799
in scheme: Statistical Classification of Economic Activities in the European Community, Rev. 2.1 (NACE Rev. 2.1)
scope note: 47.26: - retail sale of tobacco in any form, e.g. cigarettes, cigars, pipe tobacco, chewing tobacco - retail sale of tobacco and smoking products and accessories, including lighters, pipes, cigarette rolling equipment etc. - retail sale of electronic cigarettes and e-liquids used in vaping devices 47.81: - retail sale via stalls and markets of tobacco in any form, e.g. cigarettes, cigars, pipe tobacco, chewing tobacco - retail sale via stalls and markets of tobacco and smoking products and accessories, including lighters, pipes, cigarette rolling equipment etc. - retail sale via stalls and markets of of electronic cigarettes (vapes) and e-liquids used in vaping devices 47.91: - retail sale via mail order houses or via Internet of tobacco in any form, e.g. cigarettes, cigars, pipe tobacco, chewing tobacco - retail sale via mail order houses or via Internet of tobacco and smoking products and accessories, including lighters, pipes, cigarette rolling equipment etc. - retail sale via mail order houses or via Internet of electronic cigarettes and e-liquids used in vaping devices 47.99: - retail sale not in stores, stalls or markets of tobacco in any form, e.g. cigarettes, cigars, pipe tobacco, chewing tobacco - retail sale not in stores, stalls or markets of tobacco and smoking products and accessories, including lighters, pipes, cigarette rolling equipment etc. - retail sale not in stores, stalls or markets of electronic cigarettes and e-liquids used in vaping devices
top concept of: Statistical Classification of Economic Activities in the European Community, Rev. 2.1 (NACE Rev. 2.1)
Mapping Cardinality: n m

ConceptNoneRandom0.8112728333593531
type: ConceptAssociation
description: NACE Rev. 2.1 class 08.93 is mapped to NACE Rev. 2 class 08.93
Type: 1:1
Source Concept: Extraction of salt
Target Concept: http://data.europa.eu/ux2/nace2/0893
in scheme: Statistical Classification of Economic Activities in the European Community, Rev. 2.1 (NACE Rev. 2.1)
scope note: the content of the NACE Rev 2.1 class is fully covered in the corresponding NACE Rev 2 class
top concept of: Statistical Classification of Economic Activities in the European Community, Rev. 2.1 (NACE Rev. 2.1)
Mapping Cardinality: 1 1

Other residential care activities n.e.c.
type: Concept
Additional Content Note: This class also includes activities of: - halfway houses for groups of persons with social or personal problems - halfway houses for delinquents and offenders - juvenile correction homes
CoreContentNote: This class includes the provision of residential care and assistance services for persons, except older persons and persons with disabilities, who are unable to fully care for themselves or who do not wish to live on their own. This class includes: - residential and social assistance activities provided on a round-the-clock basis to special categories of persons, but where medical treatment or education are not essential elements: • orphanages • children’s boarding homes and hostels • provision of residential services for homeless persons, refugees, immigrants, etc. • other residential family support activities The activities are usually carried out by government offices or private organisations.
Exclusion Note: This class excludes: - funding and administration of compulsory social security programmes, see 84.30 - activities of residential nursing care facilities, see 87.10 - provision of residential nursing and rehabilitative services for persons living with or having a diagnosis of a mental illness, see 87.20 - residential care activities for persons having a diagnosis of intellectual disability, see 87.20 - residential care activities for older persons or persons with physical disabilities, see 87.30 - child day-care activities, see 88.91 - adoption service activities, see 88.99
broader: Other residential care activities
in scheme: Statistical Classification of Economic Activities in the European Community, Rev. 2.1 (NACE Rev. 2.1)
Notation: 87.99
top concept of: Statistical Classification of Economic Activities in the European Community, Rev. 2.1 (NACE Rev. 2.1)

ConceptNoneRandom0.49653227793049304
type: ConceptAssociation
description: NACE Rev. 2.1 division 93 is mapped to NACE Rev. 2 divisions 82, 85, 93
Type: 48:49
Source Concept: Sports activities and amusement and recreation activities
Target Concept: http://data.europa.eu/ux2/nace2/82
Target Concept: http://data.europa.eu/ux2/nace2/93
Target Concept: http://data.europa.eu/ux2/nace2/85
in scheme: Statistical Classification of Economic Activities in the European Community, Rev. 2.1 (NACE Rev. 2.1)
top concept of: Statistical Classification of Economic Activities in the European Community, Rev. 2.1 (NACE Rev. 2.1)
Mapping Cardinality: n m

ConceptNoneRandom0.32560560650412684
type: ConceptAssociation
description: NACE Rev. 2.1 group 32.9 is mapped to NACE Rev. 2 groups 27.9, 32.3, 32.9
Type: 18:19
Source Concept: Manufacturing n.e.c.
Target Concept: http://data.europa.eu/ux2/nace2/279
Target Concept: http://data.europa.eu/ux2/nace2/323
Target Concept: http://data.europa.eu/ux2/nace2/329
in scheme: Statistical Classification of Economic Activities in the European Community, Rev. 2.1 (NACE Rev. 2.1)
top concept of: Statistical Classification of Economic Activities in the European Community, Rev. 2.1 (NACE Rev. 2.1)
Mapping Cardinality: n m

Activities of performing arts
type: Concept
broader: Arts creation and performing arts activities
in scheme: Statistical Classification of Economic Activities in the European Community, Rev. 2.1 (NACE Rev. 2.1)
Notation: 90.2
top concept of: Statistical Classification of Economic Activities in the European Community, Rev. 2.1 (NACE Rev. 2.1)

Silviculture and other forestry activities
type: Concept
broader: Forestry and logging
in scheme: Statistical Classification of Economic Activities in the European Community, Rev. 2.1 (NACE Rev. 2.1)
Notation: 02.1
top concept of: Statistical Classification of Economic Activities in the European Community, Rev. 2.1 (NACE Rev. 2.1)

Cold forming or folding
type: Concept
CoreContentNote: This class includes: - manufacture of open sections by progressive cold forming on a roll mill or folding on a press of flat-rolled products of steel - manufacture of cold-formed or cold-folded, ribbed sheets and sandwich panels
broader: Manufacture of other products of first processing of steel
in scheme: Statistical Classification of Economic Activities in the European Community, Rev. 2.1 (NACE Rev. 2.1)
Notation: 24.33
top concept of: Statistical Classification of Economic Activities in the European Community, Rev. 2.1 (NACE Rev. 2.1)

Manufacture of instruments and appliances for measuring, testing and navigation
type: Concept
CoreContentNote: This class comprises the manufacture of search, detection, navigation, guidance, aeronautical and nautical systems and instruments; automatic controls and regulators for applications (for example, heating, air conditioning, refrigeration and appliances); instruments and devices for measuring, displaying, indicating, recording, transmitting and controlling temperature, humidity, pressure, vacuum, combustion, flow, level, viscosity, density, acidity, concentration and rotation; totalising (in other words, registering) fluid meters and counting devices; instruments for measuring and testing the characteristics of electricity and electrical signals; instruments and instrumentation systems for laboratory analysis of the chemical/physical composition or concentration of samples of solid, fluid, gaseous or composite materials; other measuring and testing instruments; and parts thereof. The manufacture of non-electric measuring, testing and navigating equipment (except simple mechanical tools) is included here. This class includes: - manufacture of aircraft engine instruments - manufacture of automotive emissions testing equipment - manufacture of meteorological instruments - manufacture of physical properties testing and inspection equipment - manufacture of polygraph machines - manufacture of radiation detection and monitoring instruments - manufacture of surveying instruments - manufacture of thermometers liquid-in-glass and bi-metal types (except medical) - manufacture of humidistats - manufacture of hydronic limit controls - manufacture of flame and burner control - manufacture of spectrometers - manufacture of pneumatic gauges - manufacture of consumption meters (e.g. water, gas, electricity) - manufacture of flow meters and counting devices - manufacture of tally counters - manufacture of mine detectors, pulse (signal) generators; metal detectors - manufacture of search, detection, navigation, aeronautical and nautical equipment, including sonobuoys - manufacture of …
Exclusion Note: This class excludes: - manufacture of telephone answering machines, see 26.30 - manufacture of irradiation equipment, see 26.60 - manufacture of optical positioning equipment, see 26.70 - manufacture of dictating machines, see 28.23 - manufacture of weighing machinery (other than sensitive laboratory balances), levels, tape measures, etc., see 28.29 - manufacture of medical thermometers, see 32.50 - installation of industrial process control equipment, see 33.20
broader: Manufacture of measuring testing instruments, clocks and watches
in scheme: Statistical Classification of Economic Activities in the European Community, Rev. 2.1 (NACE Rev. 2.1)
Notation: 26.51
top concept of: Statistical Classification of Economic Activities in the European Community, Rev. 2.1 (NACE Rev. 2.1)

ConceptNoneRandom0.8226499402072999
type: ConceptAssociation
description: NACE Rev. 2.1 class 38.31 is mapped to NACE Rev. 2 classes 38.21, 38.22
Type: 7:5
Source Concept: Incineration without energy recovery
Target Concept: http://data.europa.eu/ux2/nace2/3821
Target Concept: http://data.europa.eu/ux2/nace2/3822
in scheme: Statistical Classification of Economic Activities in the European Community, Rev. 2.1 (NACE Rev. 2.1)
scope note: 38.21: - disposal and treatment prior to disposal of waste by combustion or thermal treatment without energy recovery 38.22: - disposal and treatment prior to disposal of hazardous waste by combustion or thermal treatment without energy recovery
top concept of: Statistical Classification of Economic Activities in the European Community, Rev. 2.1 (NACE Rev. 2.1)
Mapping Cardinality: n m

Type

Growing of grapes
type: Concept
CoreContentNote: This class includes: - growing of grapes for consumption or for further production of wine, juice, vinegar and dried fruit (e.g. raisins, zante currants or sultanas)
Exclusion Note: This class excludes: - manufacture of juice, see 10.32 - manufacture of wine, see 11.02
broader: Growing of perennial crops
in scheme: Statistical Classification of Economic Activities in the European Community, Rev. 2.1 (NACE Rev. 2.1)
Notation: 01.21
top concept of: Statistical Classification of Economic Activities in the European Community, Rev. 2.1 (NACE Rev. 2.1)

Other manufacturing
type: Concept
CoreContentNote: This division includes the manufacture of a variety of goods not covered in other parts of the classification. Since this is a residual division, production processes, input materials and use of the produced goods can vary widely and usual criteria for grouping classes into divisions have not been applied here.
broader: MANUFACTURING
in scheme: Statistical Classification of Economic Activities in the European Community, Rev. 2.1 (NACE Rev. 2.1)
Notation: 32
top concept of: Statistical Classification of Economic Activities in the European Community, Rev. 2.1 (NACE Rev. 2.1)

Distilling, rectifying and blending of spirits
type: Concept
CoreContentNote: This class includes: - manufacture of distilled, potable, alcoholic beverages: whisky, brandy, gin, liqueurs, etc. - manufacture of drinks mixed with distilled alcoholic beverages - blending of distilled spirits - production of neutral spirits
Exclusion Note: This class excludes: - manufacture of non-distilled alcoholic beverages, see 11.02 to 11.05 - manufacture of synthetic ethyl alcohol, see 20.14 - manufacture of ethyl alcohol from fermented materials, see 20.14 - merely bottling and labelling, see 46.34 (if performed as part of wholesale) and 82.92 (if performed on a fee or contract basis)
broader: Manufacture of beverages
in scheme: Statistical Classification of Economic Activities in the European Community, Rev. 2.1 (NACE Rev. 2.1)
Notation: 11.01
top concept of: Statistical Classification of Economic Activities in the European Community, Rev. 2.1 (NACE Rev. 2.1)

ConceptNoneRandom0.4027857011053574
type: ConceptAssociation
description: NACE Rev. 2.1 section J is mapped to NACE Rev. 2 sections G, J
Type: 18:17
Source Concept: PUBLISHING, BROADCASTING, AND CONTENT PRODUCTION AND DISTRIBUTION ACTIVITIES
Target Concept: http://data.europa.eu/ux2/nace2/G
Target Concept: http://data.europa.eu/ux2/nace2/J
in scheme: Statistical Classification of Economic Activities in the European Community, Rev. 2.1 (NACE Rev. 2.1)
top concept of: Statistical Classification of Economic Activities in the European Community, Rev. 2.1 (NACE Rev. 2.1)
Mapping Cardinality: n m

ConceptNoneRandom0.8501952466392102
type: ConceptAssociation
description: NACE Rev. 2.1 class 28.99 is mapped to NACE Rev. 2 class 28.99
Type: 3:2
Source Concept: Manufacture of other special-purpose machinery n.e.c.
Target Concept: http://data.europa.eu/ux2/nace2/2899
in scheme: Statistical Classification of Economic Activities in the European Community, Rev. 2.1 (NACE Rev. 2.1)
scope note: the content of the NACE Rev 2.1 class is fully covered in the corresponding NACE Rev 2 class
top concept of: Statistical Classification of Economic Activities in the European Community, Rev. 2.1 (NACE Rev. 2.1)
Mapping Cardinality: n m

Specialised construction activities in civil engineering
type: Concept
CoreContentNote: This class includes: - construction activities specialising in one aspect common in civil engineering, requiring specialised skill or equipment: • construction of foundations for civil engineering, including piledriving • shaft sinking • erection of steel elements for civil engineering projects • installation of crash barriers, traffic signs, etc. - erection of noise protection walls (e.g. along roads) - installation of street furniture - installation of prefabricated swimming pools - road painting and other marking of streets - erection of protective rock walls and installation of rockfall protection
Exclusion Note: This class excludes: - surface work (e.g. paving of roads (asphalt, concrete, stone, etc.)), see 42.11 - construction of non-prefabricated swimming pools, see 42.99
broader: Specialised construction activities in civil engineering
in scheme: Statistical Classification of Economic Activities in the European Community, Rev. 2.1 (NACE Rev. 2.1)
Notation: 43.50
top concept of: Statistical Classification of Economic Activities in the European Community, Rev. 2.1 (NACE Rev. 2.1)

ConceptNoneRandom0.35958960857309796
type: ConceptAssociation
description: NACE Rev. 2.1 class 47.27 is mapped to NACE Rev. 2 classes 47.29, 47.81, 47.91, 47.99
Type: 78:65
Source Concept: Retail sale of other food
Target Concept: http://data.europa.eu/ux2/nace2/4791
Target Concept: http://data.europa.eu/ux2/nace2/4729
Target Concept: http://data.europa.eu/ux2/nace2/4781
Target Concept: http://data.europa.eu/ux2/nace2/4799
in scheme: Statistical Classification of Economic Activities in the European Community, Rev. 2.1 (NACE Rev. 2.1)
scope note: 47.29: - retail sale of dairy products, including milk and cheese preparations, and eggs - retail sale of coffee, tea, oils, flour, sugar, pasta, etc. - retail sale of other food products n.e.c. - retail sale of ready-made meals, except for immediate consumption on the spot - retail sale of food supplements for human consumption, e.g. dietary supplements, diet products 47.81: - retail sale via stalls and markets of dairy products, including milk and cheese preparations, and eggs - retail sale via stalls and markets of coffee, tea, oils, flour, sugar, pasta, etc. - retail sale via stalls and markets of other food products n.e.c. - retail sale via stalls and markets of ready-made meals, except for immediate consumption on the spot - retail sale via stalls and markets of food supplements for human consumption, e.g. dietary supplements, diet products 47.91: - retail sale via mail order houses or via Internet of dairy products, including milk and cheese preparations, and eggs - retail sale via mail order houses or via Internet of coffee, tea, oils, flour, sugar, pasta, etc. - retail sale via mail order houses or via Internet of other food products n.e.c. - retail sale via mail order houses or via Internet of ready-made meals, except for immediate consumption on the spot - retail sale via mail order houses or via Internet of food supplements for human consumption, e.g. dietary supplements, diet products 47.99: - retail sale not in stores, stalls or markets of dairy products, including milk and cheese preparations, and eggs - retail sale not in stores, stalls or markets of coffee, tea, oils, flour, sugar, pasta, etc. - retail sale not in stores, stalls or markets of other food products n.e.c. - retail sale not in stores, stalls or markets of ready-made meals, except for immediate consumption on the spot - retail sale not in stores, stalls or markets of food supplements for human consumption, e.g. dietary supplements, diet products
top concept of: Statistical Classification of Economic Activities in the European Community, Rev. 2.1 (NACE Rev. 2.1)
Mapping Cardinality: n m

ConceptNoneRandom0.80574619754408
type: ConceptAssociation
description: NACE Rev. 2.1 group 85.1 is mapped to NACE Rev. 2 groups 85.1, 88.9
Type: 2:2
Source Concept: Pre-primary education
Target Concept: http://data.europa.eu/ux2/nace2/889
Target Concept: http://data.europa.eu/ux2/nace2/851
in scheme: Statistical Classification of Economic Activities in the European Community, Rev. 2.1 (NACE Rev. 2.1)
top concept of: Statistical Classification of Economic Activities in the European Community, Rev. 2.1 (NACE Rev. 2.1)
Mapping Cardinality: n m

ConceptNoneRandom0.5697899620316813
type: ConceptAssociation
description: NACE Rev. 2.1 division 92 is mapped to NACE Rev. 2 division 92
Type: 1:1
Source Concept: Gambling and betting activities
Target Concept: http://data.europa.eu/ux2/nace2/92
in scheme: Statistical Classification of Economic Activities in the European Community, Rev. 2.1 (NACE Rev. 2.1)
top concept of: Statistical Classification of Economic Activities in the European Community, Rev. 2.1 (NACE Rev. 2.1)
Mapping Cardinality: 1 1

ConceptNoneRandom0.13461825289946527
type: ConceptAssociation
description: NACE Rev. 2.1 class 08.92 is mapped to NACE Rev. 2 class 08.92
Type: 1:1
Source Concept: Extraction of peat
Target Concept: http://data.europa.eu/ux2/nace2/0892
in scheme: Statistical Classification of Economic Activities in the European Community, Rev. 2.1 (NACE Rev. 2.1)
scope note: the content of the NACE Rev 2.1 class is fully covered in the corresponding NACE Rev 2 class
top concept of: Statistical Classification of Economic Activities in the European Community, Rev. 2.1 (NACE Rev. 2.1)
Mapping Cardinality: 1 1

Support activities to arts creation and performing arts
type: Concept
CoreContentNote: This group includes support activities to arts creation and performing arts. It includes activities supporting the production of theatre, opera and ballet performances, musicals, events and others, activities of producers of artistic performances, inside or outside the premises.
broader: Arts creation and performing arts activities
in scheme: Statistical Classification of Economic Activities in the European Community, Rev. 2.1 (NACE Rev. 2.1)
Notation: 90.3
top concept of: Statistical Classification of Economic Activities in the European Community, Rev. 2.1 (NACE Rev. 2.1)

Logging
type: Concept
broader: Forestry and logging
in scheme: Statistical Classification of Economic Activities in the European Community, Rev. 2.1 (NACE Rev. 2.1)
Notation: 02.2
top concept of: Statistical Classification of Economic Activities in the European Community, Rev. 2.1 (NACE Rev. 2.1)

ConceptNoneRandom0.37357794590147075
type: ConceptAssociation
description: NACE Rev. 2.1 class 93.11 is mapped to NACE Rev. 2 classes 93.11, 93.29
Type: 7:7
Source Concept: Operation of sports facilities
Target Concept: http://data.europa.eu/ux2/nace2/9311
Target Concept: http://data.europa.eu/ux2/nace2/9329
in scheme: Statistical Classification of Economic Activities in the European Community, Rev. 2.1 (NACE Rev. 2.1)
scope note: 93.11: - operation of facilities for indoor or outdoor sports events (open, closed or covered, with or without spectator seating) - organisation and operation of outdoor or indoor sports events for professionals or amateurs by organisations (not by sports clubs) - managing and providing the staff to operate these facilities - provision of equipment to operate these facilities - operation of sport areas, which may include the operation of cableways, ski lifts and chairlifts - management of outdoor sports equipped areas - operation of grassroots sport facilities 93.29: - operation of sport areas, which may include the operation of cableways, ski lifts and chairlifts
top concept of: Statistical Classification of Economic Activities in the European Community, Rev. 2.1 (NACE Rev. 2.1)
Mapping Cardinality: n m

Cold rolling of narrow strip
type: Concept
CoreContentNote: This class includes: - manufacture of coated or uncoated flat-rolled steel products in coils or in straight lengths of a width less than 600 mm by cold re-rolling of hot-rolled flat products or of steel rods
Exclusion Note: This class excludes: - manufacture of coated or uncoated flat-rolled steel products in coils or in straight lengths of a width of 600 mm or more by cold re-rolling of hot-rolled flat products or of steel rods, see 24.10
broader: Manufacture of other products of first processing of steel
in scheme: Statistical Classification of Economic Activities in the European Community, Rev. 2.1 (NACE Rev. 2.1)
Notation: 24.32
top concept of: Statistical Classification of Economic Activities in the European Community, Rev. 2.1 (NACE Rev. 2.1)

ConceptNoneRandom0.15752730297449935
type: ConceptAssociation
description: NACE Rev. 2.1 class 38.32 is mapped to NACE Rev. 2 classes 38.21, 38.22
Type: 7:5
Source Concept: Landfilling or permanent storage
Target Concept: http://data.europa.eu/ux2/nace2/3821
Target Concept: http://data.europa.eu/ux2/nace2/3822
in scheme: Statistical Classification of Economic Activities in the European Community, Rev. 2.1 (NACE Rev. 2.1)
scope note: 38.21: - disposal and treatment prior to disposal of non-hazardous waste, whether the waste is solid or not, onto, into land (i.e. underground), or in permanent waste storage facilities or sites - operation of landfills for the disposal of waste - treatment of organic waste for landfilling or permanent storage - disposal of by-products of animal origin in landfills - permanent underground storage of waste in a deep geological cavity, e.g. a salt or potassium mine - storage of captured Carbon Dioxide 38.22: - disposal and treatment prior to disposal of hazardous waste, whether the waste is solid or not, onto, into land (i.e. underground), or in permanent waste storage facilities or sites - operation of landfills for the disposal of waste - treatment of organic waste for landfilling or permanent storage - disposal of by-products of animal origin in landfills - permanent underground storage of waste in a deep geological cavity, e.g. a salt or potassium mine
top concept of: Statistical Classification of Economic Activities in the European Community, Rev. 2.1 (NACE Rev. 2.1)
Mapping Cardinality: n m

Repair, maintenance and installation of machinery and equipment
type: Concept
Additional Content Note: Also included in this division is the specialised installation of machinery.
CoreContentNote: This division includes the specialised repair of goods produced in the manufacturing sector with the aim to restore machinery, equipment and other products to working order. The provision of general or routine maintenance (in other words, servicing) on such products to ensure they work efficiently and to prevent breakdown and unnecessary repairs is included. This division only includes specialised repair and maintenance activities. A substantial amount of repair is also done by manufacturers of machinery, equipment and other goods. In such cases, the units engaged in these repair and manufacturing activities are classified according to the value-added principle, which would often assign these combined activities to the manufacture of the good. The same principle is applied for combined trade and repair. The rebuilding or remanufacture of machinery and equipment is considered a manufacturing activity and is included in other divisions of this section.
Exclusion Note: This division excludes: - cleaning of industrial machinery, see 81.22 - the installation of equipment that forms an integral part of buildings or similar structures (e.g. installation of electrical wiring, of escalators, or of air-conditioning systems, is classified as construction) - repair and maintenance of computers and communication equipment, see 95.10 - repair and maintenance of household goods, see 95.2 - repair and maintenance of goods that are used as capital goods as well as consumer goods is typically classified as repair and maintenance of household goods (e.g. office and household furniture repair), see 95.24 - repair and maintenance of motor vehicles and motorcycles, see 95.3
broader: MANUFACTURING
in scheme: Statistical Classification of Economic Activities in the European Community, Rev. 2.1 (NACE Rev. 2.1)
Notation: 33
top concept of: Statistical Classification of Economic Activities in the European Community, Rev. 2.1 (NACE Rev. 2.1)

Growing of tropical and subtropical fruits
type: Concept
CoreContentNote: This class includes: - growing of tropical and subtropical fruits, e.g.: • avocados • bananas and plantains • dates • figs • mangoes • papayas • pineapples • rambutans • lychees
broader: Growing of perennial crops
in scheme: Statistical Classification of Economic Activities in the European Community, Rev. 2.1 (NACE Rev. 2.1)
Notation: 01.22
top concept of: Statistical Classification of Economic Activities in the European Community, Rev. 2.1 (NACE Rev. 2.1)

Motion picture, video and television programme activities
type: Concept
Additional Content Note: Buying and selling of motion pictures or other audiovisual production distribution rights are also included.
CoreContentNote: This group includes the production of theatrical and non-theatrical motion pictures, videos or audiovisual works, whether on film, hard drive or other digital storage media, associated with digital distribution, for direct projection in theatres or for broadcasting or streaming; supporting post-production activities (for example, film editing, cutting, dubbing or conversion to video streaming formats); distribution of motion pictures or other audiovisual productions to other industries as well as their projection.
broader: Motion picture, video and television programme production, sound recording and music publishing activities
in scheme: Statistical Classification of Economic Activities in the European Community, Rev. 2.1 (NACE Rev. 2.1)
Notation: 59.1
top concept of: Statistical Classification of Economic Activities in the European Community, Rev. 2.1 (NACE Rev. 2.1)

Weaving of textiles
type: Concept
Additional Content Note: This class also includes: - manufacture of woven pile or chenille fabrics, terry towelling, gauze, etc. - manufacture of woven fabrics of aramid threads - manufacture of imitation fur by weaving
CoreContentNote: This class includes weaving of textiles. This can be done from varying raw materials, whether new fibres or recycled textile materials (for example, silk, cotton, wool, vegetable or man-made fibres or paper, recovered textile waste materials). This class includes: - manufacture of broad woven cotton-type, woollen-type, worsted-type or silk-type fabrics, including from mixtures or artificial or synthetic yarns (polypropylene, etc.) - manufacture of other broad woven fabrics, using flax, ramie, hemp, jute, bast fibres and special yarns - manufacture of broad woven fabrics, from secondary raw materials
Exclusion Note: This class excludes: - manufacture of knitted and crocheted fabrics, see 13.91 - manufacture of textile floor coverings, see 13.93 - manufacture of non-woven fabrics, see 13.95 - manufacture of narrow fabrics, see 13.96 - manufacture of tarpaulins, tents, camping goods of textile materials, windsurfing and boat sails, sunblinds, loose covers for cars, machines or furniture, parachutes, see 13.96 - manufacture of fabrics of glass fibres, see 13.96 - manufacture of felt, see 13.99 - manufacture of carbon fibres and articles of carbon fibres, for non-electrical purposes, see 23.99
broader: Weaving of textiles
in scheme: Statistical Classification of Economic Activities in the European Community, Rev. 2.1 (NACE Rev. 2.1)
Notation: 13.20
top concept of: Statistical Classification of Economic Activities in the European Community, Rev. 2.1 (NACE Rev. 2.1)

ConceptNoneRandom0.8544061569832829
type: ConceptAssociation
description: NACE Rev. 2.1 section I is mapped to NACE Rev. 2 sections I, L, N
Type: 18:17
Source Concept: ACCOMMODATION AND FOOD SERVICE ACTIVITIES
Target Concept: http://data.europa.eu/ux2/nace2/I
Target Concept: http://data.europa.eu/ux2/nace2/L
Target Concept: http://data.europa.eu/ux2/nace2/N
in scheme: Statistical Classification of Economic Activities in the European Community, Rev. 2.1 (NACE Rev. 2.1)
top concept of: Statistical Classification of Economic Activities in the European Community, Rev. 2.1 (NACE Rev. 2.1)
Mapping Cardinality: n m

Manufacture of wine from grape
type: Concept
Additional Content Note: This class also includes: - blending, purification and bottling of wine - manufacture of low or non-alcoholic wine
CoreContentNote: This class includes: - manufacture of wine of fresh grapes - manufacture of sparkling wine - manufacture of fortified wines - manufacture of wine from concentrated grape must
Exclusion Note: This class excludes: - manufacture of wine from raisins, see 11.03 - merely bottling and labelling, see 46.34 (if performed as part of wholesale) and 82.92 (if performed on a fee or contract basis)
broader: Manufacture of beverages
in scheme: Statistical Classification of Economic Activities in the European Community, Rev. 2.1 (NACE Rev. 2.1)
Notation: 11.02
top concept of: Statistical Classification of Economic Activities in the European Community, Rev. 2.1 (NACE Rev. 2.1)

Intermediation service activities for postal and courier activities
type: Concept
CoreContentNote: This class includes the intermediation of postal and courier activities, by bringing clients and service providers together for a fee or commission, without the intermediary providing the postal and courier services that are intermediated. These intermediation activities can be carried out on digital platforms or through non-digital channels (including face-to-face, door-to-door, telephone, mail, and so on). The fee or commission can be received from either the client or the provider of the postal and courier service. Revenue for the intermediation activities can include other sources of income (for example, revenues from the sale of advertising space). This class includes: - any intermediation service undertaken by third parties to postal service providers and offered to business and domestic (household) clients - operation of online platforms to allow people to book a food delivery
Exclusion Note: This class excludes: - food delivery services, see 53.20 - operation of online platforms for home delivery of prepared meals, if the delivery is carried out by the same unit which prepares the meals, see 56.40 - monetary intermediation services (e.g. payment of fees through the post office), see 64.19
broader: Intermediation service activities for postal and courier activities
in scheme: Statistical Classification of Economic Activities in the European Community, Rev. 2.1 (NACE Rev. 2.1)
Notation: 53.30
top concept of: Statistical Classification of Economic Activities in the European Community, Rev. 2.1 (NACE Rev. 2.1)

ConceptNoneRandom0.24666419485259827
type: ConceptAssociation
description: NACE Rev. 2.1 section T is mapped to NACE Rev. 2 sections G, N, S
Type: 18:17
Source Concept: OTHER SERVICE ACTIVITIES
Target Concept: http://data.europa.eu/ux2/nace2/G
Target Concept: http://data.europa.eu/ux2/nace2/N
Target Concept: http://data.europa.eu/ux2/nace2/S
in scheme: Statistical Classification of Economic Activities in the European Community, Rev. 2.1 (NACE Rev. 2.1)
top concept of: Statistical Classification of Economic Activities in the European Community, Rev. 2.1 (NACE Rev. 2.1)
Mapping Cardinality: n m

ConceptNoneRandom0.1696257176563507
type: ConceptAssociation
description: NACE Rev. 2.1 group 01.6 is mapped to NACE Rev. 2 group 01.6
Type: 26:18
Source Concept: Support activities to agriculture and post-harvest crop activities
Target Concept: http://data.europa.eu/ux2/nace2/016
in scheme: Statistical Classification of Economic Activities in the European Community, Rev. 2.1 (NACE Rev. 2.1)
top concept of: Statistical Classification of Economic Activities in the European Community, Rev. 2.1 (NACE Rev. 2.1)
Mapping Cardinality: n m

ConceptNoneRandom0.40720574430891165
type: ConceptAssociation
description: NACE Rev. 2.1 class 30.40 is mapped to NACE Rev. 2 class 30.40
Type: 5:4
Source Concept: Manufacture of military fighting vehicles
Target Concept: http://data.europa.eu/ux2/nace2/3040
in scheme: Statistical Classification of Economic Activities in the European Community, Rev. 2.1 (NACE Rev. 2.1)
scope note: the content of the NACE Rev 2.1 class is fully covered in the corresponding NACE Rev 2 class
top concept of: Statistical Classification of Economic Activities in the European Community, Rev. 2.1 (NACE Rev. 2.1)
Mapping Cardinality: n m

Gambling and betting activities
type: Concept
CoreContentNote: This class includes gambling and betting activities, for example: - bookmaking and other betting operations - off-track betting - operation of casinos (including floating casinos) - sale of lottery tickets - operation (exploitation) of coin-operated gambling machines - quiz app subscriptions with prizes - sports betting - operation of card games as a betting activity - operation of gambling or lottery games
Exclusion Note: This class excludes: - operation of clubs for card games (e.g. bridge clubs), see 93.12
broader: Gambling and betting activities
in scheme: Statistical Classification of Economic Activities in the European Community, Rev. 2.1 (NACE Rev. 2.1)
Notation: 92.00
top concept of: Statistical Classification of Economic Activities in the European Community, Rev. 2.1 (NACE Rev. 2.1)

ConceptNoneRandom0.1307349675457663
type: ConceptAssociation
description: NACE Rev. 2.1 group 10.1 is mapped to NACE Rev. 2 group 10.1
Type: 1:1
Source Concept: Processing and preserving of meat and production of meat products
Target Concept: http://data.europa.eu/ux2/nace2/101
in scheme: Statistical Classification of Economic Activities in the European Community, Rev. 2.1 (NACE Rev. 2.1)
top concept of: Statistical Classification of Economic Activities in the European Community, Rev. 2.1 (NACE Rev. 2.1)
Mapping Cardinality: 1 1

ConceptNoneRandom0.7865631151414342
type: ConceptAssociation
description: NACE Rev. 2.1 group 23.4 is mapped to NACE Rev. 2 group 23.4
Type: 2:2
Source Concept: Manufacture of other porcelain and ceramic products
Target Concept: http://data.europa.eu/ux2/nace2/234
in scheme: Statistical Classification of Economic Activities in the European Community, Rev. 2.1 (NACE Rev. 2.1)
top concept of: Statistical Classification of Economic Activities in the European Community, Rev. 2.1 (NACE Rev. 2.1)
Mapping Cardinality: n m

Other information service activities
type: Concept
CoreContentNote: This class includes: - other information service activities not elsewhere classified, e.g.: • information search services on a contract or fee basis (e.g. by web scraping) • news clipping services, press clipping services • compiling of information or directories on a fee or contract basis
Exclusion Note: This class excludes: - intermediation service activities for specialised construction services, see 43.60 - intermediation service activities for retail sale, see 47.9 - intermediation service activities for transport, see 52.3 - intermediation service activities for postal and courier activities, see 53.30 - intermediation service activities for accommodation, see 55.40 - intermediation service activities for food and beverage service activities, see 56.40 - publishing activities, see division 58 - broadcasting activities, see division 60 - news syndicate and news agency activities, see 60.31 - intermediation service activities for telecommunication, see 61.20 - intermediation service activities for real estate activities, see 68.31 - intermediation service activities for the rental and leasing of tangible goods and non-financial intangible assets, see 77.5 - activities of call centres, see 82.20 - intermediation service activities for business support service activities n.e.c., see 82.40 - intermediation service activities for courses and tutors, see 85.61 - intermediation service activities for medical, dental and other human health services, see 86.97 - intermediation service activities for residential care activities, see 87.91 - intermediation service activities for the repair and maintenance of computers, personal and household goods, and motor vehicles and motorcycles, see 95.40 - intermediation service activities for personal services, see 96.40
broader: Web search portal activities and other information service activities
in scheme: Statistical Classification of Economic Activities in the European Community, Rev. 2.1 (NACE Rev. 2.1)
Notation: 63.92
top concept of: Statistical Classification of Economic Activities in the European Community, Rev. 2.1 (NACE Rev. 2.1)

Activities of call centres
type: Concept
Additional Content Note: This class also includes the activities of: - centres dealing with customer requests for assistance or addressing customer complaints through other communication channels
CoreContentNote: This class includes the activities of: - inbound call centres, including answering calls from clients by using human operators, automatic call distribution, computer telephone integration, interactive voice response systems or similar methods to receive orders, provide product information, deal with customer requests for assistance or address customer complaints - outbound call centres using similar methods to market goods or services to potential customers; conducting telephone interviews for market and opinion research surveys on a contract or fee basis - web-based contact centres
Exclusion Note: This class excludes: - activities of brokers and agents for electric power and natural gas, see 35.40 - intermediation service activities for specialised construction services, see 43.60 - intermediation service activities for retail sale, see 47.9 - intermediation service activities for transport, see 52.3 - intermediation service activities for postal and courier activities, see 53.30 - intermediation service activities for accommodation, see 55.40 - intermediation service activities for food and beverage service activities, see 56.40 - intermediation service activities for video game software publishing, see 58.21 - intermediation service activities for software publishing and software downloads, see 58.29 - intermediation service activities for telecommunication activities, see 61.20 - financial and insurance intermediation service activities, see section L (e.g. activities of insurance agents and brokers (class 66.22)) - intermediation service activities for real estate activities, see 68.31 - market research and public opinion polling and statistical analysis thereof, see 73.20 - patent brokering (marketing) service activities, see 74.91 - intermediation service activities for the rental and leasing of tangible goods and non-financial intangible assets, see 77.5 - travel agency activities, see 79.11 - intermediation service activities for business support activities (except financial intermediation) n.e.c., see 82.40 - intermediation service activities for courses and tutors, see 85.61 - intermediation service activities for medical, dental and other health services, see 86.97 - intermediation service activities for residential care activities, see 87.91 - intermediation service activities for the repair and maintenance of computers, personal and household goods, motor vehicles and motorcycles, see 95.40 - intermediation service activities for personal services, see 96.40
broader: Activities of call centres
in scheme: Statistical Classification of Economic Activities in the European Community, Rev. 2.1 (NACE Rev. 2.1)
Notation: 82.20
top concept of: Statistical Classification of Economic Activities in the European Community, Rev. 2.1 (NACE Rev. 2.1)

Manufacture of footwear
type: Concept
broader: Manufacture of leather and related products of other materials
in scheme: Statistical Classification of Economic Activities in the European Community, Rev. 2.1 (NACE Rev. 2.1)
Notation: 15.2
top concept of: Statistical Classification of Economic Activities in the European Community, Rev. 2.1 (NACE Rev. 2.1)

ConceptNoneRandom0.6214655443499049
type: ConceptAssociation
description: NACE Rev. 2.1 division 55 is mapped to NACE Rev. 2 divisions 55, 68, 79
Type: 48:49
Source Concept: Accommodation
Target Concept: http://data.europa.eu/ux2/nace2/55
Target Concept: http://data.europa.eu/ux2/nace2/79
Target Concept: http://data.europa.eu/ux2/nace2/68
in scheme: Statistical Classification of Economic Activities in the European Community, Rev. 2.1 (NACE Rev. 2.1)
top concept of: Statistical Classification of Economic Activities in the European Community, Rev. 2.1 (NACE Rev. 2.1)
Mapping Cardinality: n m

Activities of other membership organisations
type: Concept
CoreContentNote: This group includes the activities of units (except business and employers’ membership organisations, professional membership organisations and trade unions) that promote the interests of their members.
broader: Activities of membership organisations
in scheme: Statistical Classification of Economic Activities in the European Community, Rev. 2.1 (NACE Rev. 2.1)
Notation: 94.9
top concept of: Statistical Classification of Economic Activities in the European Community, Rev. 2.1 (NACE Rev. 2.1)

ConceptNoneRandom0.968203671410966
type: ConceptAssociation
description: NACE Rev. 2.1 class 85.59 is mapped to NACE Rev. 2 class 85.59
Type: 1:1
Source Concept: Other education n.e.c.
Target Concept: http://data.europa.eu/ux2/nace2/8559
in scheme: Statistical Classification of Economic Activities in the European Community, Rev. 2.1 (NACE Rev. 2.1)
scope note: the content of the NACE Rev 2.1 class is fully covered in the corresponding NACE Rev 2 class
top concept of: Statistical Classification of Economic Activities in the European Community, Rev. 2.1 (NACE Rev. 2.1)
Mapping Cardinality: 1 1

Sewerage
type: Concept
broader: Sewerage
in scheme: Statistical Classification of Economic Activities in the European Community, Rev. 2.1 (NACE Rev. 2.1)
Notation: 37.0
top concept of: Statistical Classification of Economic Activities in the European Community, Rev. 2.1 (NACE Rev. 2.1)

Manufacture of paper stationery
type: Concept
CoreContentNote: This class includes: - manufacture of printing and writing paper ready for use - manufacture of computer print-out paper ready for use - manufacture of self-copy paper ready for use - manufacture of duplicator stencils and carbon paper ready for use - manufacture of gummed or adhesive paper ready for use - manufacture of envelopes and letter cards - manufacture of educational and commercial stationery (notebooks, binders, registers, accounting books, business forms, etc.), when the printed information is not the main characteristic - manufacture of boxes, pouches, wallets and writing compendiums containing an assortment of paper stationery
Exclusion Note: This class excludes: - printing on paper products, see 18.1
broader: Manufacture of articles of paper and paperboard
in scheme: Statistical Classification of Economic Activities in the European Community, Rev. 2.1 (NACE Rev. 2.1)
Notation: 17.23
top concept of: Statistical Classification of Economic Activities in the European Community, Rev. 2.1 (NACE Rev. 2.1)

ConceptNoneRandom0.7687132779047685
type: ConceptAssociation
description: NACE Rev. 2.1 group 10.2 is mapped to NACE Rev. 2 group 10.2
Type: 1:1
Source Concept: Processing and preserving of fish, crustaceans and molluscs
Target Concept: http://data.europa.eu/ux2/nace2/102
in scheme: Statistical Classification of Economic Activities in the European Community, Rev. 2.1 (NACE Rev. 2.1)
top concept of: Statistical Classification of Economic Activities in the European Community, Rev. 2.1 (NACE Rev. 2.1)
Mapping Cardinality: 1 1

ConceptNoneRandom0.6195752181238805
type: ConceptAssociation
description: NACE Rev. 2.1 section S is mapped to NACE Rev. 2 sections C, F, N, P, R
Type: 18:17
Source Concept: ARTS, SPORTS AND RECREATION
Target Concept: http://data.europa.eu/ux2/nace2/F
Target Concept: http://data.europa.eu/ux2/nace2/N
Target Concept: http://data.europa.eu/ux2/nace2/P
Target Concept: http://data.europa.eu/ux2/nace2/C
Target Concept: http://data.europa.eu/ux2/nace2/R
in scheme: Statistical Classification of Economic Activities in the European Community, Rev. 2.1 (NACE Rev. 2.1)
top concept of: Statistical Classification of Economic Activities in the European Community, Rev. 2.1 (NACE Rev. 2.1)
Mapping Cardinality: n m

ConceptNoneRandom0.7399638446739657
type: ConceptAssociation
description: NACE Rev. 2.1 group 01.7 is mapped to NACE Rev. 2 group 01.7
Type: 1:1
Source Concept: Hunting, trapping and related service activities
Target Concept: http://data.europa.eu/ux2/nace2/017
in scheme: Statistical Classification of Economic Activities in the European Community, Rev. 2.1 (NACE Rev. 2.1)
top concept of: Statistical Classification of Economic Activities in the European Community, Rev. 2.1 (NACE Rev. 2.1)
Mapping Cardinality: 1 1

Remediation activities and other waste management service activities
type: Concept
Additional Content Note: This class also includes: - site remediation containment, control and monitoring services
CoreContentNote: This class includes: - decontamination of soils and groundwater at the place of pollution, either in situ or ex situ, using, e.g. mechanical, chemical or biological methods - decontamination of industrial plants or sites, including nuclear plants and sites - decontamination and cleaning up of surface water following accidental pollution (e.g. through collection of pollutants or through application of chemicals) - cleaning up oil spills and other pollutions on land, in surface water, in ocean and seas, including coastal areas - asbestos, lead paint and other toxic material abatement - clearing of landmines, etc., including detonation at the site - other specialised pollution-control activities - carbon capture activities - remediation of mining sites
Exclusion Note: This class excludes: - pest control in agriculture, see 01.61 - purification of water for water supply purposes, see 36.00 - treatment of waste with recovery, see 38.2 - treatment of waste for disposal, see 38.3 - storage of captured carbon dioxide (CO2), see 38.32 - civil engineering projects for the rehabilitation of mining sites, see section F - outdoor sweeping and watering of streets, see 81.23
broader: Remediation activities and other waste management service activities
in scheme: Statistical Classification of Economic Activities in the European Community, Rev. 2.1 (NACE Rev. 2.1)
Notation: 39.00
top concept of: Statistical Classification of Economic Activities in the European Community, Rev. 2.1 (NACE Rev. 2.1)

ConceptNoneRandom0.2548892627208649
type: ConceptAssociation
description: NACE Rev. 2.1 group 23.5 is mapped to NACE Rev. 2 group 23.5
Type: 1:1
Source Concept: Manufacture of cement, lime and plaster
Target Concept: http://data.europa.eu/ux2/nace2/235
in scheme: Statistical Classification of Economic Activities in the European Community, Rev. 2.1 (NACE Rev. 2.1)
top concept of: Statistical Classification of Economic Activities in the European Community, Rev. 2.1 (NACE Rev. 2.1)
Mapping Cardinality: 1 1

Activities of agents involved in the wholesale of agricultural raw materials, live animals, textile raw materials and semi-finished goods
type: Concept
CoreContentNote: This class includes: - activities of agents involved in the wholesale of livestock feed - activities of agents involved in wholesale auctions for fur skin
Exclusion Note: This class excludes: - activities of agents involved in the wholesale of food for pets, see 46.17 - wholesale on own account, see 46.2 to 46.9 - activities of commission agents who assume ownership of the goods, even if they are acting in the name of a third party, see 46.2 to 46.9
broader: Wholesale on a fee or contract basis
in scheme: Statistical Classification of Economic Activities in the European Community, Rev. 2.1 (NACE Rev. 2.1)
Notation: 46.11
top concept of: Statistical Classification of Economic Activities in the European Community, Rev. 2.1 (NACE Rev. 2.1)

Web search portal activities
type: Concept
CoreContentNote: This class includes: - operation of web sites that use a search engine to generate and maintain extensive databases of internet addresses and content in an easily searchable format; these web search portals are not responsible for the content - operation of comparison websites for prices, product specification, etc., with provision of links to other websites
Exclusion Note: This class excludes: - intermediation service activities for specialised construction services, see 43.60 - intermediation service activities for retail sale, see 47.9 - intermediation service activities for transport, see 52.3 - intermediation service activities for postal and courier activities, see 53.30 - intermediation service activities for accommodation, see 55.40 - intermediation service activities for food and beverage service activities, see 56.40 - publishing activities, see division 58 - broadcasting activities, see division 60 - news syndicate and news agency activities, see 60.31 - intermediation service activities for telecommunication, see 61.20 - intermediation service activities for real estate activities, see 68.31 - intermediation service activities for the rental and leasing of tangible goods and non-financial intangible assets, see 77.5 - activities of call centres, see 82.20 - intermediation service activities for business support service activities n.e.c., see 82.40 - intermediation service activities for courses and tutors, see 85.61 - intermediation service activities for medical, dental and other human health services, see 86.97 - intermediation service activities for residential care activities, see 87.91 - intermediation service activities for the repair and maintenance of computers, personal and household goods, and motor vehicles and motorcycles, see 95.40 - intermediation service activities for personal services, see 96.40
broader: Web search portal activities and other information service activities
in scheme: Statistical Classification of Economic Activities in the European Community, Rev. 2.1 (NACE Rev. 2.1)
Notation: 63.91
top concept of: Statistical Classification of Economic Activities in the European Community, Rev. 2.1 (NACE Rev. 2.1)

Arts creation activities
type: Concept
CoreContentNote: This group includes activities in literary creation, musical composition, visual arts creation and related activities.
broader: Arts creation and performing arts activities
in scheme: Statistical Classification of Economic Activities in the European Community, Rev. 2.1 (NACE Rev. 2.1)
Notation: 90.1
top concept of: Statistical Classification of Economic Activities in the European Community, Rev. 2.1 (NACE Rev. 2.1)

Extraction of crude petroleum
type: Concept
Additional Content Note: This class also includes: - extraction of bituminous or oil shale and tar sand - production of crude petroleum from bituminous shale and sand - processes to obtain crude oils (e.g. decantation, desalting, dehydration, stabilisation)
CoreContentNote: This class includes: - extraction of crude petroleum oils
Exclusion Note: This class excludes: - extraction of condensates or natural gas liquids, see 06.20 - support activities for oil and natural gas extraction, see 09.10 - oil and gas exploration, see 09.10 - production of natural gas liquids from crude petroleum (crude oil), see 19.20 - manufacture of refined petroleum products, see 19.20 - recovery of liquefied petroleum gases in the refining of petroleum, see 19.20 - operation of pipelines, see 49.50
broader: Extraction of crude petroleum
in scheme: Statistical Classification of Economic Activities in the European Community, Rev. 2.1 (NACE Rev. 2.1)
Notation: 06.10
top concept of: Statistical Classification of Economic Activities in the European Community, Rev. 2.1 (NACE Rev. 2.1)

Manufacture of bodies and coachwork for motor vehicles; manufacture of trailers and semi-trailers
type: Concept
CoreContentNote: This class includes: - manufacture of bodies, including cabs for motor vehicles, e.g.: • fire engines, travelling libraries, armoured vehicles • concrete mixer lorries - outfitting of all types of motor vehicles, trailers and semi-trailers - manufacture of trailers and semi-trailers, e.g.: • tankers, trailers with closed and open bodies • caravans - reconditioning and customising of motor vehicles - manufacture of containers (including containers for the transport of fluids) specially designed and equipped for carriage by one or more modes of transport - manufacture of chassis for trailers
Exclusion Note: This class excludes: - manufacture of trailers and semi-trailers specially designed for use in agriculture, see 28.30 - manufacture of parts and accessories of bodies for motor vehicles, see 29.32 - manufacture of vehicles drawn by animals, see 30.99
broader: Manufacture of bodies and coachwork for motor vehicles; manufacture of trailers and semi-trailers
in scheme: Statistical Classification of Economic Activities in the European Community, Rev. 2.1 (NACE Rev. 2.1)
Notation: 29.20
top concept of: Statistical Classification of Economic Activities in the European Community, Rev. 2.1 (NACE Rev. 2.1)

ConceptNoneRandom0.17678867680468757
type: ConceptAssociation
description: NACE Rev. 2.1 class 87.30 is mapped to NACE Rev. 2 class 87.30
Type: 1:1
Source Concept: Residential care activities for older persons or persons with physical disabilities
Target Concept: http://data.europa.eu/ux2/nace2/8730
in scheme: Statistical Classification of Economic Activities in the European Community, Rev. 2.1 (NACE Rev. 2.1)
scope note: the content of the NACE Rev 2.1 class is fully covered in the corresponding NACE Rev 2 class
top concept of: Statistical Classification of Economic Activities in the European Community, Rev. 2.1 (NACE Rev. 2.1)
Mapping Cardinality: 1 1

Other activities auxiliary to financial services, except insurance and pension funding
type: Concept
Additional Content Note: This class also includes: - activities of tax refund offices - consumer credit intermediation - activities of payment providers (e.g. electronic funds transfer services), including peer-to-peer payment services - analysing financial markets as an advisory service
CoreContentNote: This class includes auxiliary financial service activities not elsewhere classified, for example: - financial transaction processing and settlement activities, including digital (or internet-based) payment provision and settlement activities for credit card transactions - investment advisory services, including robo-advisory services - activities of mortgage and loan advisors and brokerage - activities of digital currency wallet providers - activities of financial advisors in relation to merger and acquisition services - validation and mining for crypto-assets deemed financial assets - securities custody - tokenisation of digital assets, including security token offerings, initial coin offerings
Exclusion Note: This class excludes: - publishing of financial markets analysis, see 58.19 - information search services regarding financial markets, see 63.92 - crypto-assets exchanges, see 66.11 - brokerage activities, see 66.12 - activities of insurance agents and brokers, see 66.22 - management of funds, see 66.30 - activities of debt collection agencies and non-performing loans servicers, see 82.91 - trading and brokerage of crypto-assets without liabilities, see 82.99
broader: Activities auxiliary to financial services, except insurance and pension funding
in scheme: Statistical Classification of Economic Activities in the European Community, Rev. 2.1 (NACE Rev. 2.1)
Notation: 66.19
top concept of: Statistical Classification of Economic Activities in the European Community, Rev. 2.1 (NACE Rev. 2.1)

Manufacture of household and sanitary goods and of toilet requisites
type: Concept
CoreContentNote: This class includes: - manufacture of household and personal hygiene paper and cellulose wadding products: • cleansing tissues • handkerchiefs, towels, serviettes • toilet paper • sanitary towels and tampons, napkins and napkin liners for babies • cups, dishes and trays - manufacture of textile wadding and articles of wadding: sanitary towels, tampons, etc.
Exclusion Note: This class excludes: - manufacture of cellulose wadding, see 17.12
broader: Manufacture of articles of paper and paperboard
in scheme: Statistical Classification of Economic Activities in the European Community, Rev. 2.1 (NACE Rev. 2.1)
Notation: 17.22
top concept of: Statistical Classification of Economic Activities in the European Community, Rev. 2.1 (NACE Rev. 2.1)

Business and other management consultancy activities
type: Concept
Additional Content Note: This class also includes: - certification of management (e.g. by management audits) - activities of a management company, exercising the mandate of a director or a manager
CoreContentNote: This class includes the provision of advice, guidance and operational assistance to businesses and other organisations on management issues (for example, corporate strategic and organisational planning, business process re-engineering, change management, cost reduction and other financial issues; marketing objectives and policies; human resources policies, practices and planning; compensation and retirement strategies; production scheduling and control planning). This provision of business services may include advice, guidance or operational assistance to businesses and the public service regarding: - design of accounting methods or procedures - cost accounting programmes - budgetary control procedures - public procurement procedures - business start-up service activities - planning, organisation, efficiency and control - management information, etc.
Exclusion Note: This class excludes: - design of computer software for accounting systems, see 62.10 - legal advice and representation, see 69.10 - accounting, bookkeeping and auditing activities, tax consulting, see 69.20 - supervisory activities and management of other units of the enterprise or enterprise group, see 70.10 - architectural and engineering advisory activities, see 71.11, 71.12 - provision of advice, guidance and operational assistance on public relations and communication, see 73.30 - environmental, agronomy and similar consulting activities, see 74.99 - consulting activities for executive search and placement, see 78.10 - activities of casting agents, see 78.10 - staff selection activities, see 78.10 - educational consulting activities, see 85.69
broader: Business and other management consultancy activities
in scheme: Statistical Classification of Economic Activities in the European Community, Rev. 2.1 (NACE Rev. 2.1)
Notation: 70.20
top concept of: Statistical Classification of Economic Activities in the European Community, Rev. 2.1 (NACE Rev. 2.1)

ConceptNoneRandom0.902025118351602
type: ConceptAssociation
description: NACE Rev. 2.1 group 01.4 is mapped to NACE Rev. 2 groups 01.4, 01.6, 03.2
Type: 26:18
Source Concept: Animal production
Target Concept: http://data.europa.eu/ux2/nace2/032
Target Concept: http://data.europa.eu/ux2/nace2/014
Target Concept: http://data.europa.eu/ux2/nace2/016
in scheme: Statistical Classification of Economic Activities in the European Community, Rev. 2.1 (NACE Rev. 2.1)
top concept of: Statistical Classification of Economic Activities in the European Community, Rev. 2.1 (NACE Rev. 2.1)
Mapping Cardinality: n m

ConceptNoneRandom0.3672133588890185
type: ConceptAssociation
description: NACE Rev. 2.1 group 23.2 is mapped to NACE Rev. 2 group 23.2
Type: 1:1
Source Concept: Manufacture of refractory products
Target Concept: http://data.europa.eu/ux2/nace2/232
in scheme: Statistical Classification of Economic Activities in the European Community, Rev. 2.1 (NACE Rev. 2.1)
top concept of: Statistical Classification of Economic Activities in the European Community, Rev. 2.1 (NACE Rev. 2.1)
Mapping Cardinality: 1 1

ConceptNoneRandom0.7558570886145014
type: ConceptAssociation
description: NACE Rev. 2.1 section V is mapped to NACE Rev. 2 section U
Type: 1:1
Source Concept: ACTIVITIES OF EXTRATERRITORIAL ORGANISATIONS AND BODIES
Target Concept: http://data.europa.eu/ux2/nace2/U
in scheme: Statistical Classification of Economic Activities in the European Community, Rev. 2.1 (NACE Rev. 2.1)
top concept of: Statistical Classification of Economic Activities in the European Community, Rev. 2.1 (NACE Rev. 2.1)
Mapping Cardinality: 1 1

Activities of agents involved in the wholesale of fuels, ores, metals and industrial chemicals
type: Concept
CoreContentNote: This class includes the activities of agents involved in the wholesale of: - fuels, ores, metals and industrial chemicals, including fertilisers
Exclusion Note: This class excludes: - wholesale on own account, see 46.2 to 46.9 - activities of commission agents who assume ownership of the goods, even if they are acting in the name of a third party, see 46.2 to 46.9
broader: Wholesale on a fee or contract basis
in scheme: Statistical Classification of Economic Activities in the European Community, Rev. 2.1 (NACE Rev. 2.1)
Notation: 46.12
top concept of: Statistical Classification of Economic Activities in the European Community, Rev. 2.1 (NACE Rev. 2.1)

Landscape service activities
type: Concept
broader: Services to buildings and landscape activities
in scheme: Statistical Classification of Economic Activities in the European Community, Rev. 2.1 (NACE Rev. 2.1)
Notation: 81.3
top concept of: Statistical Classification of Economic Activities in the European Community, Rev. 2.1 (NACE Rev. 2.1)

ConceptNoneRandom0.4745241087298995
type: ConceptAssociation
description: NACE Rev. 2.1 class 77.51 is mapped to NACE Rev. 2 classes 79.11, 79.90, 82.99
Type: 78:65
Source Concept: Intermediation service activities for rental and leasing of cars, motorhomes and trailers
Target Concept: http://data.europa.eu/ux2/nace2/7911
Target Concept: http://data.europa.eu/ux2/nace2/8299
Target Concept: http://data.europa.eu/ux2/nace2/7990
in scheme: Statistical Classification of Economic Activities in the European Community, Rev. 2.1 (NACE Rev. 2.1)
scope note: 79.11: - other travel-related reservation services: • reservations services for car rentals 79.90: - other travel-related reservation services: • reservation services for car rentals
top concept of: Statistical Classification of Economic Activities in the European Community, Rev. 2.1 (NACE Rev. 2.1)
Mapping Cardinality: n m

ConceptNoneRandom0.06506397918499884
type: ConceptAssociation
description: NACE Rev. 2.1 class 16.12 is mapped to NACE Rev. 2 class 16.10
Type: 2:1
Source Concept: Processing and finishing of wood
Target Concept: http://data.europa.eu/ux2/nace2/1610
in scheme: Statistical Classification of Economic Activities in the European Community, Rev. 2.1 (NACE Rev. 2.1)
scope note: the content of the NACE Rev 2.1 class is fully covered in the corresponding NACE Rev 2 class
top concept of: Statistical Classification of Economic Activities in the European Community, Rev. 2.1 (NACE Rev. 2.1)
Mapping Cardinality: n 1

ConceptNoneRandom0.36947944171810243
type: ConceptAssociation
description: NACE Rev. 2.1 division 58 is mapped to NACE Rev. 2 division 58
Type: 1:1
Source Concept: Publishing activities
Target Concept: http://data.europa.eu/ux2/nace2/58
in scheme: Statistical Classification of Economic Activities in the European Community, Rev. 2.1 (NACE Rev. 2.1)
top concept of: Statistical Classification of Economic Activities in the European Community, Rev. 2.1 (NACE Rev. 2.1)
Mapping Cardinality: 1 1

Manufacture of agricultural and forestry machinery
type: Concept
broader: Manufacture of machinery and equipment n.e.c.
in scheme: Statistical Classification of Economic Activities in the European Community, Rev. 2.1 (NACE Rev. 2.1)
Notation: 28.3
top concept of: Statistical Classification of Economic Activities in the European Community, Rev. 2.1 (NACE Rev. 2.1)

Activities of agents involved in the wholesale of timber and building materials
type: Concept
Additional Content Note: This class also includes: - activities of agents involved in the wholesale of: • prefabricated buildings and building equipment • pallets and wooden containers and their parts • sanitary equipment
Exclusion Note: This class excludes: - wholesale on own account, see 46.2 to 46.9 - activities of commission agents who assume ownership of the goods, even if they are acting in the name of a third party, see 46.2 to 46.9
broader: Wholesale on a fee or contract basis
in scheme: Statistical Classification of Economic Activities in the European Community, Rev. 2.1 (NACE Rev. 2.1)
Notation: 46.13
top concept of: Statistical Classification of Economic Activities in the European Community, Rev. 2.1 (NACE Rev. 2.1)

ConceptNoneRandom0.9494270412715963
type: ConceptAssociation
description: NACE Rev. 2.1 class 10.81 is mapped to NACE Rev. 2 class 10.81
Type: 1:1
Source Concept: Manufacture of sugar
Target Concept: http://data.europa.eu/ux2/nace2/1081
in scheme: Statistical Classification of Economic Activities in the European Community, Rev. 2.1 (NACE Rev. 2.1)
scope note: the content of the NACE Rev 2.1 class is fully covered in the corresponding NACE Rev 2 class
top concept of: Statistical Classification of Economic Activities in the European Community, Rev. 2.1 (NACE Rev. 2.1)
Mapping Cardinality: 1 1

Manufacture of corrugated paper, paperboard and containers of paper and paperboard
type: Concept
CoreContentNote: This class includes: - manufacture of corrugated paper and paperboard - manufacture of cartons, boxes and cases of corrugated paper or paperboard - manufacture of folding cartons, boxes and cases of non-corrugated paper or paperboard - manufacture of containers of solid paperboard - manufacture of other containers of paper and paperboard - manufacture of sacks and bags of paper - manufacture of office box files and similar articles
Exclusion Note: This class excludes: - manufacture of envelopes, see 17.23 - manufacture of moulded or pressed articles of paper pulp (e.g. boxes for packing eggs, moulded pulp paper plates), see 17.25
broader: Manufacture of articles of paper and paperboard
in scheme: Statistical Classification of Economic Activities in the European Community, Rev. 2.1 (NACE Rev. 2.1)
Notation: 17.21
top concept of: Statistical Classification of Economic Activities in the European Community, Rev. 2.1 (NACE Rev. 2.1)

ConceptNoneRandom0.19843990640135645
type: ConceptAssociation
description: NACE Rev. 2.1 group 23.3 is mapped to NACE Rev. 2 group 23.3
Type: 1:1
Source Concept: Manufacture of clay building materials
Target Concept: http://data.europa.eu/ux2/nace2/233
in scheme: Statistical Classification of Economic Activities in the European Community, Rev. 2.1 (NACE Rev. 2.1)
top concept of: Statistical Classification of Economic Activities in the European Community, Rev. 2.1 (NACE Rev. 2.1)
Mapping Cardinality: 1 1

ConceptNoneRandom0.19936667170618438
type: ConceptAssociation
description: NACE Rev. 2.1 group 01.5 is mapped to NACE Rev. 2 group 01.5
Type: 1:1
Source Concept: Mixed farming
Target Concept: http://data.europa.eu/ux2/nace2/015
in scheme: Statistical Classification of Economic Activities in the European Community, Rev. 2.1 (NACE Rev. 2.1)
top concept of: Statistical Classification of Economic Activities in the European Community, Rev. 2.1 (NACE Rev. 2.1)
Mapping Cardinality: 1 1

ConceptNoneRandom0.8122750105613334
type: ConceptAssociation
description: NACE Rev. 2.1 section U is mapped to NACE Rev. 2 section T
Type: 1:1
Source Concept: ACTIVITIES OF HOUSEHOLDS AS EMPLOYERS AND UNDIFFERENTIATED GOODS - AND SERVICE-PRODUCING ACTIVITIES OF HOUSEHOLDS FOR OWN USE
Target Concept: http://data.europa.eu/ux2/nace2/T
in scheme: Statistical Classification of Economic Activities in the European Community, Rev. 2.1 (NACE Rev. 2.1)
top concept of: Statistical Classification of Economic Activities in the European Community, Rev. 2.1 (NACE Rev. 2.1)
Mapping Cardinality: 1 1

Publishing of newspapers
type: Concept
Additional Content Note: This class also includes: - advertising newspapers
CoreContentNote: This class includes: - publishing of newspapers All the feasible forms of publishing (in print, digital, analogue, or any other form) are included.
Exclusion Note: This class excludes: - production of television or video news programmes, see 59.11 - news agency activities, see 60.31 - activities of photojournalists, not self-publishing their own created content, see 74.20 - activities of journalists whose content is published by a third party, see 90.11
broader: Publishing of books, newspapers and other publishing activities, except software publishing
in scheme: Statistical Classification of Economic Activities in the European Community, Rev. 2.1 (NACE Rev. 2.1)
Notation: 58.12
scope note: IMPLEMENTATION RULE Newspapers (including advertising newspapers) should be under editorial responsibility and control, appearing or being regularly updated at least four times a week, being composed mainly of literary works of a journalistic nature related to news, and having the purpose to inform the general public. If the product is published in both printed and electronic format, the frequency of publication will be assessed on the basis of the frequency of publication of the printed version.
top concept of: Statistical Classification of Economic Activities in the European Community, Rev. 2.1 (NACE Rev. 2.1)

Manufacture of metal forming machinery and machine tools
type: Concept
CoreContentNote: This group includes the manufacture of metal forming machinery and machine tools (for example, the manufacture of machine tools for working metals and other materials, such as wood, bone, stone, hard rubber, hard plastics, cold glass, and so on), including those using a laser beam, ultrasonic waves, plasma arc or magnetic pulse.
broader: Manufacture of machinery and equipment n.e.c.
in scheme: Statistical Classification of Economic Activities in the European Community, Rev. 2.1 (NACE Rev. 2.1)
Notation: 28.4
top concept of: Statistical Classification of Economic Activities in the European Community, Rev. 2.1 (NACE Rev. 2.1)

Investigation and private security activities
type: Concept
Additional Content Note: This class also includes: - guard and security service activities (e.g. for shops, trauma centres) - luggage and passenger inspection at airports, railway stations and other similar places - activities of security personnel for events, concerts, fairs and exhibitions
CoreContentNote: This class includes: - investigation services in private, commercial, insurance and legal fields - guard, patrol or security services - support services for cash collection and deposit services - secure shredding and data destruction services - armoured car services
Exclusion Note: This class excludes: - risk analysis, security advice and consulting, see 80.09 - remote surveillance activities, see 80.09 - concierge, reception and doormen safety services, see 81.10, 82.10 - public order and safety activities, see 84.24 - security, including cybersecurity training, see 85.59
broader: Investigation and security activities
in scheme: Statistical Classification of Economic Activities in the European Community, Rev. 2.1 (NACE Rev. 2.1)
Notation: 80.01
top concept of: Statistical Classification of Economic Activities in the European Community, Rev. 2.1 (NACE Rev. 2.1)

ConceptNoneRandom0.403912855786156
type: ConceptAssociation
description: NACE Rev. 2.1 class 77.52 is mapped to NACE Rev. 2 class 82.99
Type: 78:65
Source Concept: Intermediation service activities for rental and leasing of other tangible goods and non-financial intangible assets
Target Concept: http://data.europa.eu/ux2/nace2/8299
in scheme: Statistical Classification of Economic Activities in the European Community, Rev. 2.1 (NACE Rev. 2.1)
scope note: the content of the NACE Rev 2.1 class is fully covered in the corresponding NACE Rev 2 class
top concept of: Statistical Classification of Economic Activities in the European Community, Rev. 2.1 (NACE Rev. 2.1)
Mapping Cardinality: n m

ConceptNoneRandom0.43923685035156035
type: ConceptAssociation
description: NACE Rev. 2.1 class 16.11 is mapped to NACE Rev. 2 class 16.10
Type: 2:1
Source Concept: Sawmilling and planing of wood
Target Concept: http://data.europa.eu/ux2/nace2/1610
in scheme: Statistical Classification of Economic Activities in the European Community, Rev. 2.1 (NACE Rev. 2.1)
scope note: the content of the NACE Rev 2.1 class is fully covered in the corresponding NACE Rev 2 class
top concept of: Statistical Classification of Economic Activities in the European Community, Rev. 2.1 (NACE Rev. 2.1)
Mapping Cardinality: n 1

ConceptNoneRandom0.3640427815114329
type: ConceptAssociation
description: NACE Rev. 2.1 division 56 is mapped to NACE Rev. 2 divisions 56, 79
Type: 48:49
Source Concept: Food and beverage service activities
Target Concept: http://data.europa.eu/ux2/nace2/56
Target Concept: http://data.europa.eu/ux2/nace2/79
in scheme: Statistical Classification of Economic Activities in the European Community, Rev. 2.1 (NACE Rev. 2.1)
top concept of: Statistical Classification of Economic Activities in the European Community, Rev. 2.1 (NACE Rev. 2.1)
Mapping Cardinality: n m

Activities of agents involved in the wholesale of machinery, industrial equipment, ships and aircraft
type: Concept
Additional Content Note: This class also includes: - activities of agents involved in the wholesale of agricultural equipment, including tractors - activities of agents involved in the wholesale of yachts and recreational boats
CoreContentNote: This class includes activities of agents involved in the wholesale of: - machinery, including office machinery and computers, industrial equipment, ships and aircraft - telephone and communication equipment, including mobile telephones, modems, etc.
Exclusion Note: This class excludes: - activities of commission agents for motor vehicles and motorcycles, see 46.18 - activities of wholesale auctioneering houses for third-party goods of motor vehicles, including internet wholesale auctions of motor vehicles, see 46.18 - wholesale on own account, see 46.2 to 46.9 - activities of commission agents who assume ownership of the goods, even if they are acting in the name of a third party, see 46.2 to 46.9
broader: Wholesale on a fee or contract basis
in scheme: Statistical Classification of Economic Activities in the European Community, Rev. 2.1 (NACE Rev. 2.1)
Notation: 46.14
top concept of: Statistical Classification of Economic Activities in the European Community, Rev. 2.1 (NACE Rev. 2.1)

ConceptNoneRandom0.3411735598673401
type: ConceptAssociation
description: NACE Rev. 2.1 class 20.60 is mapped to NACE Rev. 2 class 20.60
Type: 1:1
Source Concept: Manufacture of man-made fibres
Target Concept: http://data.europa.eu/ux2/nace2/2060
in scheme: Statistical Classification of Economic Activities in the European Community, Rev. 2.1 (NACE Rev. 2.1)
scope note: the content of the NACE Rev 2.1 class is fully covered in the corresponding NACE Rev 2 class
top concept of: Statistical Classification of Economic Activities in the European Community, Rev. 2.1 (NACE Rev. 2.1)
Mapping Cardinality: 1 1

Tanning, dyeing, dressing of leather and fur; manufacture of luggage, handbags, saddlery and harness
type: Concept
CoreContentNote: This group includes the manufacture of leather and fur and products thereof.
broader: Manufacture of leather and related products of other materials
in scheme: Statistical Classification of Economic Activities in the European Community, Rev. 2.1 (NACE Rev. 2.1)
Notation: 15.1
top concept of: Statistical Classification of Economic Activities in the European Community, Rev. 2.1 (NACE Rev. 2.1)

Publishing of books
type: Concept
CoreContentNote: This class includes: - publishing of books, brochures and similar publications - publishing of dictionaries and encyclopaedias - publishing of atlases, maps and charts - publishing of e-books and audiobooks - publishing of comic books and graphic novels All the feasible forms of publishing (in print, digital, analogue, or any other form) are included.
Exclusion Note: This class excludes: - production of globes, see 32.99 - publishing of advertising material, see 58.19 - publishing of music and sheet music books, see 59.20 - jointly publishing and distributing podcasts, see 59.20 - audiobook streaming activities not associated with its publishing, see 60.10 - activities of independent authors, see 90.11
broader: Publishing of books, newspapers and other publishing activities, except software publishing
in scheme: Statistical Classification of Economic Activities in the European Community, Rev. 2.1 (NACE Rev. 2.1)
Notation: 58.11
top concept of: Statistical Classification of Economic Activities in the European Community, Rev. 2.1 (NACE Rev. 2.1)

Collection of hazardous waste
type: Concept
Additional Content Note: This class also includes: - operation of waste transfer facilities for hazardous waste
CoreContentNote: This class includes the collection of hazardous waste (for example, explosive, oxidising, flammable toxic, irritant, carcinogenic, corrosive, infectious and other substances) and preparations harmful for human health and the environment. The activities may also include identification, treatment, packaging and labelling of waste for the purposes of transport. This class includes: - collection of hazardous waste, e.g.: • used oil from ships or garages • paints and varnishes • biohazardous waste • hazardous waste of animal origin • nuclear waste • collection of expired pharmaceuticals • used batteries
Exclusion Note: This class excludes: - collection of non-hazardous waste, see 38.11 - operation of landfills for the disposal of hazardous waste and permanent storage of hazardous waste, see 38.32 - remediation and clean-up of contaminated buildings, mine sites, soil or groundwater (e.g. asbestos removal), see 39.00
broader: Waste collection
in scheme: Statistical Classification of Economic Activities in the European Community, Rev. 2.1 (NACE Rev. 2.1)
Notation: 38.12
top concept of: Statistical Classification of Economic Activities in the European Community, Rev. 2.1 (NACE Rev. 2.1)

ConceptNoneRandom0.5634995999799783
type: ConceptAssociation
description: NACE Rev. 2.1 class 96.21 is mapped to NACE Rev. 2 class 96.02
Type: 2:1
Source Concept: Hairdressing and barber activities
Target Concept: http://data.europa.eu/ux2/nace2/9602
in scheme: Statistical Classification of Economic Activities in the European Community, Rev. 2.1 (NACE Rev. 2.1)
scope note: the content of the NACE Rev 2.1 class is fully covered in the corresponding NACE Rev 2 class
top concept of: Statistical Classification of Economic Activities in the European Community, Rev. 2.1 (NACE Rev. 2.1)
Mapping Cardinality: n 1

ConceptNoneRandom0.047607242619807644
type: ConceptAssociation
description: NACE Rev. 2.1 group 10.5 is mapped to NACE Rev. 2 group 10.5
Type: 1:1
Source Concept: Manufacture of dairy products and edible ice
Target Concept: http://data.europa.eu/ux2/nace2/105
in scheme: Statistical Classification of Economic Activities in the European Community, Rev. 2.1 (NACE Rev. 2.1)
top concept of: Statistical Classification of Economic Activities in the European Community, Rev. 2.1 (NACE Rev. 2.1)
Mapping Cardinality: 1 1

ConceptNoneRandom0.46872023374254335
type: ConceptAssociation
description: NACE Rev. 2.1 section P is mapped to NACE Rev. 2 sections O, R
Type: 18:17
Source Concept: PUBLIC ADMINISTRATION AND DEFENCE; COMPULSORY SOCIAL SECURITY
Target Concept: http://data.europa.eu/ux2/nace2/O
Target Concept: http://data.europa.eu/ux2/nace2/R
in scheme: Statistical Classification of Economic Activities in the European Community, Rev. 2.1 (NACE Rev. 2.1)
top concept of: Statistical Classification of Economic Activities in the European Community, Rev. 2.1 (NACE Rev. 2.1)
Mapping Cardinality: n m

ConceptNoneRandom0.026296716396926434
type: ConceptAssociation
description: NACE Rev. 2.1 group 32.3 is mapped to NACE Rev. 2 group 32.3
Type: 18:19
Source Concept: Manufacture of sports goods
Target Concept: http://data.europa.eu/ux2/nace2/323
in scheme: Statistical Classification of Economic Activities in the European Community, Rev. 2.1 (NACE Rev. 2.1)
top concept of: Statistical Classification of Economic Activities in the European Community, Rev. 2.1 (NACE Rev. 2.1)
Mapping Cardinality: n m

Publishing of journals and periodicals
type: Concept
CoreContentNote: This class includes: - publishing of journals and other periodicals - publishing of radio and television schedules All the feasible forms of publishing (in print, digital, analogue, or any other form) are included.
Exclusion Note: This class excludes: - production of television or video news programmes, see 59.11 - content distribution via blogs, see 60.39 - activities of photojournalists, not self-publishing their own created content, see 74.20 - activities of journalists whose content is published by a third party, see 90.11
broader: Publishing of books, newspapers and other publishing activities, except software publishing
in scheme: Statistical Classification of Economic Activities in the European Community, Rev. 2.1 (NACE Rev. 2.1)
Notation: 58.13
scope note: IMPLEMENTATION RULE The publishing of a periodically or regularly updated collection of information should be under editorial responsibility and control, composed mainly of literary works of a journalistic nature, and having the purpose to inform the general public. Periodicals and other journals, appear less than four times a week. If the product is published in both printed and electronic format, the frequency of publication will be assessed on the basis of the frequency of publication of the printed version.
top concept of: Statistical Classification of Economic Activities in the European Community, Rev. 2.1 (NACE Rev. 2.1)

ConceptNoneRandom0.8493106120176704
type: ConceptAssociation
description: NACE Rev. 2.1 division 51 is mapped to NACE Rev. 2 division 51
Type: 1:1
Source Concept: Air transport
Target Concept: http://data.europa.eu/ux2/nace2/51
in scheme: Statistical Classification of Economic Activities in the European Community, Rev. 2.1 (NACE Rev. 2.1)
top concept of: Statistical Classification of Economic Activities in the European Community, Rev. 2.1 (NACE Rev. 2.1)
Mapping Cardinality: 1 1

Combined facilities support activities
type: Concept
broader: Services to buildings and landscape activities
in scheme: Statistical Classification of Economic Activities in the European Community, Rev. 2.1 (NACE Rev. 2.1)
Notation: 81.1
top concept of: Statistical Classification of Economic Activities in the European Community, Rev. 2.1 (NACE Rev. 2.1)

ConceptNoneRandom0.898844897947729
type: ConceptAssociation
description: NACE Rev. 2.1 division 99 is mapped to NACE Rev. 2 division 99
Type: 1:1
Source Concept: Activities of extraterritorial organisations and bodies
Target Concept: http://data.europa.eu/ux2/nace2/99
in scheme: Statistical Classification of Economic Activities in the European Community, Rev. 2.1 (NACE Rev. 2.1)
top concept of: Statistical Classification of Economic Activities in the European Community, Rev. 2.1 (NACE Rev. 2.1)
Mapping Cardinality: 1 1

ConceptNoneRandom0.9058478493522228
type: ConceptAssociation
description: NACE Rev. 2.1 class 52.23 is mapped to NACE Rev. 2 class 52.23
Type: 1:1
Source Concept: Service activities incidental to air transportation
Target Concept: http://data.europa.eu/ux2/nace2/5223
in scheme: Statistical Classification of Economic Activities in the European Community, Rev. 2.1 (NACE Rev. 2.1)
scope note: the content of the NACE Rev 2.1 class is fully covered in the corresponding NACE Rev 2 class
top concept of: Statistical Classification of Economic Activities in the European Community, Rev. 2.1 (NACE Rev. 2.1)
Mapping Cardinality: 1 1

Remediation activities and other waste management service activities
type: Concept
CoreContentNote: This division includes the provision of remediation services (for example, cleaning up contaminated buildings, sites, soil, surface or groundwater).
broader: WATER SUPPLY; SEWERAGE, WASTE MANAGEMENT AND REMEDIATION ACTIVITIES
in scheme: Statistical Classification of Economic Activities in the European Community, Rev. 2.1 (NACE Rev. 2.1)
Notation: 39
top concept of: Statistical Classification of Economic Activities in the European Community, Rev. 2.1 (NACE Rev. 2.1)

ConceptNoneRandom0.6930518640016345
type: ConceptAssociation
description: NACE Rev. 2.1 class 84.22 is mapped to NACE Rev. 2 class 84.22
Type: 1:1
Source Concept: Defence activities
Target Concept: http://data.europa.eu/ux2/nace2/8422
in scheme: Statistical Classification of Economic Activities in the European Community, Rev. 2.1 (NACE Rev. 2.1)
scope note: the content of the NACE Rev 2.1 class is fully covered in the corresponding NACE Rev 2 class
top concept of: Statistical Classification of Economic Activities in the European Community, Rev. 2.1 (NACE Rev. 2.1)
Mapping Cardinality: 1 1

Manufacture of general-purpose machinery
type: Concept
broader: Manufacture of machinery and equipment n.e.c.
in scheme: Statistical Classification of Economic Activities in the European Community, Rev. 2.1 (NACE Rev. 2.1)
Notation: 28.1
top concept of: Statistical Classification of Economic Activities in the European Community, Rev. 2.1 (NACE Rev. 2.1)

Activities of agents involved in the wholesale of furniture, household goods, hardware and ironmongery
type: Concept
Exclusion Note: This class excludes: - wholesale on own account, see 46.2 to 46.9 - activities of commission agents who assume ownership of the goods, even if they are acting in the name of a third party, see 46.2 to 46.9
broader: Wholesale on a fee or contract basis
in scheme: Statistical Classification of Economic Activities in the European Community, Rev. 2.1 (NACE Rev. 2.1)
Notation: 46.15
top concept of: Statistical Classification of Economic Activities in the European Community, Rev. 2.1 (NACE Rev. 2.1)

ConceptNoneRandom0.52341936683125
type: ConceptAssociation
description: NACE Rev. 2.1 class 28.13 is mapped to NACE Rev. 2 class 28.13
Type: 1:1
Source Concept: Manufacture of other pumps and compressors
Target Concept: http://data.europa.eu/ux2/nace2/2813
in scheme: Statistical Classification of Economic Activities in the European Community, Rev. 2.1 (NACE Rev. 2.1)
scope note: the content of the NACE Rev 2.1 class is fully covered in the corresponding NACE Rev 2 class
top concept of: Statistical Classification of Economic Activities in the European Community, Rev. 2.1 (NACE Rev. 2.1)
Mapping Cardinality: 1 1

ConceptNoneRandom0.4546966329291645
type: ConceptAssociation
description: NACE Rev. 2.1 class 10.83 is mapped to NACE Rev. 2 class 10.83
Type: 1:1
Source Concept: Processing of tea and coffee
Target Concept: http://data.europa.eu/ux2/nace2/1083
in scheme: Statistical Classification of Economic Activities in the European Community, Rev. 2.1 (NACE Rev. 2.1)
scope note: the content of the NACE Rev 2.1 class is fully covered in the corresponding NACE Rev 2 class
top concept of: Statistical Classification of Economic Activities in the European Community, Rev. 2.1 (NACE Rev. 2.1)
Mapping Cardinality: 1 1

Intermediation service activities for personal services
type: Concept
CoreContentNote: This class includes intermediation for personal services by bringing clients and service providers together for a fee or commission, without the intermediary providing the services intermediated. These intermediation activities can be carried out on digital platforms or through non-digital channels (including face-to-face, door-to-door, telephone, mail, and so on). The fee or commission can be received from either the client or the provider of the personal service. Revenue for the intermediation activities can include other sources of income (for example, revenues from the sale of advertising space).
broader: Intermediation service activities for personal services
in scheme: Statistical Classification of Economic Activities in the European Community, Rev. 2.1 (NACE Rev. 2.1)
Notation: 96.40
top concept of: Statistical Classification of Economic Activities in the European Community, Rev. 2.1 (NACE Rev. 2.1)

ConceptNoneRandom0.9780845352898765
type: ConceptAssociation
description: NACE Rev. 2.1 class 64.21 is mapped to NACE Rev. 2 class 64.20
Type: 4:3
Source Concept: Activities of holding companies
Target Concept: http://data.europa.eu/ux2/nace2/6420
in scheme: Statistical Classification of Economic Activities in the European Community, Rev. 2.1 (NACE Rev. 2.1)
scope note: the content of the NACE Rev 2.1 class is fully covered in the corresponding NACE Rev 2 class
top concept of: Statistical Classification of Economic Activities in the European Community, Rev. 2.1 (NACE Rev. 2.1)
Mapping Cardinality: n m

Collection of non-hazardous waste
type: Concept
Additional Content Note: This class also includes: - collection of construction and demolition waste - collection and removal of debris - collection of waste output of industrial plants - operation of waste transfer facilities for non-hazardous waste
CoreContentNote: This class includes: - collection of non-hazardous solid waste (i.e. garbage) within a local area (e.g. from households and businesses), by means of refuse bins, wheeled bins and containers, which may contain mixed recoverable materials - collection of recyclable materials (separated or not) - collection of non-hazardous waste of animal or vegetal origin - collection of used cooking oils and fats - collection of refuse in public places - collection of yard waste
Exclusion Note: This class excludes: - collection of sewage, see division 37 - collection of hazardous waste, see 38.12 - operation of facilities for sorting recoverable waste, see 38.2 - operation of recovery facilities, see 38.2 - operation of landfills for the disposal of non-hazardous waste and permanent storage of non-hazardous waste, see 38.32
broader: Waste collection
in scheme: Statistical Classification of Economic Activities in the European Community, Rev. 2.1 (NACE Rev. 2.1)
Notation: 38.11
top concept of: Statistical Classification of Economic Activities in the European Community, Rev. 2.1 (NACE Rev. 2.1)

ConceptNoneRandom0.9260817293178464
type: ConceptAssociation
description: NACE Rev. 2.1 group 32.4 is mapped to NACE Rev. 2 group 32.4
Type: 1:1
Source Concept: Manufacture of games and toys
Target Concept: http://data.europa.eu/ux2/nace2/324
in scheme: Statistical Classification of Economic Activities in the European Community, Rev. 2.1 (NACE Rev. 2.1)
top concept of: Statistical Classification of Economic Activities in the European Community, Rev. 2.1 (NACE Rev. 2.1)
Mapping Cardinality: 1 1

ConceptNoneRandom0.6648368440260893
type: ConceptAssociation
description: NACE Rev. 2.1 section O is mapped to NACE Rev. 2 sections F, M, N
Type: 18:17
Source Concept: ADMINISTRATIVE AND SUPPORT SERVICE ACTIVITIES
Target Concept: http://data.europa.eu/ux2/nace2/F
Target Concept: http://data.europa.eu/ux2/nace2/M
Target Concept: http://data.europa.eu/ux2/nace2/N
in scheme: Statistical Classification of Economic Activities in the European Community, Rev. 2.1 (NACE Rev. 2.1)
top concept of: Statistical Classification of Economic Activities in the European Community, Rev. 2.1 (NACE Rev. 2.1)
Mapping Cardinality: n m

ConceptNoneRandom0.8991302116742415
type: ConceptAssociation
description: NACE Rev. 2.1 division 50 is mapped to NACE Rev. 2 division 50
Type: 1:1
Source Concept: Water transport
Target Concept: http://data.europa.eu/ux2/nace2/50
in scheme: Statistical Classification of Economic Activities in the European Community, Rev. 2.1 (NACE Rev. 2.1)
top concept of: Statistical Classification of Economic Activities in the European Community, Rev. 2.1 (NACE Rev. 2.1)
Mapping Cardinality: 1 1

ConceptNoneRandom0.17657891013029037
type: ConceptAssociation
description: NACE Rev. 2.1 group 23.9 is mapped to NACE Rev. 2 groups 13.2, 23.9
Type: 3:3
Source Concept: Manufacture of abrasive products and non-metallic mineral products n.e.c.
Target Concept: http://data.europa.eu/ux2/nace2/132
Target Concept: http://data.europa.eu/ux2/nace2/239
in scheme: Statistical Classification of Economic Activities in the European Community, Rev. 2.1 (NACE Rev. 2.1)
top concept of: Statistical Classification of Economic Activities in the European Community, Rev. 2.1 (NACE Rev. 2.1)
Mapping Cardinality: n m

ConceptNoneRandom0.10664087269764089
type: ConceptAssociation
description: NACE Rev. 2.1 group 10.6 is mapped to NACE Rev. 2 groups 10.6, 10.8
Type: 4:4
Source Concept: Manufacture of grain mill products, starches and starch products
Target Concept: http://data.europa.eu/ux2/nace2/106
Target Concept: http://data.europa.eu/ux2/nace2/108
in scheme: Statistical Classification of Economic Activities in the European Community, Rev. 2.1 (NACE Rev. 2.1)
top concept of: Statistical Classification of Economic Activities in the European Community, Rev. 2.1 (NACE Rev. 2.1)
Mapping Cardinality: n m

Cleaning activities
type: Concept
CoreContentNote: This group includes general, specialised and other cleaning activities. The difference between them is not based on the type of customers served, but on the type of cleaning. This group includes the activities of general interior cleaning of all types of buildings, the exterior cleaning of buildings, specialised cleaning activities for buildings or other specialised cleaning activities, cleaning of industrial machinery, cleaning of the inside of road and sea tankers, disinfecting and extermination activities for buildings and industrial machinery, bottle cleaning, street sweeping, snow and ice removal.
Exclusion Note: This group excludes: - agricultural pest control, see 01.61 - carpet and rug shampooing, drapery and curtain cleaning, see 96.10
broader: Services to buildings and landscape activities
in scheme: Statistical Classification of Economic Activities in the European Community, Rev. 2.1 (NACE Rev. 2.1)
Notation: 81.2
top concept of: Statistical Classification of Economic Activities in the European Community, Rev. 2.1 (NACE Rev. 2.1)

ConceptNoneRandom0.02774163277656927
type: ConceptAssociation
description: NACE Rev. 2.1 division 98 is mapped to NACE Rev. 2 division 98
Type: 1:1
Source Concept: Undifferentiated goods- and service-producing activities of private households for own use
Target Concept: http://data.europa.eu/ux2/nace2/98
in scheme: Statistical Classification of Economic Activities in the European Community, Rev. 2.1 (NACE Rev. 2.1)
top concept of: Statistical Classification of Economic Activities in the European Community, Rev. 2.1 (NACE Rev. 2.1)
Mapping Cardinality: 1 1

Manufacture of agricultural and forestry machinery
type: Concept
CoreContentNote: This class includes: - manufacture of agricultural and forestry tractors - manufacture of track-laying tractors - manufacture of single-axle (pedestrian-controlled) tractors - manufacture of mowers, including lawnmowers - manufacture of self-loading or self-unloading trailers or semi-trailers for agricultural purposes - manufacture of agricultural machinery for soil preparation or cultivation, e.g.: • ploughs, harrows, manure spreaders, seeders, fertiliser distributors, etc. - manufacture of harvesting or threshing machinery, e.g.: • harvesters, threshers, sorters, etc. - manufacture of milking machines - manufacture of agricultural or horticultural spraying appliances - manufacture of diverse agricultural machinery, e.g.: • poultry-keeping machinery, bee-keeping equipment, equipment for preparing fodder, etc. • machines for cleaning, sorting or grading eggs, fruits, etc. - manufacture of machinery for vertical farming
Exclusion Note: This class excludes: - manufacture of non-power-driven hand tools, of a kind used in agriculture, horticulture or forestry, see 25.63 - manufacture of conveyors for farm use, see 28.22 - manufacture of power-driven hand tools, see 28.24 - manufacture of earth-moving machinery, see 28.92 - manufacture of cream separators, see 28.93 - manufacture of machinery to clean, sort or grade seed, grain or dried leguminous vegetables, see 28.93 - manufacture of road tractors for semi-trailers, see 29.10 - manufacture of trailers or semi-trailers for other than agricultural purposes, see 29.20
broader: Manufacture of agricultural and forestry machinery
in scheme: Statistical Classification of Economic Activities in the European Community, Rev. 2.1 (NACE Rev. 2.1)
Notation: 28.30
top concept of: Statistical Classification of Economic Activities in the European Community, Rev. 2.1 (NACE Rev. 2.1)

ConceptNoneRandom0.9024355279256814
type: ConceptAssociation
description: NACE Rev. 2.1 class 52.22 is mapped to NACE Rev. 2 class 52.22
Type: 1:1
Source Concept: Service activities incidental to water transportation
Target Concept: http://data.europa.eu/ux2/nace2/5222
in scheme: Statistical Classification of Economic Activities in the European Community, Rev. 2.1 (NACE Rev. 2.1)
scope note: the content of the NACE Rev 2.1 class is fully covered in the corresponding NACE Rev 2 class
top concept of: Statistical Classification of Economic Activities in the European Community, Rev. 2.1 (NACE Rev. 2.1)
Mapping Cardinality: 1 1

ConceptNoneRandom0.14886503208377377
type: ConceptAssociation
description: NACE Rev. 2.1 class 84.23 is mapped to NACE Rev. 2 class 84.23
Type: 1:1
Source Concept: Justice and judicial activities
Target Concept: http://data.europa.eu/ux2/nace2/8423
in scheme: Statistical Classification of Economic Activities in the European Community, Rev. 2.1 (NACE Rev. 2.1)
scope note: the content of the NACE Rev 2.1 class is fully covered in the corresponding NACE Rev 2 class
top concept of: Statistical Classification of Economic Activities in the European Community, Rev. 2.1 (NACE Rev. 2.1)
Mapping Cardinality: 1 1

Mining of lignite
type: Concept
CoreContentNote: This class includes: - mining of lignite (brown coal): underground or surface mining, including mining through liquefaction methods - washing, dehydrating, pulverising, compressing of lignite to improve quality or facilitate transport or storage
Exclusion Note: This class excludes: - hard coal mining, see 05.10 - peat digging, see 08.92 - support activities for lignite mining, see 09.90 - test drilling for coal mining, see 09.90 - manufacture of lignite fuel briquettes, ovoids and similar solid lignite fuels, see 19.20 - work performed to develop or prepare properties for lignite mining, see 43.12
broader: Mining of lignite
in scheme: Statistical Classification of Economic Activities in the European Community, Rev. 2.1 (NACE Rev. 2.1)
Notation: 05.20
top concept of: Statistical Classification of Economic Activities in the European Community, Rev. 2.1 (NACE Rev. 2.1)

Manufacture of other general-purpose machinery
type: Concept
broader: Manufacture of machinery and equipment n.e.c.
in scheme: Statistical Classification of Economic Activities in the European Community, Rev. 2.1 (NACE Rev. 2.1)
Notation: 28.2
top concept of: Statistical Classification of Economic Activities in the European Community, Rev. 2.1 (NACE Rev. 2.1)

Activities of agents involved in the wholesale of textiles, clothing, fur, footwear and leather goods
type: Concept
Exclusion Note: This class excludes: - wholesale on own account, see 46.2 to 46.9 - activities of commission agents who assume ownership of the goods, even if they are acting in the name of a third party, see 46.2 to 46.9
broader: Wholesale on a fee or contract basis
in scheme: Statistical Classification of Economic Activities in the European Community, Rev. 2.1 (NACE Rev. 2.1)
Notation: 46.16
top concept of: Statistical Classification of Economic Activities in the European Community, Rev. 2.1 (NACE Rev. 2.1)

ConceptNoneRandom0.16442511621505462
type: ConceptAssociation
description: NACE Rev. 2.1 class 10.82 is mapped to NACE Rev. 2 class 10.82
Type: 1:1
Source Concept: Manufacture of cocoa, chocolate and sugar confectionery
Target Concept: http://data.europa.eu/ux2/nace2/1082
in scheme: Statistical Classification of Economic Activities in the European Community, Rev. 2.1 (NACE Rev. 2.1)
scope note: the content of the NACE Rev 2.1 class is fully covered in the corresponding NACE Rev 2 class
top concept of: Statistical Classification of Economic Activities in the European Community, Rev. 2.1 (NACE Rev. 2.1)
Mapping Cardinality: 1 1

ConceptNoneRandom0.4212203798145261
type: ConceptAssociation
description: NACE Rev. 2.1 class 28.14 is mapped to NACE Rev. 2 class 28.14
Type: 1:1
Source Concept: Manufacture of other taps and valves
Target Concept: http://data.europa.eu/ux2/nace2/2814
in scheme: Statistical Classification of Economic Activities in the European Community, Rev. 2.1 (NACE Rev. 2.1)
scope note: the content of the NACE Rev 2.1 class is fully covered in the corresponding NACE Rev 2 class
top concept of: Statistical Classification of Economic Activities in the European Community, Rev. 2.1 (NACE Rev. 2.1)
Mapping Cardinality: 1 1

ConceptNoneRandom0.3723713610179087
type: ConceptAssociation
description: NACE Rev. 2.1 class 08.99 is mapped to NACE Rev. 2 class 08.99
Type: 1:1
Source Concept: Other mining and quarrying n.e.c.
Target Concept: http://data.europa.eu/ux2/nace2/0899
in scheme: Statistical Classification of Economic Activities in the European Community, Rev. 2.1 (NACE Rev. 2.1)
scope note: the content of the NACE Rev 2.1 class is fully covered in the corresponding NACE Rev 2 class
top concept of: Statistical Classification of Economic Activities in the European Community, Rev. 2.1 (NACE Rev. 2.1)
Mapping Cardinality: 1 1

ConceptNoneRandom0.438700021267706
type: ConceptAssociation
description: NACE Rev. 2.1 class 96.23 is mapped to NACE Rev. 2 class 96.04
Type: 1:1
Source Concept: Day spa, sauna and steam bath activities
Target Concept: http://data.europa.eu/ux2/nace2/9604
in scheme: Statistical Classification of Economic Activities in the European Community, Rev. 2.1 (NACE Rev. 2.1)
scope note: the content of the NACE Rev 2.1 class is fully covered in the corresponding NACE Rev 2 class
top concept of: Statistical Classification of Economic Activities in the European Community, Rev. 2.1 (NACE Rev. 2.1)
Mapping Cardinality: 1 1

ConceptNoneRandom0.7789932792487806
type: ConceptAssociation
description: NACE Rev. 2.1 group 32.1 is mapped to NACE Rev. 2 group 32.1
Type: 1:1
Source Concept: Manufacture of jewellery, bijouterie and related articles
Target Concept: http://data.europa.eu/ux2/nace2/321
in scheme: Statistical Classification of Economic Activities in the European Community, Rev. 2.1 (NACE Rev. 2.1)
top concept of: Statistical Classification of Economic Activities in the European Community, Rev. 2.1 (NACE Rev. 2.1)
Mapping Cardinality: 1 1

ConceptNoneRandom0.4945317505799649
type: ConceptAssociation
description: NACE Rev. 2.1 class 73.11 is mapped to NACE Rev. 2 class 73.11
Type: 1:1
Source Concept: Activities of advertising agencies
Target Concept: http://data.europa.eu/ux2/nace2/7311
in scheme: Statistical Classification of Economic Activities in the European Community, Rev. 2.1 (NACE Rev. 2.1)
scope note: the content of the NACE Rev 2.1 class is fully covered in the corresponding NACE Rev 2 class
top concept of: Statistical Classification of Economic Activities in the European Community, Rev. 2.1 (NACE Rev. 2.1)
Mapping Cardinality: 1 1

ConceptNoneRandom0.04956791467814603
type: ConceptAssociation
description: NACE Rev. 2.1 group 10.3 is mapped to NACE Rev. 2 group 10.3
Type: 1:1
Source Concept: Processing and preserving of fruit and vegetables
Target Concept: http://data.europa.eu/ux2/nace2/103
in scheme: Statistical Classification of Economic Activities in the European Community, Rev. 2.1 (NACE Rev. 2.1)
top concept of: Statistical Classification of Economic Activities in the European Community, Rev. 2.1 (NACE Rev. 2.1)
Mapping Cardinality: 1 1

ConceptNoneRandom0.7426109005227529
type: ConceptAssociation
description: NACE Rev. 2.1 group 23.6 is mapped to NACE Rev. 2 groups 22.2, 23.6
Type: 5:5
Source Concept: Manufacture of articles of concrete, cement and plaster
Target Concept: http://data.europa.eu/ux2/nace2/222
Target Concept: http://data.europa.eu/ux2/nace2/236
in scheme: Statistical Classification of Economic Activities in the European Community, Rev. 2.1 (NACE Rev. 2.1)
top concept of: Statistical Classification of Economic Activities in the European Community, Rev. 2.1 (NACE Rev. 2.1)
Mapping Cardinality: n m

ConceptNoneRandom0.12486321223836794
type: ConceptAssociation
description: NACE Rev. 2.1 section R is mapped to NACE Rev. 2 sections N, Q
Type: 18:17
Source Concept: HUMAN HEALTH AND SOCIAL WORK ACTIVITIES
Target Concept: http://data.europa.eu/ux2/nace2/N
Target Concept: http://data.europa.eu/ux2/nace2/Q
in scheme: Statistical Classification of Economic Activities in the European Community, Rev. 2.1 (NACE Rev. 2.1)
top concept of: Statistical Classification of Economic Activities in the European Community, Rev. 2.1 (NACE Rev. 2.1)
Mapping Cardinality: n m

Web search portal activities and other information service activities
type: Concept
CoreContentNote: This group includes: - operation of web sites that use a search engine to generate and maintain extensive databases of internet addresses and content in an easily searchable format (web search portals) - other information service activities not elsewhere classified, e.g.: • telephone-based information services • information search services on a contract or fee basis • news clipping services, press clipping services The primary source of revenue from advertising does not have a bearing on classification for these activities.
Exclusion Note: This group excludes: - intermediation service activities for retail sale, see 47.9 - intermediation service activities for passenger transport, see 52.32 - intermediation service activities for accommodation, see 55.40 - publishing activities, see division 58 - broadcasting activities, see division 60 - news syndicate and news agency activities, see 60.31 - activities of call centres, see 82.20
broader: Computing infrastructure, data processing, hosting and other information service activities
in scheme: Statistical Classification of Economic Activities in the European Community, Rev. 2.1 (NACE Rev. 2.1)
Notation: 63.9
top concept of: Statistical Classification of Economic Activities in the European Community, Rev. 2.1 (NACE Rev. 2.1)

ConceptNoneRandom0.7480684251003258
type: ConceptAssociation
description: NACE Rev. 2.1 division 53 is mapped to NACE Rev. 2 divisions 53, 82, 96
Type: 48:49
Source Concept: Postal and courier activities
Target Concept: http://data.europa.eu/ux2/nace2/82
Target Concept: http://data.europa.eu/ux2/nace2/96
Target Concept: http://data.europa.eu/ux2/nace2/53
in scheme: Statistical Classification of Economic Activities in the European Community, Rev. 2.1 (NACE Rev. 2.1)
top concept of: Statistical Classification of Economic Activities in the European Community, Rev. 2.1 (NACE Rev. 2.1)
Mapping Cardinality: n m

ConceptNoneRandom0.7211787105055906
type: ConceptAssociation
description: NACE Rev. 2.1 class 52.21 is mapped to NACE Rev. 2 class 52.21
Type: 1:1
Source Concept: Service activities incidental to land transportation
Target Concept: http://data.europa.eu/ux2/nace2/5221
in scheme: Statistical Classification of Economic Activities in the European Community, Rev. 2.1 (NACE Rev. 2.1)
scope note: the content of the NACE Rev 2.1 class is fully covered in the corresponding NACE Rev 2 class
top concept of: Statistical Classification of Economic Activities in the European Community, Rev. 2.1 (NACE Rev. 2.1)
Mapping Cardinality: 1 1

Notation

Activities of trade unions
type: Concept
broader: Activities of membership organisations
in scheme: Statistical Classification of Economic Activities in the European Community, Rev. 2.1 (NACE Rev. 2.1)
Notation: 94.2
top concept of: Statistical Classification of Economic Activities in the European Community, Rev. 2.1 (NACE Rev. 2.1)

Intermediation service activities for residential care activities
type: Concept
CoreContentNote: This class includes the intermediation of residential care activities, by bringing clients and service providers together for a fee or commission, without the intermediary providing the residential care services that are intermediated. These intermediation activities can be carried out on digital platforms or through non-digital channels (including door-to-door, face-to-face, telephone, mail, and so on). The fee or commission can be received from either the client or the provider of the residential care service. Revenue for the intermediation activities can include other sources of income (for example, revenues from the sale of advertising space).
Exclusion Note: This class excludes: - intermediation service activities for medical, dental and other human health services, see 86.97
broader: Other residential care activities
in scheme: Statistical Classification of Economic Activities in the European Community, Rev. 2.1 (NACE Rev. 2.1)
Notation: 87.91
top concept of: Statistical Classification of Economic Activities in the European Community, Rev. 2.1 (NACE Rev. 2.1)

Manufacture of loaded electronic boards
type: Concept
CoreContentNote: This class includes: - manufacture of loaded printed circuit boards consisting of conductor elements, contacts and other passive elements - loading of passive elements (components) onto printed circuit boards - manufacture of interface cards (e.g. sound, video, controllers, network, modems) loaded with passive elements
Exclusion Note: This class excludes: - printing of smart cards, see 18.12 - manufacture of bare printed circuit boards, consisting only of conductor elements and contacts, see 26.11
broader: Manufacture of electronic components and boards
in scheme: Statistical Classification of Economic Activities in the European Community, Rev. 2.1 (NACE Rev. 2.1)
Notation: 26.12
top concept of: Statistical Classification of Economic Activities in the European Community, Rev. 2.1 (NACE Rev. 2.1)

Activities of agents involved in the wholesale of food, beverages and tobacco
type: Concept
Additional Content Note: This class also includes: - activities of agents involved in the wholesale of food for pets - activities of agents involved in the wholesale of food supplements for animal consumption
CoreContentNote: This class includes: - activities of agents involved in the wholesale of food supplements for human consumption
Exclusion Note: This class excludes: - wholesale on own account, see 46.2 to 46.9 - activities of commission agents who assume ownership of the goods, even if they are acting in the name of a third party, see 46.2 to 46.9
broader: Wholesale on a fee or contract basis
in scheme: Statistical Classification of Economic Activities in the European Community, Rev. 2.1 (NACE Rev. 2.1)
Notation: 46.17
top concept of: Statistical Classification of Economic Activities in the European Community, Rev. 2.1 (NACE Rev. 2.1)

ConceptNoneRandom0.21886537859369226
type: ConceptAssociation
description: NACE Rev. 2.1 class 84.24 is mapped to NACE Rev. 2 class 84.24
Type: 1:1
Source Concept: Public order and safety activities
Target Concept: http://data.europa.eu/ux2/nace2/8424
in scheme: Statistical Classification of Economic Activities in the European Community, Rev. 2.1 (NACE Rev. 2.1)
scope note: the content of the NACE Rev 2.1 class is fully covered in the corresponding NACE Rev 2 class
top concept of: Statistical Classification of Economic Activities in the European Community, Rev. 2.1 (NACE Rev. 2.1)
Mapping Cardinality: 1 1

Extraction of crude petroleum
type: Concept
broader: Extraction of crude petroleum and natural gas
in scheme: Statistical Classification of Economic Activities in the European Community, Rev. 2.1 (NACE Rev. 2.1)
Notation: 06.1
top concept of: Statistical Classification of Economic Activities in the European Community, Rev. 2.1 (NACE Rev. 2.1)

ConceptNoneRandom0.2331538383817321
type: ConceptAssociation
description: NACE Rev. 2.1 class 10.85 is mapped to NACE Rev. 2 class 10.85
Type: 1:1
Source Concept: Manufacture of prepared meals and dishes
Target Concept: http://data.europa.eu/ux2/nace2/1085
in scheme: Statistical Classification of Economic Activities in the European Community, Rev. 2.1 (NACE Rev. 2.1)
scope note: the content of the NACE Rev 2.1 class is fully covered in the corresponding NACE Rev 2 class
top concept of: Statistical Classification of Economic Activities in the European Community, Rev. 2.1 (NACE Rev. 2.1)
Mapping Cardinality: 1 1

Public relations and communication activities
type: Concept
Additional Content Note: This class also includes: - activities of sales representatives, for promotion purposes
CoreContentNote: This class includes the provision of advice, guidance and operational assistance, including lobbying activities, to businesses and other organisations on public relations and communication.
Exclusion Note: This class excludes: - advertising agencies and media representation services, see 73.1 - market research and public opinion polling, see 73.20 - design and consulting with respect to visual communication, see 74.12
broader: Public relations and communication activities
in scheme: Statistical Classification of Economic Activities in the European Community, Rev. 2.1 (NACE Rev. 2.1)
Notation: 73.30
top concept of: Statistical Classification of Economic Activities in the European Community, Rev. 2.1 (NACE Rev. 2.1)

Activities of trade unions
type: Concept
Additional Content Note: This class also includes: - activities of associations whose members are employees interested chiefly in the representation of their views concerning the salary and work situation, and in concerted action through organisation
CoreContentNote: This class includes: - promoting the interests of organised labour and union employees
Exclusion Note: This class excludes: - education provided by trade unions, see division 85 - activities of professional membership organisations, see 94.12
broader: Activities of trade unions
in scheme: Statistical Classification of Economic Activities in the European Community, Rev. 2.1 (NACE Rev. 2.1)
Notation: 94.20
top concept of: Statistical Classification of Economic Activities in the European Community, Rev. 2.1 (NACE Rev. 2.1)

ConceptNoneRandom0.3203552504881928
type: ConceptAssociation
description: NACE Rev. 2.1 class 07.21 is mapped to NACE Rev. 2 class 07.21
Type: 1:1
Source Concept: Mining of uranium and thorium ores
Target Concept: http://data.europa.eu/ux2/nace2/0721
in scheme: Statistical Classification of Economic Activities in the European Community, Rev. 2.1 (NACE Rev. 2.1)
scope note: the content of the NACE Rev 2.1 class is fully covered in the corresponding NACE Rev 2 class
top concept of: Statistical Classification of Economic Activities in the European Community, Rev. 2.1 (NACE Rev. 2.1)
Mapping Cardinality: 1 1

Engineering activities and related technical consultancy
type: Concept
Additional Content Note: This class also includes: - activities of bathymetry - activities of photogrammetric surveying (e.g. data collection with drones) - preparation and revision of maps - construction supervision - project management activities related to engineering
CoreContentNote: This class includes: - engineering design (i.e. applying physical laws and principles of engineering in the design of machines, materials, instruments, structures, processes and systems) and consulting activities for: • machinery, industrial processes and industrial plant • projects involving civil engineering, hydraulic engineering, traffic engineering • water management projects • nature-based infrastructure - design of building information systems (e.g. related to heating systems, fire extinguisher requirements) - elaboration and supervision of projects in relation to electrical and electronic, engineering, mining engineering, chemical engineering, mechanical, industrial and systems engineering - elaboration and supervision of projects using air conditioning, refrigeration, sanitary and pollution control, water supply, wastewater treatment, structural engineering, offshore and onshore marine engineering, health and safety engineering, acoustical engineering, etc. - geophysical, geologic and seismic surveying - geodetic surveying activities: • land and boundary surveying activities • hydrologic surveying activities • subsurface surveying activities - cartographic and spatial information activities - environmental engineering and related consulting activities - site engineering - noise abatement engineering - circular economy solutions engineering - design of computer plans for 3D printing
Exclusion Note: This class excludes: - test drilling in connection with mining operations, see 09.10, 09.90 - software publishing, see 58.2 - development and programming of software, see 62.10 - activities of computer consultants, see 62.20 - development of building projects for residential and non-residential buildings, for later sale, see 68.12 - technical testing, see 71.20 - periodic testing of motor vehicles for road safety and roadworthiness, see 71.20 - research and development activities related to engineering, see 72.10 - activities related to other design services, see 74.1 - aerial photography, see 74.20 - activities of quantity surveyors, see 74.99
broader: Architectural and engineering activities and related technical consultancy
in scheme: Statistical Classification of Economic Activities in the European Community, Rev. 2.1 (NACE Rev. 2.1)
Notation: 71.12
top concept of: Statistical Classification of Economic Activities in the European Community, Rev. 2.1 (NACE Rev. 2.1)

ConceptNoneRandom0.45686421515637876
type: ConceptAssociation
description: NACE Rev. 2.1 class 28.11 is mapped to NACE Rev. 2 class 28.11
Type: 8:9
Source Concept: Manufacture of engines and turbines, except aircraft, vehicle and cycle engines
Target Concept: http://data.europa.eu/ux2/nace2/2811
in scheme: Statistical Classification of Economic Activities in the European Community, Rev. 2.1 (NACE Rev. 2.1)
scope note: the content of the NACE Rev 2.1 class is fully covered in the corresponding NACE Rev 2 class
top concept of: Statistical Classification of Economic Activities in the European Community, Rev. 2.1 (NACE Rev. 2.1)
Mapping Cardinality: n m

ConceptNoneRandom0.9612552713671626
type: ConceptAssociation
description: NACE Rev. 2.1 class 96.22 is mapped to NACE Rev. 2 class 96.02
Type: 2:1
Source Concept: Beauty care and other beauty treatment activities
Target Concept: http://data.europa.eu/ux2/nace2/9602
in scheme: Statistical Classification of Economic Activities in the European Community, Rev. 2.1 (NACE Rev. 2.1)
scope note: the content of the NACE Rev 2.1 class is fully covered in the corresponding NACE Rev 2 class
top concept of: Statistical Classification of Economic Activities in the European Community, Rev. 2.1 (NACE Rev. 2.1)
Mapping Cardinality: n 1

ConceptNoneRandom0.23301464647601078
type: ConceptAssociation
description: NACE Rev. 2.1 class 73.12 is mapped to NACE Rev. 2 class 73.12
Type: 1:1
Source Concept: Media representation
Target Concept: http://data.europa.eu/ux2/nace2/7312
in scheme: Statistical Classification of Economic Activities in the European Community, Rev. 2.1 (NACE Rev. 2.1)
scope note: the content of the NACE Rev 2.1 class is fully covered in the corresponding NACE Rev 2 class
top concept of: Statistical Classification of Economic Activities in the European Community, Rev. 2.1 (NACE Rev. 2.1)
Mapping Cardinality: 1 1

ConceptNoneRandom0.14093552526411157
type: ConceptAssociation
description: NACE Rev. 2.1 group 10.4 is mapped to NACE Rev. 2 group 10.4
Type: 1:1
Source Concept: Manufacture of vegetable and animal oils and fats
Target Concept: http://data.europa.eu/ux2/nace2/104
in scheme: Statistical Classification of Economic Activities in the European Community, Rev. 2.1 (NACE Rev. 2.1)
top concept of: Statistical Classification of Economic Activities in the European Community, Rev. 2.1 (NACE Rev. 2.1)
Mapping Cardinality: 1 1

ConceptNoneRandom0.4901432902158055
type: ConceptAssociation
description: NACE Rev. 2.1 class 93.19 is mapped to NACE Rev. 2 classes 93.19, 93.29
Type: 7:7
Source Concept: Sports activities n.e.c.
Target Concept: http://data.europa.eu/ux2/nace2/9329
Target Concept: http://data.europa.eu/ux2/nace2/9319
in scheme: Statistical Classification of Economic Activities in the European Community, Rev. 2.1 (NACE Rev. 2.1)
scope note: 93.19: - activities of producers of sports events, with or without facilities - activities of individual own-account sportspersons and athletes, referees, judges, timekeepers, etc. - activities of sports leagues and sport governing bodies - activities related to promotion of sports events - activities of racing stables, kennels and garages - operation of sport fishing and hunting preserves - activities of mountain guides - support activities for sport or recreational hunting and fishing - operation of vertical, aerodynamic wind tunnels - activities related to training animals for sports or entertainment - organisation and operation of outdoor or indoor sports events for professionals or amateurs by organisations (not by sports clubs) without own facilities - activities of sports federations 93.29: - activities of individual own-account participants of e-sports
top concept of: Statistical Classification of Economic Activities in the European Community, Rev. 2.1 (NACE Rev. 2.1)
Mapping Cardinality: n m

ConceptNoneRandom0.6979072284895548
type: ConceptAssociation
description: NACE Rev. 2.1 group 23.7 is mapped to NACE Rev. 2 group 23.7
Type: 1:1
Source Concept: Cutting, shaping and finishing of stone
Target Concept: http://data.europa.eu/ux2/nace2/237
in scheme: Statistical Classification of Economic Activities in the European Community, Rev. 2.1 (NACE Rev. 2.1)
top concept of: Statistical Classification of Economic Activities in the European Community, Rev. 2.1 (NACE Rev. 2.1)
Mapping Cardinality: 1 1

ConceptNoneRandom0.6053176301022304
type: ConceptAssociation
description: NACE Rev. 2.1 section Q is mapped to NACE Rev. 2 sections N, P, Q
Type: 18:17
Source Concept: EDUCATION
Target Concept: http://data.europa.eu/ux2/nace2/N
Target Concept: http://data.europa.eu/ux2/nace2/Q
Target Concept: http://data.europa.eu/ux2/nace2/P
in scheme: Statistical Classification of Economic Activities in the European Community, Rev. 2.1 (NACE Rev. 2.1)
top concept of: Statistical Classification of Economic Activities in the European Community, Rev. 2.1 (NACE Rev. 2.1)
Mapping Cardinality: n m

ConceptNoneRandom0.6669651091014938
type: ConceptAssociation
description: NACE Rev. 2.1 group 32.2 is mapped to NACE Rev. 2 group 32.2
Type: 1:1
Source Concept: Manufacture of musical instruments
Target Concept: http://data.europa.eu/ux2/nace2/322
in scheme: Statistical Classification of Economic Activities in the European Community, Rev. 2.1 (NACE Rev. 2.1)
top concept of: Statistical Classification of Economic Activities in the European Community, Rev. 2.1 (NACE Rev. 2.1)
Mapping Cardinality: 1 1

ConceptNoneRandom0.3780910735126656
type: ConceptAssociation
description: NACE Rev. 2.1 division 52 is mapped to NACE Rev. 2 divisions 49, 52, 79
Type: 48:49
Source Concept: Warehousing, storage and support activities for transportation
Target Concept: http://data.europa.eu/ux2/nace2/52
Target Concept: http://data.europa.eu/ux2/nace2/49
Target Concept: http://data.europa.eu/ux2/nace2/79
in scheme: Statistical Classification of Economic Activities in the European Community, Rev. 2.1 (NACE Rev. 2.1)
top concept of: Statistical Classification of Economic Activities in the European Community, Rev. 2.1 (NACE Rev. 2.1)
Mapping Cardinality: n m

Freight rail transport
type: Concept
Additional Content Note: This class also includes: - freight transport by funicular railway - traction services
CoreContentNote: This class includes: - freight transport on mainline rail networks as well as short line freight railways
Exclusion Note: This class excludes: - warehousing and storage, see 52.10 - freight terminal activities, see 52.21 - operation of railway infrastructure and related activities (e.g. switching and shunting), see 52.21 - cargo handling on behalf of others, see 52.24
broader: Freight rail transport
in scheme: Statistical Classification of Economic Activities in the European Community, Rev. 2.1 (NACE Rev. 2.1)
Notation: 49.20
top concept of: Statistical Classification of Economic Activities in the European Community, Rev. 2.1 (NACE Rev. 2.1)

ConceptNoneRandom0.3477626415848716
type: ConceptAssociation
description: NACE Rev. 2.1 class 85.10 is mapped to NACE Rev. 2 classes 85.10, 88.91
Type: 2:2
Source Concept: Pre-primary education
Target Concept: http://data.europa.eu/ux2/nace2/8510
Target Concept: http://data.europa.eu/ux2/nace2/8891
in scheme: Statistical Classification of Economic Activities in the European Community, Rev. 2.1 (NACE Rev. 2.1)
scope note: 85.10: - pre-primary education. Pre-primary education is defined as the initial stage of organised instruction designed primarily to introduce very young children to a school- type environment, that is, to provide a bridge between the home and a school-based atmosphere. 88.91: - early childhood educational development targeting children under 3 years old (ISCED level 01 of ISCED 2011)
top concept of: Statistical Classification of Economic Activities in the European Community, Rev. 2.1 (NACE Rev. 2.1)
Mapping Cardinality: n m

Activities of agents involved in the wholesale of other particular products
type: Concept
CoreContentNote: This class includes: - activities of agents involved in the wholesale of pharmaceutical and medical goods, perfumery and toilet articles, and cleaning materials - activities of agents involved in the wholesale of games and toys, sports goods, bicycles, books, newspapers, magazines and stationery, musical instruments, watches, clocks and jewellery, and photographic and optical equipment - activities of agents involved in the wholesale of cars and light motor vehicles, lorries, trailers and semi-trailers, camping vehicles (e.g. caravans and motorhomes), motorcycles (including mopeds), motorised personal transport devices, and rolling stock; these motor vehicles include electric vehicles - activities of agents involved in the wholesale of motor vehicle parts and accessories, and parts and accessories for motorcycles, motorised personal transport devices, and rolling stock - activities of agents involved in the wholesale of waste - activities of wholesale auctioneering houses of third-party goods of motor vehicles, including internet wholesale auctions of motor vehicles
Exclusion Note: This class excludes: - wholesale on own account, see 46.2 to 46.9 - activities of commission agents who assume ownership of the goods, even if they are acting in the name of a third party, see 46.2 to 46.9 - activities of insurance agents, see 66.22 - activities of real estate agents, see 68.31
broader: Wholesale on a fee or contract basis
in scheme: Statistical Classification of Economic Activities in the European Community, Rev. 2.1 (NACE Rev. 2.1)
Notation: 46.18
top concept of: Statistical Classification of Economic Activities in the European Community, Rev. 2.1 (NACE Rev. 2.1)

Manufacture of electronic components
type: Concept
CoreContentNote: This class includes the manufacture of semiconductors and other components for electronic applications. This class includes: - manufacture of capacitors, electronic - manufacture of resistors, electronic - manufacture of microprocessors - manufacture of electron tubes - manufacture of cables, printer cables, monitor cables, universal serial bus (USB) cables - manufacture of bare printed circuit boards, consisting only of conductor elements and contacts - manufacture of integrated circuits (analogue, digital or hybrid) - manufacture of diodes, transistors and related discrete devices - manufacture of inductors (e.g. chokes, coils, transformers), electronic component-type transformers - manufacture of electronic crystals and crystal assemblies - manufacture of solenoids, switches and transducers for electronic applications - manufacture of dice or wafers – which consist of chemical elements (e.g. silicon) – that are selectively doped or diffused to create discrete regions for the purposes of their applications in the field of electronics - manufacture of display components (plasma, polymer, liquid crystal displays (LCDs)) - manufacture of light-emitting diodes (LEDs) - manufacture of photovoltaic cells, modules and panels
Exclusion Note: This class excludes: - printing of smart cards, see 18.12 - manufacture of printed circuits consisting of conductor elements, contacts and other passive elements, see 26.12 - manufacture of computer and television displays, see 26.20, 26.40 - manufacture of modems (carrier equipment), see 26.30 - manufacture of X-ray tubes and similar irradiation devices, see 26.60 - manufacture of optical equipment and instruments, see 26.70 - manufacture of similar devices for electrical applications, see division 27 - manufacture of fluorescent ballasts, see 27.11 - manufacture of solar generators, which can be used directly to supply power to, e.g. a motor or an electrolyser, see 27.11 - manufacture of electrical relays, see 27.12 - manufacture of electrical wiring devices, see 27.33 - manufacture of assembled electric conductors, insulated and fitted with connectors, see 27.90 - manufacture of solar water heaters, see 28.21 - installation of solar panels, see 43.21 - installation of solar heating systems, see 43.22
broader: Manufacture of electronic components and boards
in scheme: Statistical Classification of Economic Activities in the European Community, Rev. 2.1 (NACE Rev. 2.1)
Notation: 26.11
top concept of: Statistical Classification of Economic Activities in the European Community, Rev. 2.1 (NACE Rev. 2.1)

Extraction of natural gas
type: Concept
broader: Extraction of crude petroleum and natural gas
in scheme: Statistical Classification of Economic Activities in the European Community, Rev. 2.1 (NACE Rev. 2.1)
Notation: 06.2
top concept of: Statistical Classification of Economic Activities in the European Community, Rev. 2.1 (NACE Rev. 2.1)

ConceptNoneRandom0.7820748314137047
type: ConceptAssociation
description: NACE Rev. 2.1 class 10.84 is mapped to NACE Rev. 2 class 10.84
Type: 1:1
Source Concept: Manufacture of condiments and seasonings
Target Concept: http://data.europa.eu/ux2/nace2/1084
in scheme: Statistical Classification of Economic Activities in the European Community, Rev. 2.1 (NACE Rev. 2.1)
scope note: the content of the NACE Rev 2.1 class is fully covered in the corresponding NACE Rev 2 class
top concept of: Statistical Classification of Economic Activities in the European Community, Rev. 2.1 (NACE Rev. 2.1)
Mapping Cardinality: 1 1

ConceptNoneRandom0.014668303157589158
type: ConceptAssociation
description: NACE Rev. 2.1 class 84.25 is mapped to NACE Rev. 2 classes 84.25, 93.29
Type: 7:7
Source Concept: Fire service activities
Target Concept: http://data.europa.eu/ux2/nace2/8425
Target Concept: http://data.europa.eu/ux2/nace2/9329
in scheme: Statistical Classification of Economic Activities in the European Community, Rev. 2.1 (NACE Rev. 2.1)
scope note: 84.25: - firefighting activities: • administration and operation of regular and auxiliary fire brigades in fire prevention, firefighting, rescue of persons and animals, assistance in civic disasters, floods, road accidents etc., including firefighting by units on a contract or fee basis - activities of rescue operations on open water and in mountains 93.29: - activities of beach supervisors, i.e. lifeguards
top concept of: Statistical Classification of Economic Activities in the European Community, Rev. 2.1 (NACE Rev. 2.1)
Mapping Cardinality: n m

ConceptNoneRandom0.0775049381629177
type: ConceptAssociation
description: NACE Rev. 2.1 class 28.12 is mapped to NACE Rev. 2 class 28.12
Type: 1:1
Source Concept: Manufacture of fluid power equipment
Target Concept: http://data.europa.eu/ux2/nace2/2812
in scheme: Statistical Classification of Economic Activities in the European Community, Rev. 2.1 (NACE Rev. 2.1)
scope note: the content of the NACE Rev 2.1 class is fully covered in the corresponding NACE Rev 2 class
top concept of: Statistical Classification of Economic Activities in the European Community, Rev. 2.1 (NACE Rev. 2.1)
Mapping Cardinality: 1 1

Architectural activities
type: Concept
CoreContentNote: This class includes: - architectural consulting activities: • building design and drafting • town and city planning and landscape architecture - architectural activities to support the conservation and restoration of cultural heritage properties - interior architecture, i.e. redesigning a building’s interior structure and layout
Exclusion Note: This class excludes: - renovation, renewal, reconstruction and retrofitting of historical and archaeological sites and buildings, see 43.99 - activities of computer consultants, see 62.20 - planning or overseeing conservation of historical civil engineering construction, see 71.12 - interior decorating, see 74.13 - conservation, restoration and other cultural heritage support activities, see 91.30
broader: Architectural and engineering activities and related technical consultancy
in scheme: Statistical Classification of Economic Activities in the European Community, Rev. 2.1 (NACE Rev. 2.1)
Notation: 71.11
top concept of: Statistical Classification of Economic Activities in the European Community, Rev. 2.1 (NACE Rev. 2.1)

Research and experimental development on social sciences and humanities
type: Concept
broader: Scientific research and development
in scheme: Statistical Classification of Economic Activities in the European Community, Rev. 2.1 (NACE Rev. 2.1)
Notation: 72.2
top concept of: Statistical Classification of Economic Activities in the European Community, Rev. 2.1 (NACE Rev. 2.1)

Inland freight water transport
type: Concept
broader: Water transport
in scheme: Statistical Classification of Economic Activities in the European Community, Rev. 2.1 (NACE Rev. 2.1)
Notation: 50.4
top concept of: Statistical Classification of Economic Activities in the European Community, Rev. 2.1 (NACE Rev. 2.1)

ConceptNoneRandom0.8191877453905259
type: ConceptAssociation
description: NACE Rev. 2.1 group 90.1 is mapped to NACE Rev. 2 group 90.0
Type: 26:18
Source Concept: Arts creation activities
Target Concept: http://data.europa.eu/ux2/nace2/900
in scheme: Statistical Classification of Economic Activities in the European Community, Rev. 2.1 (NACE Rev. 2.1)
top concept of: Statistical Classification of Economic Activities in the European Community, Rev. 2.1 (NACE Rev. 2.1)
Mapping Cardinality: n m

ConceptNoneRandom0.4270838791641871
type: ConceptAssociation
description: NACE Rev. 2.1 class 94.91 is mapped to NACE Rev. 2 class 94.91
Type: 1:1
Source Concept: Activities of religious organisations
Target Concept: http://data.europa.eu/ux2/nace2/9491
in scheme: Statistical Classification of Economic Activities in the European Community, Rev. 2.1 (NACE Rev. 2.1)
scope note: the content of the NACE Rev 2.1 class is fully covered in the corresponding NACE Rev 2 class
top concept of: Statistical Classification of Economic Activities in the European Community, Rev. 2.1 (NACE Rev. 2.1)
Mapping Cardinality: 1 1

Demolition
type: Concept
CoreContentNote: This class includes: - demolition, dismantling or wrecking of buildings and other structures
broader: Demolition and site preparation
in scheme: Statistical Classification of Economic Activities in the European Community, Rev. 2.1 (NACE Rev. 2.1)
Notation: 43.11
top concept of: Statistical Classification of Economic Activities in the European Community, Rev. 2.1 (NACE Rev. 2.1)

Other education
type: Concept
Additional Content Note: This group also includes education activities run by self-employed / own account / individual / independent lecturers (tutors, academics, instructors).
CoreContentNote: This group includes education (including non-formal) which is neither part of initial education in the regular school system, nor equivalent in programme content and qualifications to those programmes. It includes training for any professional, hobby or self-development purposes for both children and adults, including non-formal continuing vocational education and training. Non-formal education is defined by ISCED-P 2011 as institutionalised, intentional and planned by an education provider, as an addition, alternative and/or complement to formal education within the process of an individual’s lifelong learning. It targets people of all ages but does not necessarily apply a continuous pathway/structure; it may be short in duration and/or low-intensity, and it is typically provided in the form of short courses, workshops or seminars. This group includes the provision of athletic instruction to groups or individuals, foreign language instruction, instruction in the arts, drama or music, as well as other instruction or specialised training provided by camps and schools, not comparable to the education in groups 85.1 to 85.4.
Exclusion Note: This group excludes formal educational activities as outlined in groups 85.1 to 85.4, in other words, pre-primary education, primary education, secondary education, post-secondary non-tertiary education or tertiary education.
broader: Education
in scheme: Statistical Classification of Economic Activities in the European Community, Rev. 2.1 (NACE Rev. 2.1)
Notation: 85.5
top concept of: Statistical Classification of Economic Activities in the European Community, Rev. 2.1 (NACE Rev. 2.1)

ConceptNoneRandom0.48052219542350194
type: ConceptAssociation
description: NACE Rev. 2.1 class 55.30 is mapped to NACE Rev. 2 class 55.30
Type: 1:1
Source Concept: Camping grounds and recreational vehicle parks
Target Concept: http://data.europa.eu/ux2/nace2/5530
in scheme: Statistical Classification of Economic Activities in the European Community, Rev. 2.1 (NACE Rev. 2.1)
scope note: the content of the NACE Rev 2.1 class is fully covered in the corresponding NACE Rev 2 class
top concept of: Statistical Classification of Economic Activities in the European Community, Rev. 2.1 (NACE Rev. 2.1)
Mapping Cardinality: 1 1

Wholesale of machine tools
type: Concept
Additional Content Note: This class also includes: - wholesale of computer-controlled machine tools
CoreContentNote: This class includes: - wholesale of machine tools of any type and for any material
broader: Wholesale of other machinery, equipment and supplies
in scheme: Statistical Classification of Economic Activities in the European Community, Rev. 2.1 (NACE Rev. 2.1)
Notation: 46.62
top concept of: Statistical Classification of Economic Activities in the European Community, Rev. 2.1 (NACE Rev. 2.1)

ConceptNoneRandom0.8016514790888434
type: ConceptAssociation
description: NACE Rev. 2.1 group 94.9 is mapped to NACE Rev. 2 group 94.9
Type: 1:1
Source Concept: Activities of other membership organisations
Target Concept: http://data.europa.eu/ux2/nace2/949
in scheme: Statistical Classification of Economic Activities in the European Community, Rev. 2.1 (NACE Rev. 2.1)
top concept of: Statistical Classification of Economic Activities in the European Community, Rev. 2.1 (NACE Rev. 2.1)
Mapping Cardinality: 1 1

ConceptNoneRandom0.13623753606917777
type: ConceptAssociation
description: NACE Rev. 2.1 division 16 is mapped to NACE Rev. 2 division 16
Type: 48:49
Source Concept: Manufacture of wood and of products of wood and cork, except furniture; manufacture of articles of straw and plaiting materials
Target Concept: http://data.europa.eu/ux2/nace2/16
in scheme: Statistical Classification of Economic Activities in the European Community, Rev. 2.1 (NACE Rev. 2.1)
top concept of: Statistical Classification of Economic Activities in the European Community, Rev. 2.1 (NACE Rev. 2.1)
Mapping Cardinality: n m

Manufacture of refined petroleum products and fossil fuel products
type: Concept
broader: Manufacture of coke and refined petroleum products
in scheme: Statistical Classification of Economic Activities in the European Community, Rev. 2.1 (NACE Rev. 2.1)
Notation: 19.2
top concept of: Statistical Classification of Economic Activities in the European Community, Rev. 2.1 (NACE Rev. 2.1)

ConceptNoneRandom0.42723878919091385
type: ConceptAssociation
description: NACE Rev. 2.1 class 46.82 is mapped to NACE Rev. 2 class 46.72
Type: 1:1
Source Concept: Wholesale of metals and metal ores
Target Concept: http://data.europa.eu/ux2/nace2/4672
in scheme: Statistical Classification of Economic Activities in the European Community, Rev. 2.1 (NACE Rev. 2.1)
scope note: the content of the NACE Rev 2.1 class is fully covered in the corresponding NACE Rev 2 class
top concept of: Statistical Classification of Economic Activities in the European Community, Rev. 2.1 (NACE Rev. 2.1)
Mapping Cardinality: 1 1

ConceptNoneRandom0.6015342346346312
type: ConceptAssociation
description: NACE Rev. 2.1 class 43.31 is mapped to NACE Rev. 2 classes 43.31, 43.39
Type: 23:16
Source Concept: Plastering
Target Concept: http://data.europa.eu/ux2/nace2/4331
Target Concept: http://data.europa.eu/ux2/nace2/4339
in scheme: Statistical Classification of Economic Activities in the European Community, Rev. 2.1 (NACE Rev. 2.1)
scope note: 43.31: - application in buildings or other construction projects of interior and exterior plaster or stucco, including related lathing materials - dry-walling of walls and plastering of ceilings 43.39: - plastering of interior in boats
top concept of: Statistical Classification of Economic Activities in the European Community, Rev. 2.1 (NACE Rev. 2.1)
Mapping Cardinality: n m

ConceptNoneRandom0.9638678310622906
type: ConceptAssociation
description: NACE Rev. 2.1 class 82.92 is mapped to NACE Rev. 2 class 82.92
Type: 1:1
Source Concept: Packaging activities
Target Concept: http://data.europa.eu/ux2/nace2/8292
in scheme: Statistical Classification of Economic Activities in the European Community, Rev. 2.1 (NACE Rev. 2.1)
scope note: the content of the NACE Rev 2.1 class is fully covered in the corresponding NACE Rev 2 class
top concept of: Statistical Classification of Economic Activities in the European Community, Rev. 2.1 (NACE Rev. 2.1)
Mapping Cardinality: 1 1

ConceptNoneRandom0.7199116226732842
type: ConceptAssociation
description: NACE Rev. 2.1 group 02.1 is mapped to NACE Rev. 2 group 02.1
Type: 1:1
Source Concept: Silviculture and other forestry activities
Target Concept: http://data.europa.eu/ux2/nace2/021
in scheme: Statistical Classification of Economic Activities in the European Community, Rev. 2.1 (NACE Rev. 2.1)
top concept of: Statistical Classification of Economic Activities in the European Community, Rev. 2.1 (NACE Rev. 2.1)
Mapping Cardinality: 1 1

Activities of insurance agents and brokers
type: Concept
CoreContentNote: This class includes: - activities of insurance agents and brokers (insurance intermediaries) in selling, negotiating or soliciting of annuities and insurance and reinsurance policies
broader: Activities auxiliary to insurance and pension funding
in scheme: Statistical Classification of Economic Activities in the European Community, Rev. 2.1 (NACE Rev. 2.1)
Notation: 66.22
top concept of: Statistical Classification of Economic Activities in the European Community, Rev. 2.1 (NACE Rev. 2.1)

ConceptNoneRandom0.6087831331189042
type: ConceptAssociation
description: NACE Rev. 2.1 class 19.20 is mapped to NACE Rev. 2 class 19.20
Type: 1:1
Source Concept: Manufacture of refined petroleum products and fossil fuel products
Target Concept: http://data.europa.eu/ux2/nace2/1920
in scheme: Statistical Classification of Economic Activities in the European Community, Rev. 2.1 (NACE Rev. 2.1)
scope note: the content of the NACE Rev 2.1 class is fully covered in the corresponding NACE Rev 2 class
top concept of: Statistical Classification of Economic Activities in the European Community, Rev. 2.1 (NACE Rev. 2.1)
Mapping Cardinality: 1 1

Site preparation
type: Concept
Additional Content Note: This class also includes: - site preparation for mining, e.g.: • overburden removal and other development and preparation of mineral properties and sites, except oil and gas sites - building site drainage - drainage of agricultural or forestry land - site preparation for archaeological excavation
CoreContentNote: This class includes: - clearing of building sites - earth moving (e.g. excavation, landfill, levelling, trench digging, blasting)
Exclusion Note: This class excludes: - drilling of production oil or gas wells, see 06.10, 06.20 - test drilling, associated with extraction of petroleum or gas, see 09.10 - test drilling and boring support services (e.g. associated with mining activities), see 09.90 - decontamination of soil, see 39.00 - water well drilling, see 42.21 - shaft sinking, see 43.50
broader: Demolition and site preparation
in scheme: Statistical Classification of Economic Activities in the European Community, Rev. 2.1 (NACE Rev. 2.1)
Notation: 43.12
top concept of: Statistical Classification of Economic Activities in the European Community, Rev. 2.1 (NACE Rev. 2.1)

ConceptNoneRandom0.8642973052904573
type: ConceptAssociation
description: NACE Rev. 2.1 class 52.26 is mapped to NACE Rev. 2 class 52.29
Type: 78:65
Source Concept: Other support activities for transportation
Target Concept: http://data.europa.eu/ux2/nace2/5229
in scheme: Statistical Classification of Economic Activities in the European Community, Rev. 2.1 (NACE Rev. 2.1)
scope note: the content of the NACE Rev 2.1 class is fully covered in the corresponding NACE Rev 2 class
top concept of: Statistical Classification of Economic Activities in the European Community, Rev. 2.1 (NACE Rev. 2.1)
Mapping Cardinality: n m

Educational support activities
type: Concept
broader: Education
in scheme: Statistical Classification of Economic Activities in the European Community, Rev. 2.1 (NACE Rev. 2.1)
Notation: 85.6
top concept of: Statistical Classification of Economic Activities in the European Community, Rev. 2.1 (NACE Rev. 2.1)

ConceptNoneRandom0.610765613567325
type: ConceptAssociation
description: NACE Rev. 2.1 group 90.2 is mapped to NACE Rev. 2 group 90.0
Type: 26:18
Source Concept: Activities of performing arts
Target Concept: http://data.europa.eu/ux2/nace2/900
in scheme: Statistical Classification of Economic Activities in the European Community, Rev. 2.1 (NACE Rev. 2.1)
top concept of: Statistical Classification of Economic Activities in the European Community, Rev. 2.1 (NACE Rev. 2.1)
Mapping Cardinality: n m

Wholesale of mining, construction and civil engineering machinery
type: Concept
CoreContentNote: This class includes: - wholesale of mining, construction and civil engineering machinery and equipment, (e.g. excavating machines)
Exclusion Note: This class excludes: - wholesale of scaffolding, see 46.83 - wholesale of hand tools, hardware, plumbing and heating equipment and supplies, see 46.84
broader: Wholesale of other machinery, equipment and supplies
in scheme: Statistical Classification of Economic Activities in the European Community, Rev. 2.1 (NACE Rev. 2.1)
Notation: 46.63
top concept of: Statistical Classification of Economic Activities in the European Community, Rev. 2.1 (NACE Rev. 2.1)

Activities of business, employers and professional membership organisations
type: Concept
Additional Content Note: In the case of professional membership organisations, it also includes the activities of promoting the professional interests of members of the profession.
CoreContentNote: This group includes the activities of promoting the interests of the members of business and employer organisations.
broader: Activities of membership organisations
in scheme: Statistical Classification of Economic Activities in the European Community, Rev. 2.1 (NACE Rev. 2.1)
Notation: 94.1
top concept of: Statistical Classification of Economic Activities in the European Community, Rev. 2.1 (NACE Rev. 2.1)

ConceptNoneRandom0.25354376505771314
type: ConceptAssociation
description: NACE Rev. 2.1 division 15 is mapped to NACE Rev. 2 divisions 15, 16, 22
Type: 48:49
Source Concept: Manufacture of leather and related products of other materials
Target Concept: http://data.europa.eu/ux2/nace2/22
Target Concept: http://data.europa.eu/ux2/nace2/15
Target Concept: http://data.europa.eu/ux2/nace2/16
in scheme: Statistical Classification of Economic Activities in the European Community, Rev. 2.1 (NACE Rev. 2.1)
top concept of: Statistical Classification of Economic Activities in the European Community, Rev. 2.1 (NACE Rev. 2.1)
Mapping Cardinality: n m

Temporary employment agency activities and other human resource provisions
type: Concept
CoreContentNote: This class includes the activities of supplying workers to clients’ businesses for specific periods of time to temporarily replace or supplement the workforce of the client. In such an employment arrangement, the temporary employment agency or provider of human resources is the employer of the individual workers provided. However, the client is responsible for the supervision of the temporary personnel. These activities are providing human resources for clients’ businesses. The units classified here represent the employer of record for the temporary employees on matters relating to payroll, taxes, and other fiscal and human resource issues, but they are not responsible for the management and supervision of employees. The units classified here perform a wide range of human resource and personnel management duties associated with this provision.
Exclusion Note: This class excludes: - activities of invoicing services, see 69.20
broader: Temporary employment agency activities and other human resource provisions
in scheme: Statistical Classification of Economic Activities in the European Community, Rev. 2.1 (NACE Rev. 2.1)
Notation: 78.20
top concept of: Statistical Classification of Economic Activities in the European Community, Rev. 2.1 (NACE Rev. 2.1)

ConceptNoneRandom0.29113119613106997
type: ConceptAssociation
description: NACE Rev. 2.1 class 10.86 is mapped to NACE Rev. 2 class 10.86
Type: 6:6
Source Concept: Manufacture of homogenised food preparations and dietetic food
Target Concept: http://data.europa.eu/ux2/nace2/1086
in scheme: Statistical Classification of Economic Activities in the European Community, Rev. 2.1 (NACE Rev. 2.1)
scope note: the content of the NACE Rev 2.1 class is fully covered in the corresponding NACE Rev 2 class
top concept of: Statistical Classification of Economic Activities in the European Community, Rev. 2.1 (NACE Rev. 2.1)
Mapping Cardinality: n m

Rental and leasing of air transport equipment
type: Concept
CoreContentNote: This class includes: - rental and operating leasing of air transport equipment without an operator: • airplanes • hot-air balloons • helicopters
Exclusion Note: This class excludes: - rental of air transport equipment with an operator, see division 51
broader: Rental and leasing of other machinery, equipment and tangible goods
in scheme: Statistical Classification of Economic Activities in the European Community, Rev. 2.1 (NACE Rev. 2.1)
Notation: 77.35
top concept of: Statistical Classification of Economic Activities in the European Community, Rev. 2.1 (NACE Rev. 2.1)

ConceptNoneRandom0.6864646270293819
type: ConceptAssociation
description: NACE Rev. 2.1 class 43.32 is mapped to NACE Rev. 2 classes 43.32, 43.39
Type: 23:16
Source Concept: Joinery installation
Target Concept: http://data.europa.eu/ux2/nace2/4339
Target Concept: http://data.europa.eu/ux2/nace2/4332
in scheme: Statistical Classification of Economic Activities in the European Community, Rev. 2.1 (NACE Rev. 2.1)
scope note: 43.32: - installation of doors (except automated and revolving), windows, door and window frames, of wood or other materials - installation of fitted kitchens, built-in cupboards, staircases, shop fittings etc. - interior completion, e.g. of ceilings and movable partitions - installation works for conservatories, verandas and balconies, of wood or other materials - assembly of stands and stalls, e.g. at markets, exhibitions, fairs - joinery installation for boats 43.39: - joinery installation in boats
top concept of: Statistical Classification of Economic Activities in the European Community, Rev. 2.1 (NACE Rev. 2.1)
Mapping Cardinality: n m

ConceptNoneRandom0.731804903951994
type: ConceptAssociation
description: NACE Rev. 2.1 class 46.83 is mapped to NACE Rev. 2 class 46.73
Type: 1:1
Source Concept: Wholesale of wood, construction materials and sanitary equipment
Target Concept: http://data.europa.eu/ux2/nace2/4673
in scheme: Statistical Classification of Economic Activities in the European Community, Rev. 2.1 (NACE Rev. 2.1)
scope note: the content of the NACE Rev 2.1 class is fully covered in the corresponding NACE Rev 2 class
top concept of: Statistical Classification of Economic Activities in the European Community, Rev. 2.1 (NACE Rev. 2.1)
Mapping Cardinality: 1 1

Hotels and similar accommodation
type: Concept
CoreContentNote: This class includes the provision of accommodation, typically on a daily or weekly basis, for short-term stays. It also includes the provision of furnished accommodation in hotels rooms and suites. Services provided include daily cleaning and bed-making. A range of additional services may be provided (for example, food and beverage services, laundry services, recreational facilities as well as conference and convention facilities). These activities are generally characterised by the provision of on-the-spot customer service. This class includes accommodation provided by, for example: - hotels - resort hotels - suite/apartment hotels
Exclusion Note: This class excludes: - accommodation without daily cleaning, bed-making and on-the-spot customer service, see 55.20 - intermediation service activities for accommodation, see 55.40
broader: Hotels and similar accommodation
in scheme: Statistical Classification of Economic Activities in the European Community, Rev. 2.1 (NACE Rev. 2.1)
Notation: 55.10
top concept of: Statistical Classification of Economic Activities in the European Community, Rev. 2.1 (NACE Rev. 2.1)

Sea and coastal freight water transport
type: Concept
Additional Content Note: This group also includes: - transport of freight on lakes, etc., when similar types of vessels are used as on sea or coastal waters
broader: Water transport
in scheme: Statistical Classification of Economic Activities in the European Community, Rev. 2.1 (NACE Rev. 2.1)
Notation: 50.2
top concept of: Statistical Classification of Economic Activities in the European Community, Rev. 2.1 (NACE Rev. 2.1)

ConceptNoneRandom0.06634166649503292
type: ConceptAssociation
description: NACE Rev. 2.1 class 52.25 is mapped to NACE Rev. 2 class 52.29
Type: 78:65
Source Concept: Logistics service activities
Target Concept: http://data.europa.eu/ux2/nace2/5229
in scheme: Statistical Classification of Economic Activities in the European Community, Rev. 2.1 (NACE Rev. 2.1)
scope note: the content of the NACE Rev 2.1 class is fully covered in the corresponding NACE Rev 2 class
top concept of: Statistical Classification of Economic Activities in the European Community, Rev. 2.1 (NACE Rev. 2.1)
Mapping Cardinality: n m

Rental and leasing of other machinery, equipment and tangible goods n.e.c.
type: Concept
Additional Content Note: This class also includes: - rental of accommodation or office containers - rental of animals (e.g. herds, racehorses) - rental of other containers - rental of pallets
CoreContentNote: This class includes: - rental and operating leasing, without an operator, of other machinery and equipment generally used as capital goods by industries: • engines and turbines • machine tools • mining and oilfield equipment • professional radio, television and communication equipment • motion picture production equipment • measuring and controlling equipment • other scientific, commercial and industrial machinery - rental and operating leasing of land transport equipment (other than motor vehicles) without a driver: • caravans • railway vehicles - tyre leasing - rental of equipment for events, fairs and exhibitions (e.g. for rigging power, light, sound and stage equipment) - rental of furniture for events, fairs and exhibitions - rental of medical/hospital equipment - rental and leasing of slot machines
Exclusion Note: This class excludes: - rental of motorcycles, see 77.11 - rental of bicycles, see 77.21 - rental of agricultural and forestry machinery and equipment, see 77.31 - rental of construction and civil engineering machinery and equipment, see 77.32 - rental of office machinery and equipment, including computers, see 77.33
broader: Rental and leasing of other machinery, equipment and tangible goods
in scheme: Statistical Classification of Economic Activities in the European Community, Rev. 2.1 (NACE Rev. 2.1)
Notation: 77.39
top concept of: Statistical Classification of Economic Activities in the European Community, Rev. 2.1 (NACE Rev. 2.1)

Wholesale of other machinery and equipment
type: Concept
Additional Content Note: This class also includes: - wholesale of measuring instruments and equipment - wholesale of machines for additive manufacturing (3D printers, etc.)
CoreContentNote: This class includes: - wholesale of machinery for the textile industry and of sewing and knitting machines - wholesale of robots for production lines - wholesale of machinery for the food, beverages and tobacco industry - wholesale of transport equipment (e.g. locomotives, wagons), except motor vehicles, motorcycles and bicycles - wholesale of ships and boats - wholesale of armoured vehicles - wholesale of aircraft, drones and unmanned aircraft systems - wholesale of equipment for fish farming - wholesale of attractions for amusement and theme parks (e.g. mechanical rides) - wholesale of equipment for hairdressers, gyms, solariums and beauty centres - wholesale of event technology equipment for events, fairs and exhibitions - wholesale of other machinery n.e.c. for use in industry, trade and navigation and other services - wholesale of other electrical material (e.g. electrical motors, transformers) - wholesale of batteries and accumulators for domestic use - wholesale of wires and switches and other installation equipment - wholesale of photovoltaic panels - wholesale of weapons, weapon systems and ammunition - wholesale of box pallets - wholesale of reservoirs, tanks, vats and similar containers, capacity exceeding 300 litres, of plastics and for industrial use
Exclusion Note: This class excludes: - wholesale of sewing machines household-type, see 46.43 - wholesale of non-household-type medical equipment, see 46.46 - wholesale of recreational boats, see 46.49 - wholesale of bicycles, see 46.49 - wholesale of mining, construction and civil engineering machinery, see 46.63 - wholesale of motor vehicles (including trailers and caravans), see 46.71 - wholesale of motor vehicle parts, see 46.72 - wholesale of batteries and accumulators for motor vehicles, see 46.72 - wholesale of motorcycles, see 46.73 - wholesale of scaffolding, see 46.83 - maintenance and repair of motor vehicles, see 95.31 - maintenance and repair of motorcycles, see 95.32
broader: Wholesale of other machinery, equipment and supplies
in scheme: Statistical Classification of Economic Activities in the European Community, Rev. 2.1 (NACE Rev. 2.1)
Notation: 46.64
top concept of: Statistical Classification of Economic Activities in the European Community, Rev. 2.1 (NACE Rev. 2.1)

ConceptNoneRandom0.06452154920067965
type: ConceptAssociation
description: NACE Rev. 2.1 class 77.11 is mapped to NACE Rev. 2 classes 77.11, 77.12, 77.39
Type: 3:3
Source Concept: Rental and leasing of cars and light motor vehicles
Target Concept: http://data.europa.eu/ux2/nace2/7711
Target Concept: http://data.europa.eu/ux2/nace2/7712
Target Concept: http://data.europa.eu/ux2/nace2/7739
in scheme: Statistical Classification of Economic Activities in the European Community, Rev. 2.1 (NACE Rev. 2.1)
scope note: 77.11: - rental and operating leasing of motor vehicles (with a maximum permissible weight not exceeding 3,5 tons) without a driver, regardless of the length of rental period or way of payment (e.g. subscription): • passenger cars, motor caravans, other light motor vehicles without a driver - rental of shared cars - rental and operating leasing of an individual's own car without a driver 77.12: - rental and operating leasing of the following types of vehicles: • recreational vehicles (with a maximum permissible weight not exceeding 3,5 tons) 77.39: - rental and operating leasing of land-transport equipment (other than motor vehicles) without a driver: • motorcycles • campers (with a maximum permissible weight not exceeding 3,5 tons)
top concept of: Statistical Classification of Economic Activities in the European Community, Rev. 2.1 (NACE Rev. 2.1)
Mapping Cardinality: n m

Test drilling and boring
type: Concept
CoreContentNote: This class includes: - test drilling, test boring and core sampling for construction, geophysical, geological or similar purposes
Exclusion Note: This class excludes: - drilling of production oil or gas wells, see 06.10, 06.20 - test drilling, associated with extraction of petroleum or gas, see 09.10 - test drilling and boring support services (e.g. associated with mining activities), see 09.90 - water well drilling, see 42.21 - geothermal drilling, see 42.21 - shaft sinking, see 43.50 - exploration of oilfields and gas fields, geophysical, geological and seismic surveying, see 71.12
broader: Demolition and site preparation
in scheme: Statistical Classification of Economic Activities in the European Community, Rev. 2.1 (NACE Rev. 2.1)
Notation: 43.13
top concept of: Statistical Classification of Economic Activities in the European Community, Rev. 2.1 (NACE Rev. 2.1)

ConceptNoneRandom0.2635345067433822
type: ConceptAssociation
description: NACE Rev. 2.1 class 91.42 is mapped to NACE Rev. 2 class 91.04
Type: 2:1
Source Concept: Nature reserve activities
Target Concept: http://data.europa.eu/ux2/nace2/9104
in scheme: Statistical Classification of Economic Activities in the European Community, Rev. 2.1 (NACE Rev. 2.1)
scope note: the content of the NACE Rev 2.1 class is fully covered in the corresponding NACE Rev 2 class
top concept of: Statistical Classification of Economic Activities in the European Community, Rev. 2.1 (NACE Rev. 2.1)
Mapping Cardinality: n 1

Secondary and post-secondary non-tertiary education
type: Concept
Additional Content Note: This group also includes the provision of education programmes within or outside the school system which are equivalent in content to programmes in secondary education but are intended for those considered too old to enter secondary schools. Examples of such programmes are adult literacy programmes, second chance or reintegration programmes.
CoreContentNote: This group includes the provision of general secondary and technical and vocational secondary education.
Exclusion Note: This group excludes: - non-formal education and training, see 85.5
broader: Education
in scheme: Statistical Classification of Economic Activities in the European Community, Rev. 2.1 (NACE Rev. 2.1)
Notation: 85.3
top concept of: Statistical Classification of Economic Activities in the European Community, Rev. 2.1 (NACE Rev. 2.1)

ConceptNoneRandom0.03220396723795471
type: ConceptAssociation
description: NACE Rev. 2.1 class 53.10 is mapped to NACE Rev. 2 class 53.10
Type: 1:1
Source Concept: Postal activities under universal service obligation
Target Concept: http://data.europa.eu/ux2/nace2/5310
in scheme: Statistical Classification of Economic Activities in the European Community, Rev. 2.1 (NACE Rev. 2.1)
scope note: the content of the NACE Rev 2.1 class is fully covered in the corresponding NACE Rev 2 class
top concept of: Statistical Classification of Economic Activities in the European Community, Rev. 2.1 (NACE Rev. 2.1)
Mapping Cardinality: 1 1

ConceptNoneRandom0.2733778755460664
type: ConceptAssociation
description: NACE Rev. 2.1 class 10.89 is mapped to NACE Rev. 2 class 10.89
Type: 2:2
Source Concept: Manufacture of other food products n.e.c.
Target Concept: http://data.europa.eu/ux2/nace2/1089
in scheme: Statistical Classification of Economic Activities in the European Community, Rev. 2.1 (NACE Rev. 2.1)
scope note: the content of the NACE Rev 2.1 class is fully covered in the corresponding NACE Rev 2 class
top concept of: Statistical Classification of Economic Activities in the European Community, Rev. 2.1 (NACE Rev. 2.1)
Mapping Cardinality: n m

ConceptNoneRandom0.26609513822042485
type: ConceptAssociation
description: NACE Rev. 2.1 division 18 is mapped to NACE Rev. 2 divisions 18, 74, 82
Type: 48:49
Source Concept: Printing and reproduction of recorded media
Target Concept: http://data.europa.eu/ux2/nace2/18
Target Concept: http://data.europa.eu/ux2/nace2/82
Target Concept: http://data.europa.eu/ux2/nace2/74
in scheme: Statistical Classification of Economic Activities in the European Community, Rev. 2.1 (NACE Rev. 2.1)
top concept of: Statistical Classification of Economic Activities in the European Community, Rev. 2.1 (NACE Rev. 2.1)
Mapping Cardinality: n m

ConceptNoneRandom0.6108814623179908
type: ConceptAssociation
description: NACE Rev. 2.1 class 13.92 is mapped to NACE Rev. 2 class 13.92
Type: 4:4
Source Concept: Manufacture of household textiles and made-up furnishing articles
Target Concept: http://data.europa.eu/ux2/nace2/1392
in scheme: Statistical Classification of Economic Activities in the European Community, Rev. 2.1 (NACE Rev. 2.1)
scope note: the content of the NACE Rev 2.1 class is fully covered in the corresponding NACE Rev 2 class
top concept of: Statistical Classification of Economic Activities in the European Community, Rev. 2.1 (NACE Rev. 2.1)
Mapping Cardinality: n m

ConceptNoneRandom0.5832323895208705
type: ConceptAssociation
description: NACE Rev. 2.1 class 10.41 is mapped to NACE Rev. 2 class 10.41
Type: 1:1
Source Concept: Manufacture of oils and fats
Target Concept: http://data.europa.eu/ux2/nace2/1041
in scheme: Statistical Classification of Economic Activities in the European Community, Rev. 2.1 (NACE Rev. 2.1)
scope note: the content of the NACE Rev 2.1 class is fully covered in the corresponding NACE Rev 2 class
top concept of: Statistical Classification of Economic Activities in the European Community, Rev. 2.1 (NACE Rev. 2.1)
Mapping Cardinality: 1 1

Binding and related services
type: Concept
CoreContentNote: This class includes: - trade binding, sample mounting and post-press services in support of printing activities (e.g. trade binding and finishing of books, brochures, magazines, catalogues), by e.g. folding, cutting and trimming, assembling, stitching, thread sewing, adhesive binding, cutting and cover laying, gluing, collating, basting, gold stamping; spiral binding and plastic wire binding - binding and finishing of printed paper or printed cardboard, by folding, stamping, drilling, punching, perforating, embossing, sticking, gluing, laminating - finishing services for CD-ROMs - mailing finishing services (e.g. customisation, envelope preparation) - other finishing activities (e.g. die, sinking or stamping, Braille copying)
broader: Printing and service activities related to printing
in scheme: Statistical Classification of Economic Activities in the European Community, Rev. 2.1 (NACE Rev. 2.1)
Notation: 18.14
top concept of: Statistical Classification of Economic Activities in the European Community, Rev. 2.1 (NACE Rev. 2.1)

ConceptNoneRandom0.3367203884430393
type: ConceptAssociation
description: NACE Rev. 2.1 group 15.1 is mapped to NACE Rev. 2 group 15.1
Type: 1:1
Source Concept: Tanning, dyeing, dressing of leather and fur; manufacture of luggage, handbags, saddlery and harness
Target Concept: http://data.europa.eu/ux2/nace2/151
in scheme: Statistical Classification of Economic Activities in the European Community, Rev. 2.1 (NACE Rev. 2.1)
top concept of: Statistical Classification of Economic Activities in the European Community, Rev. 2.1 (NACE Rev. 2.1)
Mapping Cardinality: 1 1

ConceptNoneRandom0.41283784548739255
type: ConceptAssociation
description: NACE Rev. 2.1 class 28.15 is mapped to NACE Rev. 2 class 28.15
Type: 1:1
Source Concept: Manufacture of bearings, gears, gearing and driving elements
Target Concept: http://data.europa.eu/ux2/nace2/2815
in scheme: Statistical Classification of Economic Activities in the European Community, Rev. 2.1 (NACE Rev. 2.1)
scope note: the content of the NACE Rev 2.1 class is fully covered in the corresponding NACE Rev 2 class
top concept of: Statistical Classification of Economic Activities in the European Community, Rev. 2.1 (NACE Rev. 2.1)
Mapping Cardinality: 1 1

ConceptNoneRandom0.9039670484991701
type: ConceptAssociation
description: NACE Rev. 2.1 group 28.4 is mapped to NACE Rev. 2 group 28.4
Type: 18:19
Source Concept: Manufacture of metal forming machinery and machine tools
Target Concept: http://data.europa.eu/ux2/nace2/284
in scheme: Statistical Classification of Economic Activities in the European Community, Rev. 2.1 (NACE Rev. 2.1)
top concept of: Statistical Classification of Economic Activities in the European Community, Rev. 2.1 (NACE Rev. 2.1)
Mapping Cardinality: n m

Research and experimental development on natural sciences and engineering
type: Concept
broader: Scientific research and development
in scheme: Statistical Classification of Economic Activities in the European Community, Rev. 2.1 (NACE Rev. 2.1)
Notation: 72.1
top concept of: Statistical Classification of Economic Activities in the European Community, Rev. 2.1 (NACE Rev. 2.1)

Inland passenger water transport
type: Concept
broader: Water transport
in scheme: Statistical Classification of Economic Activities in the European Community, Rev. 2.1 (NACE Rev. 2.1)
Notation: 50.3
top concept of: Statistical Classification of Economic Activities in the European Community, Rev. 2.1 (NACE Rev. 2.1)

ConceptNoneRandom0.824620671032811
type: ConceptAssociation
description: NACE Rev. 2.1 class 23.70 is mapped to NACE Rev. 2 class 23.70
Type: 1:1
Source Concept: Cutting, shaping and finishing of stone
Target Concept: http://data.europa.eu/ux2/nace2/2370
in scheme: Statistical Classification of Economic Activities in the European Community, Rev. 2.1 (NACE Rev. 2.1)
scope note: the content of the NACE Rev 2.1 class is fully covered in the corresponding NACE Rev 2 class
top concept of: Statistical Classification of Economic Activities in the European Community, Rev. 2.1 (NACE Rev. 2.1)
Mapping Cardinality: 1 1

ConceptNoneRandom0.46681006264216385
type: ConceptAssociation
description: NACE Rev. 2.1 class 77.12 is mapped to NACE Rev. 2 classes 77.12, 77.39
Type: 3:3
Source Concept: Rental and leasing of trucks
Target Concept: http://data.europa.eu/ux2/nace2/7712
Target Concept: http://data.europa.eu/ux2/nace2/7739
in scheme: Statistical Classification of Economic Activities in the European Community, Rev. 2.1 (NACE Rev. 2.1)
scope note: 77.12: - rental and operating leasing of the following types of vehicles: • trucks, motor caravans, utility trailers and heavy motor vehicles (with a maximum permissible weight of more than 3,5 tons) • recreational vehicles (with a maximum permissible weight of more than 3,5 tons) 77.39: - rental and operating leasing of land-transport equipment (other than motor vehicles) without a driver: • campers (with a maximum permissible weight of more than 3,5 tons)
top concept of: Statistical Classification of Economic Activities in the European Community, Rev. 2.1 (NACE Rev. 2.1)
Mapping Cardinality: n m

ConceptNoneRandom0.4981837973939558
type: ConceptAssociation
description: NACE Rev. 2.1 class 52.24 is mapped to NACE Rev. 2 classes 49.41, 52.24
Type: 2:2
Source Concept: Cargo handling
Target Concept: http://data.europa.eu/ux2/nace2/5224
Target Concept: http://data.europa.eu/ux2/nace2/4941
in scheme: Statistical Classification of Economic Activities in the European Community, Rev. 2.1 (NACE Rev. 2.1)
scope note: 49.41: - moving cargo on industrial sites, typically with transport equipment that is not suitable for use on roads open to public traffic 52.24: - loading and unloading of goods and luggage irrespective of the mode of transportation used - stevedoring - loading and unloading of freight railway cars - rental and leasing of transtainers or luffing cranes, with an operator, for cargo handling activities - moving cargos on industrial sites, typically with transport equipment that is not suitable for use on roads open to public traffic
top concept of: Statistical Classification of Economic Activities in the European Community, Rev. 2.1 (NACE Rev. 2.1)
Mapping Cardinality: n m

ConceptNoneRandom0.7591715242959816
type: ConceptAssociation
description: NACE Rev. 2.1 class 94.92 is mapped to NACE Rev. 2 class 94.92
Type: 1:1
Source Concept: Activities of political organisations
Target Concept: http://data.europa.eu/ux2/nace2/9492
in scheme: Statistical Classification of Economic Activities in the European Community, Rev. 2.1 (NACE Rev. 2.1)
scope note: the content of the NACE Rev 2.1 class is fully covered in the corresponding NACE Rev 2 class
top concept of: Statistical Classification of Economic Activities in the European Community, Rev. 2.1 (NACE Rev. 2.1)
Mapping Cardinality: 1 1

Tertiary education
type: Concept
broader: Education
in scheme: Statistical Classification of Economic Activities in the European Community, Rev. 2.1 (NACE Rev. 2.1)
Notation: 85.4
top concept of: Statistical Classification of Economic Activities in the European Community, Rev. 2.1 (NACE Rev. 2.1)

ConceptNoneRandom0.40655141549895435
type: ConceptAssociation
description: NACE Rev. 2.1 class 91.41 is mapped to NACE Rev. 2 class 91.04
Type: 2:1
Source Concept: Botanical and zoological garden activities
Target Concept: http://data.europa.eu/ux2/nace2/9104
in scheme: Statistical Classification of Economic Activities in the European Community, Rev. 2.1 (NACE Rev. 2.1)
scope note: the content of the NACE Rev 2.1 class is fully covered in the corresponding NACE Rev 2 class
top concept of: Statistical Classification of Economic Activities in the European Community, Rev. 2.1 (NACE Rev. 2.1)
Mapping Cardinality: n 1

Manufacture of coke oven products
type: Concept
broader: Manufacture of coke and refined petroleum products
in scheme: Statistical Classification of Economic Activities in the European Community, Rev. 2.1 (NACE Rev. 2.1)
Notation: 19.1
top concept of: Statistical Classification of Economic Activities in the European Community, Rev. 2.1 (NACE Rev. 2.1)

ConceptNoneRandom0.020433672223930888
type: ConceptAssociation
description: NACE Rev. 2.1 division 17 is mapped to NACE Rev. 2 division 17
Type: 1:1
Source Concept: Manufacture of paper and paper products
Target Concept: http://data.europa.eu/ux2/nace2/17
in scheme: Statistical Classification of Economic Activities in the European Community, Rev. 2.1 (NACE Rev. 2.1)
top concept of: Statistical Classification of Economic Activities in the European Community, Rev. 2.1 (NACE Rev. 2.1)
Mapping Cardinality: 1 1

ConceptNoneRandom0.4710705665235644
type: ConceptAssociation
description: NACE Rev. 2.1 class 20.20 is mapped to NACE Rev. 2 class 20.20
Type: 1:1
Source Concept: Manufacture of pesticides, disinfectants and other agrochemical products
Target Concept: http://data.europa.eu/ux2/nace2/2020
in scheme: Statistical Classification of Economic Activities in the European Community, Rev. 2.1 (NACE Rev. 2.1)
scope note: the content of the NACE Rev 2.1 class is fully covered in the corresponding NACE Rev 2 class
top concept of: Statistical Classification of Economic Activities in the European Community, Rev. 2.1 (NACE Rev. 2.1)
Mapping Cardinality: 1 1

Hunting, trapping and related service activities
type: Concept
Additional Content Note: This class also includes: - land-based catching of sea mammals (e.g. walruses or seals) - hunting of foxes, minks and wolves to protect livestock - hunting for animal population control
CoreContentNote: This class includes: - hunting and trapping on a commercial basis - taking of wild animals (dead or alive) for i) food, fur or skin and ii) use in research, in zoos or as pets - production of fur skins and reptile or bird skins from hunting or trapping activities - catching of frogs and collecting of snails in the wild
Exclusion Note: This class excludes: - raising of game animals on ranching operations, see 01.4 - production of bird skins from ranching operations or skins from farming reptiles (e.g. snakes and turtles), see 01.48 - pest control (including rabbits) in connection with agriculture, see 01.61 - whaling, see 03.11 - production of hides and skins originating from slaughterhouses, see 10.11 - hunting for sport or recreation and related service activities, see 93.19 - service activities to promote hunting and trapping, see 94.99
broader: Hunting, trapping and related service activities
in scheme: Statistical Classification of Economic Activities in the European Community, Rev. 2.1 (NACE Rev. 2.1)
Notation: 01.70
top concept of: Statistical Classification of Economic Activities in the European Community, Rev. 2.1 (NACE Rev. 2.1)

ConceptNoneRandom0.7387111901902402
type: ConceptAssociation
description: NACE Rev. 2.1 class 46.81 is mapped to NACE Rev. 2 class 46.71
Type: 1:1
Source Concept: Wholesale of solid, liquid and gaseous fuels and related products
Target Concept: http://data.europa.eu/ux2/nace2/4671
in scheme: Statistical Classification of Economic Activities in the European Community, Rev. 2.1 (NACE Rev. 2.1)
scope note: the content of the NACE Rev 2.1 class is fully covered in the corresponding NACE Rev 2 class
top concept of: Statistical Classification of Economic Activities in the European Community, Rev. 2.1 (NACE Rev. 2.1)
Mapping Cardinality: 1 1

ConceptNoneRandom0.802915777081737
type: ConceptAssociation
description: NACE Rev. 2.1 class 13.91 is mapped to NACE Rev. 2 class 13.91
Type: 1:1
Source Concept: Manufacture of knitted and crocheted fabrics
Target Concept: http://data.europa.eu/ux2/nace2/1391
in scheme: Statistical Classification of Economic Activities in the European Community, Rev. 2.1 (NACE Rev. 2.1)
scope note: the content of the NACE Rev 2.1 class is fully covered in the corresponding NACE Rev 2 class
top concept of: Statistical Classification of Economic Activities in the European Community, Rev. 2.1 (NACE Rev. 2.1)
Mapping Cardinality: 1 1

ConceptNoneRandom0.34727404794640904
type: ConceptAssociation
description: NACE Rev. 2.1 group 15.2 is mapped to NACE Rev. 2 groups 15.2, 16.2, 22.1, 22.2
Type: 5:5
Source Concept: Manufacture of footwear
Target Concept: http://data.europa.eu/ux2/nace2/162
Target Concept: http://data.europa.eu/ux2/nace2/152
Target Concept: http://data.europa.eu/ux2/nace2/221
Target Concept: http://data.europa.eu/ux2/nace2/222
in scheme: Statistical Classification of Economic Activities in the European Community, Rev. 2.1 (NACE Rev. 2.1)
top concept of: Statistical Classification of Economic Activities in the European Community, Rev. 2.1 (NACE Rev. 2.1)
Mapping Cardinality: n m

Pre-press and pre-media services
type: Concept
CoreContentNote: This class includes: - composing, typesetting and phototypesetting, pre-press data input into a form suitable for use in various printing processes and representation in other visual media, including scanning and optical character recognition, electronic make-up - preparation of data files for multimedia (printing on paper, CD-ROM, the internet) applications - plate-making services, including image setting and plate setting (for letterpress and offset printing processes) - cylinder preparation: engraving or etching of cylinders for gravure printing - plate processing: computer-to-plate (CTP), also photopolymer plates - preparation of plates and dies for relief stamping or printing - preparation of: • artistic works of technical character (e.g. preparation of lithographic stones and wood blocks) • presentation media • sketches, layouts, dummies, etc. • production of proofs
Exclusion Note: This class excludes: - graphic designing of visual content for the communication of information not intended to be printed, see 74.1
broader: Printing and service activities related to printing
in scheme: Statistical Classification of Economic Activities in the European Community, Rev. 2.1 (NACE Rev. 2.1)
Notation: 18.13
top concept of: Statistical Classification of Economic Activities in the European Community, Rev. 2.1 (NACE Rev. 2.1)

ConceptNoneRandom0.39066670774090306
type: ConceptAssociation
description: NACE Rev. 2.1 class 64.22 is mapped to NACE Rev. 2 classes 64.20, 64.99
Type: 4:3
Source Concept: Activities of financing conduits
Target Concept: http://data.europa.eu/ux2/nace2/6499
Target Concept: http://data.europa.eu/ux2/nace2/6420
in scheme: Statistical Classification of Economic Activities in the European Community, Rev. 2.1 (NACE Rev. 2.1)
scope note: 64.20: - activities of financing conduits, i.e. units created by a financial or non-financial group to raise or borrow funds (often on the open market) and to remit those funds to their parent or another entity within the group - activities of captive financial institutions involved in intragroup lending - brass plate companies engaged in raising funds and remit those funds to their parent, i.e. units that are owned (directly or indirectly) by a non-resident unit, of which large part of the balance sheet consists of claims and liabilities towards non-resident units, and that have few or no employees and little or no physical presence in the jurisdiction of incorporation 64.99: - financial conduits issue bonds etc. to provide capital to the enterprise groups
top concept of: Statistical Classification of Economic Activities in the European Community, Rev. 2.1 (NACE Rev. 2.1)
Mapping Cardinality: n m

ConceptNoneRandom0.5638748776156911
type: ConceptAssociation
description: NACE Rev. 2.1 group 37.0 is mapped to NACE Rev. 2 group 37.0
Type: 1:1
Source Concept: Sewerage
Target Concept: http://data.europa.eu/ux2/nace2/370
in scheme: Statistical Classification of Economic Activities in the European Community, Rev. 2.1 (NACE Rev. 2.1)
top concept of: Statistical Classification of Economic Activities in the European Community, Rev. 2.1 (NACE Rev. 2.1)
Mapping Cardinality: 1 1

Pre-primary education
type: Concept
broader: Education
in scheme: Statistical Classification of Economic Activities in the European Community, Rev. 2.1 (NACE Rev. 2.1)
Notation: 85.1
top concept of: Statistical Classification of Economic Activities in the European Community, Rev. 2.1 (NACE Rev. 2.1)

ConceptNoneRandom0.05803061041218971
type: ConceptAssociation
description: NACE Rev. 2.1 group 24.2 is mapped to NACE Rev. 2 group 24.2
Type: 1:1
Source Concept: Manufacture of tubes, pipes, hollow profiles and related fittings, of steel
Target Concept: http://data.europa.eu/ux2/nace2/242
in scheme: Statistical Classification of Economic Activities in the European Community, Rev. 2.1 (NACE Rev. 2.1)
top concept of: Statistical Classification of Economic Activities in the European Community, Rev. 2.1 (NACE Rev. 2.1)
Mapping Cardinality: 1 1

ConceptNoneRandom0.9576911825626946
type: ConceptAssociation
description: NACE Rev. 2.1 class 25.93 is mapped to NACE Rev. 2 class 25.93
Type: 1:1
Source Concept: Manufacture of wire products, chain and springs
Target Concept: http://data.europa.eu/ux2/nace2/2593
in scheme: Statistical Classification of Economic Activities in the European Community, Rev. 2.1 (NACE Rev. 2.1)
scope note: the content of the NACE Rev 2.1 class is fully covered in the corresponding NACE Rev 2 class
top concept of: Statistical Classification of Economic Activities in the European Community, Rev. 2.1 (NACE Rev. 2.1)
Mapping Cardinality: 1 1

ConceptNoneRandom0.3325504829640701
type: ConceptAssociation
description: NACE Rev. 2.1 group 02.4 is mapped to NACE Rev. 2 group 02.4
Type: 1:1
Source Concept: Support services to forestry
Target Concept: http://data.europa.eu/ux2/nace2/024
in scheme: Statistical Classification of Economic Activities in the European Community, Rev. 2.1 (NACE Rev. 2.1)
top concept of: Statistical Classification of Economic Activities in the European Community, Rev. 2.1 (NACE Rev. 2.1)
Mapping Cardinality: 1 1

ConceptNoneRandom0.10400954707548271
type: ConceptAssociation
description: NACE Rev. 2.1 division 11 is mapped to NACE Rev. 2 divisions 10, 11
Type: 2:2
Source Concept: Manufacture of beverages
Target Concept: http://data.europa.eu/ux2/nace2/11
Target Concept: http://data.europa.eu/ux2/nace2/10
in scheme: Statistical Classification of Economic Activities in the European Community, Rev. 2.1 (NACE Rev. 2.1)
top concept of: Statistical Classification of Economic Activities in the European Community, Rev. 2.1 (NACE Rev. 2.1)
Mapping Cardinality: n m

Retail sale of textiles
type: Concept
Additional Content Note: This class also includes: - retail sale of bed linen
CoreContentNote: This class includes: - retail sale of fabrics - retail sale of knitting yarn - retail sale of basic materials for rug, tapestry or embroidery making - retail sale of textiles - retail sale of haberdashery: needles, sewing thread, etc. - retail sale of tarpaulins
Exclusion Note: This class excludes: - retail sale of curtains and net curtains, see 47.53 - retail sale of parasols, see 47.55 - retail sale of clothing, see 47.71
broader: Retail sale of other household equipment
in scheme: Statistical Classification of Economic Activities in the European Community, Rev. 2.1 (NACE Rev. 2.1)
Notation: 47.51
top concept of: Statistical Classification of Economic Activities in the European Community, Rev. 2.1 (NACE Rev. 2.1)

Manufacture of starches and starch products
type: Concept
CoreContentNote: This class includes: - manufacture of starches from rice, potatoes, maize, etc. - wet corn milling - manufacture of glucose, glucose syrup, maltose, inulin, etc. - manufacture of gluten - manufacture of tapioca and tapioca substitutes prepared from starch - manufacture of corn oil
Exclusion Note: This class excludes: - manufacture of lactose (milk sugar), see 10.51 - production of cane or beet sugar, see 10.81
broader: Manufacture of grain mill products, starches and starch products
in scheme: Statistical Classification of Economic Activities in the European Community, Rev. 2.1 (NACE Rev. 2.1)
Notation: 10.62
top concept of: Statistical Classification of Economic Activities in the European Community, Rev. 2.1 (NACE Rev. 2.1)

ConceptNoneRandom0.8103590545475656
type: ConceptAssociation
description: NACE Rev. 2.1 class 13.94 is mapped to NACE Rev. 2 class 13.94
Type: 1:1
Source Concept: Manufacture of cordage, rope, twine and netting
Target Concept: http://data.europa.eu/ux2/nace2/1394
in scheme: Statistical Classification of Economic Activities in the European Community, Rev. 2.1 (NACE Rev. 2.1)
scope note: the content of the NACE Rev 2.1 class is fully covered in the corresponding NACE Rev 2 class
top concept of: Statistical Classification of Economic Activities in the European Community, Rev. 2.1 (NACE Rev. 2.1)
Mapping Cardinality: 1 1

Other printing
type: Concept
Additional Content Note: This class also includes: - printing on labels or tags (for example, lithographic, gravure printing, flexographic printing, printing signs) - laser engraving on textiles - activities of printing photographs
CoreContentNote: This class includes: - printing of magazines and other periodicals, appearing less than four times a week - printing of books and brochures, music and music manuscripts, maps, atlases, posters, advertising catalogues, prospectuses and other printed advertising, postage stamps, taxation stamps, documents of title, cheques and other security papers, smart cards, albums, diaries, calendars and other commercial printed matter, beer mats, personalised stationery and other printed matter by letterpress, offset, photogravure, flexographic, screen printing, and other printing presses, duplication machines, computer printers, embossers etc., including quick printing directly onto textiles, plastic, glass, metal, wood and ceramics - digital printing - silk-screen printing on textiles and wearing apparel - photocopying of documents - decorative printing, e.g. printing of gift wraps, wallpapers, materials for transfer - large format printing, e.g. printing of flags, banners, roll-ups, posters The material printed is typically copyrighted. This class covers exclusively printing service activities, not goods.
Exclusion Note: This class excludes: - printing of textile fabrics as an intermediate process within the manufacture of textiles, see 13.30 - manufacture of stationery (e.g. notebooks, binders, registers, accounting books, business forms), when the printed information is not the main characteristic, see 17.23 - publishing of printed matter, see 58.1 - advertising design activities, see 73.11 - operation of photocopying machines for photocopying as a self-service, see 82.10 - engraving onto metal, glass, wood, etc., see corresponding class according to the material used
broader: Printing and service activities related to printing
in scheme: Statistical Classification of Economic Activities in the European Community, Rev. 2.1 (NACE Rev. 2.1)
Notation: 18.12
top concept of: Statistical Classification of Economic Activities in the European Community, Rev. 2.1 (NACE Rev. 2.1)

ConceptNoneRandom0.627162428419866
type: ConceptAssociation
description: NACE Rev. 2.1 class 47.71 is mapped to NACE Rev. 2 classes 47.71, 47.82, 47.91, 47.99
Type: 78:65
Source Concept: Retail sale of clothing
Target Concept: http://data.europa.eu/ux2/nace2/4791
Target Concept: http://data.europa.eu/ux2/nace2/4782
Target Concept: http://data.europa.eu/ux2/nace2/4771
Target Concept: http://data.europa.eu/ux2/nace2/4799
in scheme: Statistical Classification of Economic Activities in the European Community, Rev. 2.1 (NACE Rev. 2.1)
scope note: 47.71: - retail sale of articles of clothing, including underwear - retail sale of articles of fur - retail sale of clothing accessories, e.g. gloves, ties, braces - retail sale of work clothes, uniforms, disguises, carnival costumes etc. 47.82: - retail sale via stalls and markets of articles of clothing, including underwear - retail sale via stalls and markets of articles of fur - retail sale via stalls and markets of clothing accessories, e.g. gloves, ties, braces - retail sale via stalls and markets of work clothes, uniforms, disguises, carnival costumes etc. 47.91: - retail sale via mail order houses or via Internet of articles of clothing, including underwear - retail sale via mail order houses or via Internet of articles of fur - retail sale via mail order houses or via Internet of clothing accessories, e.g. gloves, ties, braces - retail sale via mail order houses or via Internet of work clothes, uniforms, disguises, carnival costumes etc. 47.99: - retail sale not in stores, stalls or markets of articles of clothing, including underwear - retail sale not in stores, stalls or markets of articles of fur - retail sale not in stores, stalls or markets of clothing accessories, e.g. gloves, ties, braces - retail sale not in stores, stalls or markets of work clothes, uniforms, disguises, carnival costumes etc.
top concept of: Statistical Classification of Economic Activities in the European Community, Rev. 2.1 (NACE Rev. 2.1)
Mapping Cardinality: n m

ConceptNoneRandom0.26491935256945653
type: ConceptAssociation
description: NACE Rev. 2.1 class 46.86 is mapped to NACE Rev. 2 class 46.76
Type: 1:1
Source Concept: Wholesale of other intermediate products
Target Concept: http://data.europa.eu/ux2/nace2/4676
in scheme: Statistical Classification of Economic Activities in the European Community, Rev. 2.1 (NACE Rev. 2.1)
scope note: the content of the NACE Rev 2.1 class is fully covered in the corresponding NACE Rev 2 class
top concept of: Statistical Classification of Economic Activities in the European Community, Rev. 2.1 (NACE Rev. 2.1)
Mapping Cardinality: 1 1

ConceptNoneRandom0.6968649456509839
type: ConceptAssociation
description: NACE Rev. 2.1 class 43.35 is mapped to NACE Rev. 2 classes 43.39, 43.99
Type: 23:16
Source Concept: Other building completion and finishing
Target Concept: http://data.europa.eu/ux2/nace2/4339
Target Concept: http://data.europa.eu/ux2/nace2/4399
in scheme: Statistical Classification of Economic Activities in the European Community, Rev. 2.1 (NACE Rev. 2.1)
scope note: 43.39: - installation of prefabricated metal sheets, steel parts, profiles, etc. - ornamentation fitting works on buildings - cladding for exterior walls - other building completion and finishing work n.e.c. - other boat completion and finishing work n.e.c. 43.99: - erection of curtain walls
top concept of: Statistical Classification of Economic Activities in the European Community, Rev. 2.1 (NACE Rev. 2.1)
Mapping Cardinality: n m

ConceptNoneRandom0.4365029229438526
type: ConceptAssociation
description: NACE Rev. 2.1 class 08.12 is mapped to NACE Rev. 2 class 08.12
Type: 1:1
Source Concept: Operation of gravel and sand pits and mining of clay and kaolin
Target Concept: http://data.europa.eu/ux2/nace2/0812
in scheme: Statistical Classification of Economic Activities in the European Community, Rev. 2.1 (NACE Rev. 2.1)
scope note: the content of the NACE Rev 2.1 class is fully covered in the corresponding NACE Rev 2 class
top concept of: Statistical Classification of Economic Activities in the European Community, Rev. 2.1 (NACE Rev. 2.1)
Mapping Cardinality: 1 1

Primary education
type: Concept
broader: Education
in scheme: Statistical Classification of Economic Activities in the European Community, Rev. 2.1 (NACE Rev. 2.1)
Notation: 85.2
top concept of: Statistical Classification of Economic Activities in the European Community, Rev. 2.1 (NACE Rev. 2.1)

ConceptNoneRandom0.5454480505213807
type: ConceptAssociation
description: NACE Rev. 2.1 group 24.3 is mapped to NACE Rev. 2 group 24.3
Type: 1:1
Source Concept: Manufacture of other products of first processing of steel
Target Concept: http://data.europa.eu/ux2/nace2/243
in scheme: Statistical Classification of Economic Activities in the European Community, Rev. 2.1 (NACE Rev. 2.1)
top concept of: Statistical Classification of Economic Activities in the European Community, Rev. 2.1 (NACE Rev. 2.1)
Mapping Cardinality: 1 1

Sea and coastal passenger water transport
type: Concept
Additional Content Note: This group also includes: - transport of passengers on lakes, etc., when similar types of vessels are used as on sea or coastal waters
broader: Water transport
in scheme: Statistical Classification of Economic Activities in the European Community, Rev. 2.1 (NACE Rev. 2.1)
Notation: 50.1
top concept of: Statistical Classification of Economic Activities in the European Community, Rev. 2.1 (NACE Rev. 2.1)

ConceptNoneRandom0.4996789820645372
type: ConceptAssociation
description: NACE Rev. 2.1 group 46.1 is mapped to NACE Rev. 2 groups 45.1, 45.3, 45.4, 46.1, 82.9
Type: 42:34
Source Concept: Wholesale on a fee or contract basis
Target Concept: http://data.europa.eu/ux2/nace2/454
Target Concept: http://data.europa.eu/ux2/nace2/453
Target Concept: http://data.europa.eu/ux2/nace2/451
Target Concept: http://data.europa.eu/ux2/nace2/461
Target Concept: http://data.europa.eu/ux2/nace2/829
in scheme: Statistical Classification of Economic Activities in the European Community, Rev. 2.1 (NACE Rev. 2.1)
top concept of: Statistical Classification of Economic Activities in the European Community, Rev. 2.1 (NACE Rev. 2.1)
Mapping Cardinality: n m

ConceptNoneRandom0.6535343547743969
type: ConceptAssociation
description: NACE Rev. 2.1 class 25.94 is mapped to NACE Rev. 2 class 25.94
Type: 1:1
Source Concept: Manufacture of fasteners and screw machine products
Target Concept: http://data.europa.eu/ux2/nace2/2594
in scheme: Statistical Classification of Economic Activities in the European Community, Rev. 2.1 (NACE Rev. 2.1)
scope note: the content of the NACE Rev 2.1 class is fully covered in the corresponding NACE Rev 2 class
top concept of: Statistical Classification of Economic Activities in the European Community, Rev. 2.1 (NACE Rev. 2.1)
Mapping Cardinality: 1 1

ConceptNoneRandom0.18021577042958592
type: ConceptAssociation
description: NACE Rev. 2.1 group 11.0 is mapped to NACE Rev. 2 groups 10.8, 11.0
Type: 4:4
Source Concept: Manufacture of beverages
Target Concept: http://data.europa.eu/ux2/nace2/110
Target Concept: http://data.europa.eu/ux2/nace2/108
in scheme: Statistical Classification of Economic Activities in the European Community, Rev. 2.1 (NACE Rev. 2.1)
top concept of: Statistical Classification of Economic Activities in the European Community, Rev. 2.1 (NACE Rev. 2.1)
Mapping Cardinality: n m

Retail sale of hardware, building materials, paints and glass
type: Concept
Additional Content Note: This class also includes: - retail sale of garden and landscaping equipment (e.g. lawnmowers) - retail sale of saunas, swimming pools and spas, including in kits, etc., without installation
CoreContentNote: This class includes: - retail sale of hardware - retail sale of paints, varnishes and lacquers - retail sale of solvents, white spirit and similar products - retail sale of flat glass - retail sale of other building material (e.g. bricks, tiles, breeze blocks, wood, floorboards, insulation material) - retail sale of sanitary and heating equipment - retail sale of do-it-yourself material, electrical and plumbing material and equipment - retail sale of tools (e.g. hammers, saws, screwdrivers and other hand tools, including power hand tools) - retail sale of renewable energy materials (e.g. non-electric solar collectors and photovoltaic panels, without installation) - retail sale of electrical or electronic fire alarms, fire extinguishers, emergency blocks, smoke extraction systems, safes and vaults, without installation or maintenance services - retail sale of doors, windows and shutters (of any material)
Exclusion Note: This class excludes: - installation of photovoltaic panels not connected to a building, see 42.22 - installation of photovoltaic panels connected to a building, see 43.21 - retail sale of wall or floor coverings (e.g. wallpaper, tiles, laminates, vinyl flooring), see 47.53 - retail sale of carpets and rugs, see 47.53
broader: Retail sale of other household equipment
in scheme: Statistical Classification of Economic Activities in the European Community, Rev. 2.1 (NACE Rev. 2.1)
Notation: 47.52
top concept of: Statistical Classification of Economic Activities in the European Community, Rev. 2.1 (NACE Rev. 2.1)

Other support activities to arts and performing arts
type: Concept
Additional Content Note: This class also includes: - activities of producers or promoters of live arts events - technical planning, supply, setting-up and operation of audiovisual equipment and special effects associated with the organisation of artistic events
CoreContentNote: This class includes: - support activities to the performing arts for production of live stage presentations (e.g. theatrical presentations, concerts, opera, dance, other stage productions): • activities of producers, stage-set designers and builders, scene-shifters, lighting engineers, etc. - organisation of cultural and entertainment events (e.g. film festivals, music and dance festivals) - activities of film and theatre directors, dramaturges, film promoters and programmes creators
Exclusion Note: This class excludes: - production of motion pictures, including digital distribution, for direct projection in theatres or for broadcasting or streaming, see 59.1 - broadcasting of live performances and events, see 60.20 - activities of personal theatrical or artistic agents or agencies, see 74.99 - casting activities, see 78.10 - organisation of conferences, conventions and trade shows, see 82.30 - activities of producers or promoters of sporting events, with or without facilities, see 93.19 - activities of performing artists and groups, see 90.20 - technical planning, supply, setting-up and operation of audiovisual equipment and special effects associated with the organisation of non-artistic events, see 93.29
broader: Support activities to arts creation and performing arts
in scheme: Statistical Classification of Economic Activities in the European Community, Rev. 2.1 (NACE Rev. 2.1)
Notation: 90.39
top concept of: Statistical Classification of Economic Activities in the European Community, Rev. 2.1 (NACE Rev. 2.1)

Manufacture of perfumes and toilet preparations
type: Concept
CoreContentNote: This class includes: - manufacture of perfume and toilet preparations: • perfume and toilet water • beauty and make-up preparations • sunburn prevention and suntan preparations • manicure and pedicure preparations • shampoos, hair lacquers, waving and straightening preparations • dentifrices and preparations for oral hygiene, including denture fixative preparations • shaving preparations, including pre-shave and aftershave preparations • deodorants and bath salts • depilatories - manufacture of cosmetic soap
Exclusion Note: This class excludes: - extraction and refining of natural essential oils, see 20.59
broader: Manufacture of washing, cleaning and polishing preparations
in scheme: Statistical Classification of Economic Activities in the European Community, Rev. 2.1 (NACE Rev. 2.1)
Notation: 20.42
top concept of: Statistical Classification of Economic Activities in the European Community, Rev. 2.1 (NACE Rev. 2.1)

ConceptNoneRandom0.16274059834724075
type: ConceptAssociation
description: NACE Rev. 2.1 division 10 is mapped to NACE Rev. 2 division 10
Type: 2:2
Source Concept: Manufacture of food products
Target Concept: http://data.europa.eu/ux2/nace2/10
in scheme: Statistical Classification of Economic Activities in the European Community, Rev. 2.1 (NACE Rev. 2.1)
top concept of: Statistical Classification of Economic Activities in the European Community, Rev. 2.1 (NACE Rev. 2.1)
Mapping Cardinality: n m

ConceptNoneRandom0.04212659543089414
type: ConceptAssociation
description: NACE Rev. 2.1 division 59 is mapped to NACE Rev. 2 division 59
Type: 1:1
Source Concept: Motion picture, video and television programme production, sound recording and music publishing activities
Target Concept: http://data.europa.eu/ux2/nace2/59
in scheme: Statistical Classification of Economic Activities in the European Community, Rev. 2.1 (NACE Rev. 2.1)
top concept of: Statistical Classification of Economic Activities in the European Community, Rev. 2.1 (NACE Rev. 2.1)
Mapping Cardinality: 1 1

Manufacture of games and toys
type: Concept
Additional Content Note: This class also includes: - manufacture of fabric toys
CoreContentNote: This class includes the manufacture of dolls, toys and games (including electronic games), scale models and children’s vehicles (except metal bicycles and tricycles). This class includes: - manufacture of dolls and doll garments, parts and accessories - manufacture of action figures - manufacture of toy animals - manufacture of wheeled toys designed to be ridden, including plastic bicycles and tricycles - manufacture of toy musical instruments - manufacture of playing cards - manufacture of games and toys of paper or paperboard - manufacture of board games and similar games - manufacture of electronic board games - manufacture of reduced-size (scale) models and similar recreational models, electrical trains, construction sets, etc. - manufacture of gaming and gambling machines - manufacture of billiards and special tables for casino games, etc. - manufacture of articles for funfair, table or parlour games - manufacture of puzzles and similar articles - manufacture of toy drones
Exclusion Note: This class excludes: - manufacture of video game consoles, see 26.40 - manufacture of drones for civilian purposes, see 30.31 - manufacture of bicycles, see 30.92 - manufacture of articles for jokes and novelties, see 32.99 - writing and publishing of software for video game consoles, see 58.21, 62.10
broader: Manufacture of games and toys
in scheme: Statistical Classification of Economic Activities in the European Community, Rev. 2.1 (NACE Rev. 2.1)
Notation: 32.40
top concept of: Statistical Classification of Economic Activities in the European Community, Rev. 2.1 (NACE Rev. 2.1)

ConceptNoneRandom0.9261747996954213
type: ConceptAssociation
description: NACE Rev. 2.1 class 13.93 is mapped to NACE Rev. 2 class 13.93
Type: 1:1
Source Concept: Manufacture of carpets and rugs
Target Concept: http://data.europa.eu/ux2/nace2/1393
in scheme: Statistical Classification of Economic Activities in the European Community, Rev. 2.1 (NACE Rev. 2.1)
scope note: the content of the NACE Rev 2.1 class is fully covered in the corresponding NACE Rev 2 class
top concept of: Statistical Classification of Economic Activities in the European Community, Rev. 2.1 (NACE Rev. 2.1)
Mapping Cardinality: 1 1

ConceptNoneRandom0.9874703377993984
type: ConceptAssociation
description: NACE Rev. 2.1 class 10.42 is mapped to NACE Rev. 2 class 10.42
Type: 1:1
Source Concept: Manufacture of margarine and similar edible fats
Target Concept: http://data.europa.eu/ux2/nace2/1042
in scheme: Statistical Classification of Economic Activities in the European Community, Rev. 2.1 (NACE Rev. 2.1)
scope note: the content of the NACE Rev 2.1 class is fully covered in the corresponding NACE Rev 2 class
top concept of: Statistical Classification of Economic Activities in the European Community, Rev. 2.1 (NACE Rev. 2.1)
Mapping Cardinality: 1 1

ConceptNoneRandom0.22518834864360582
type: ConceptAssociation
description: NACE Rev. 2.1 class 47.72 is mapped to NACE Rev. 2 classes 47.72, 47.82, 47.91, 47.99
Type: 78:65
Source Concept: Retail sale of footwear and leather goods
Target Concept: http://data.europa.eu/ux2/nace2/4791
Target Concept: http://data.europa.eu/ux2/nace2/4782
Target Concept: http://data.europa.eu/ux2/nace2/4799
Target Concept: http://data.europa.eu/ux2/nace2/4772
in scheme: Statistical Classification of Economic Activities in the European Community, Rev. 2.1 (NACE Rev. 2.1)
scope note: 47.72: - retail sale of footwear - retail sale of leather goods - retail sale of travel accessories of leather and leather substitutes 47.82: - retail sale via stalls and markets of footwear - retail sale via stalls and markets of leather goods - retail sale via stalls and markets of travel accessories of leather and leather substitutes 47.91: - retail sale via mail order houses or via Internet of footwear - retail sale via mail order houses or via Internet of leather goods - retail sale via mail order houses or via Internet of travel accessories of leather and leather substitutes 47.99: - retail sale not in stores, stalls or markets of footwear - retail sale not in stores, stalls or markets of leather goods - retail sale not in stores, stalls or markets of travel accessories of leather and leather substitutes
top concept of: Statistical Classification of Economic Activities in the European Community, Rev. 2.1 (NACE Rev. 2.1)
Mapping Cardinality: n m

ConceptNoneRandom0.7730103268317225
type: ConceptAssociation
description: NACE Rev. 2.1 class 08.11 is mapped to NACE Rev. 2 class 08.11
Type: 1:1
Source Concept: Quarrying of ornamental stone, limestone, gypsum, slate and other stone
Target Concept: http://data.europa.eu/ux2/nace2/0811
in scheme: Statistical Classification of Economic Activities in the European Community, Rev. 2.1 (NACE Rev. 2.1)
scope note: the content of the NACE Rev 2.1 class is fully covered in the corresponding NACE Rev 2 class
top concept of: Statistical Classification of Economic Activities in the European Community, Rev. 2.1 (NACE Rev. 2.1)
Mapping Cardinality: 1 1

Printing of newspapers
type: Concept
Additional Content Note: This class also includes: - printing of other periodicals, appearing at least four times a week
Exclusion Note: This class excludes: - photocopying activities, see 18.12 - publishing of printed matter, see 58.1 - operation of photocopying machines for photocopying as a self-service, see 82.10
broader: Printing and service activities related to printing
in scheme: Statistical Classification of Economic Activities in the European Community, Rev. 2.1 (NACE Rev. 2.1)
Notation: 18.11
top concept of: Statistical Classification of Economic Activities in the European Community, Rev. 2.1 (NACE Rev. 2.1)

ConceptNoneRandom0.702229074210684
type: ConceptAssociation
description: NACE Rev. 2.1 class 46.87 is mapped to NACE Rev. 2 class 46.77
Type: 1:1
Source Concept: Wholesale of waste and scrap
Target Concept: http://data.europa.eu/ux2/nace2/4677
in scheme: Statistical Classification of Economic Activities in the European Community, Rev. 2.1 (NACE Rev. 2.1)
scope note: the content of the NACE Rev 2.1 class is fully covered in the corresponding NACE Rev 2 class
top concept of: Statistical Classification of Economic Activities in the European Community, Rev. 2.1 (NACE Rev. 2.1)
Mapping Cardinality: 1 1

Undifferentiated service-producing activities of private households for own use
type: Concept
broader: Undifferentiated goods- and service-producing activities of private households for own use
in scheme: Statistical Classification of Economic Activities in the European Community, Rev. 2.1 (NACE Rev. 2.1)
Notation: 98.2
top concept of: Statistical Classification of Economic Activities in the European Community, Rev. 2.1 (NACE Rev. 2.1)

Museum and collection activities
type: Concept
CoreContentNote: This class includes: - operation, management, care, preservation, assessment and exhibition of collections of museums of all kinds: • museums or art museums; applied art, crafts and design museums (e.g. jewellery, furniture, costumes, ceramics, silverware) • natural history, science and technology museums, historical museums (including military museums) • other specialised museums - open-air museums, ecomuseums, digital and virtual museums - collections in historic houses and national galleries; interpretation centres for ethnographic, religious and folk art (at local or regional level) - activities of art galleries, exhibiting art (not for sale)
Exclusion Note: This class excludes: - retail sale of paintings and sculptures (activities of commercial art galleries), see 47.69 - library activities, see 91.11 - archive activities, see 91.12 - conservation and restoration of cultural heritage, see 91.30 - repair of furniture not considered cultural heritage and non-historical, see 95.24
broader: Museum, collection, historical site and monument activities
in scheme: Statistical Classification of Economic Activities in the European Community, Rev. 2.1 (NACE Rev. 2.1)
Notation: 91.21
top concept of: Statistical Classification of Economic Activities in the European Community, Rev. 2.1 (NACE Rev. 2.1)

Manufacture of soap and detergents, cleaning and polishing preparations
type: Concept
CoreContentNote: This class includes: - manufacture of organic surface-active agents - manufacture of paper, wadding, felt, etc., coated or covered with soap or detergent - manufacture of crude glycerol - manufacture of soap, except cosmetic soap - manufacture of surface-active preparations: • washing powders in solid or liquid form and detergents • dish-washing preparations • textile softeners - manufacture of cleaning and polishing products: • preparations for perfuming or deodorising rooms • artificial waxes and prepared waxes • polishes and creams for leather • polishes and creams for wood • polishes for coachwork, glass and metal • scouring pastes and powders, including paper, wadding, etc., coated or covered with these
Exclusion Note: This class excludes: - manufacture of separate, chemically defined compounds, see 20.13, 20.14 - manufacture of glycerol, synthesised from petroleum products, see 20.14 - manufacture of cosmetic soap, see 20.42
broader: Manufacture of washing, cleaning and polishing preparations
in scheme: Statistical Classification of Economic Activities in the European Community, Rev. 2.1 (NACE Rev. 2.1)
Notation: 20.41
top concept of: Statistical Classification of Economic Activities in the European Community, Rev. 2.1 (NACE Rev. 2.1)

ConceptNoneRandom0.9420790859610771
type: ConceptAssociation
description: NACE Rev. 2.1 class 01.50 is mapped to NACE Rev. 2 class 01.50
Type: 1:1
Source Concept: Mixed farming
Target Concept: http://data.europa.eu/ux2/nace2/0150
in scheme: Statistical Classification of Economic Activities in the European Community, Rev. 2.1 (NACE Rev. 2.1)
scope note: the content of the NACE Rev 2.1 class is fully covered in the corresponding NACE Rev 2 class
top concept of: Statistical Classification of Economic Activities in the European Community, Rev. 2.1 (NACE Rev. 2.1)
Mapping Cardinality: 1 1

ConceptNoneRandom0.5853871889937331
type: ConceptAssociation
description: NACE Rev. 2.1 group 02.2 is mapped to NACE Rev. 2 group 02.2
Type: 1:1
Source Concept: Logging
Target Concept: http://data.europa.eu/ux2/nace2/022
in scheme: Statistical Classification of Economic Activities in the European Community, Rev. 2.1 (NACE Rev. 2.1)
top concept of: Statistical Classification of Economic Activities in the European Community, Rev. 2.1 (NACE Rev. 2.1)
Mapping Cardinality: 1 1

ConceptNoneRandom0.522273278020526
type: ConceptAssociation
description: NACE Rev. 2.1 class 25.91 is mapped to NACE Rev. 2 class 25.91
Type: 1:1
Source Concept: Manufacture of steel drums and similar containers
Target Concept: http://data.europa.eu/ux2/nace2/2591
in scheme: Statistical Classification of Economic Activities in the European Community, Rev. 2.1 (NACE Rev. 2.1)
scope note: the content of the NACE Rev 2.1 class is fully covered in the corresponding NACE Rev 2 class
top concept of: Statistical Classification of Economic Activities in the European Community, Rev. 2.1 (NACE Rev. 2.1)
Mapping Cardinality: 1 1

Retail sale of carpets, rugs, wall and floor coverings
type: Concept
CoreContentNote: This class includes: - retail sale of carpets and rugs - retail sale of curtains and net curtains - retail sale of wall or floor coverings (e.g. wallpaper, tiles, laminates and vinyl flooring)
broader: Retail sale of other household equipment
in scheme: Statistical Classification of Economic Activities in the European Community, Rev. 2.1 (NACE Rev. 2.1)
Notation: 47.53
top concept of: Statistical Classification of Economic Activities in the European Community, Rev. 2.1 (NACE Rev. 2.1)

ConceptNoneRandom0.950097211202626
type: ConceptAssociation
description: NACE Rev. 2.1 class 32.20 is mapped to NACE Rev. 2 class 32.20
Type: 1:1
Source Concept: Manufacture of musical instruments
Target Concept: http://data.europa.eu/ux2/nace2/3220
in scheme: Statistical Classification of Economic Activities in the European Community, Rev. 2.1 (NACE Rev. 2.1)
scope note: the content of the NACE Rev 2.1 class is fully covered in the corresponding NACE Rev 2 class
top concept of: Statistical Classification of Economic Activities in the European Community, Rev. 2.1 (NACE Rev. 2.1)
Mapping Cardinality: 1 1

ConceptNoneRandom0.6554615359187832
type: ConceptAssociation
description: NACE Rev. 2.1 group 90.3 is mapped to NACE Rev. 2 group 90.0
Type: 26:18
Source Concept: Support activities to arts creation and performing arts
Target Concept: http://data.europa.eu/ux2/nace2/900
in scheme: Statistical Classification of Economic Activities in the European Community, Rev. 2.1 (NACE Rev. 2.1)
top concept of: Statistical Classification of Economic Activities in the European Community, Rev. 2.1 (NACE Rev. 2.1)
Mapping Cardinality: n m

Computing infrastructure, data processing, hosting and related activities
type: Concept
broader: Computing infrastructure, data processing, hosting and other information service activities
in scheme: Statistical Classification of Economic Activities in the European Community, Rev. 2.1 (NACE Rev. 2.1)
Notation: 63.1
top concept of: Statistical Classification of Economic Activities in the European Community, Rev. 2.1 (NACE Rev. 2.1)

ConceptNoneRandom0.45917716300866707
type: ConceptAssociation
description: NACE Rev. 2.1 division 13 is mapped to NACE Rev. 2 divisions 13, 18
Type: 48:49
Source Concept: Manufacture of textiles
Target Concept: http://data.europa.eu/ux2/nace2/18
Target Concept: http://data.europa.eu/ux2/nace2/13
in scheme: Statistical Classification of Economic Activities in the European Community, Rev. 2.1 (NACE Rev. 2.1)
top concept of: Statistical Classification of Economic Activities in the European Community, Rev. 2.1 (NACE Rev. 2.1)
Mapping Cardinality: n m

ConceptNoneRandom0.2880879176813903
type: ConceptAssociation
description: NACE Rev. 2.1 division 14 is mapped to NACE Rev. 2 division 14
Type: 1:1
Source Concept: Manufacture of wearing apparel
Target Concept: http://data.europa.eu/ux2/nace2/14
in scheme: Statistical Classification of Economic Activities in the European Community, Rev. 2.1 (NACE Rev. 2.1)
top concept of: Statistical Classification of Economic Activities in the European Community, Rev. 2.1 (NACE Rev. 2.1)
Mapping Cardinality: 1 1

ConceptNoneRandom0.5732212475848143
type: ConceptAssociation
description: NACE Rev. 2.1 class 13.96 is mapped to NACE Rev. 2 classes 13.20, 13.92, 13.96
Type: 4:4
Source Concept: Manufacture of other technical and industrial textiles
Target Concept: http://data.europa.eu/ux2/nace2/1392
Target Concept: http://data.europa.eu/ux2/nace2/1396
Target Concept: http://data.europa.eu/ux2/nace2/1320
in scheme: Statistical Classification of Economic Activities in the European Community, Rev. 2.1 (NACE Rev. 2.1)
scope note: 13.20: - manufacture of fabrics of glass fibres 13.92: - manufacture of tarpaulins, tents, pneumatic matresses of textile materials, sails, parachutes, textiles for blinds and sunblinds, loose covers for cars, machines or furniture 13.96: - manufacture of narrow woven fabrics, including fabrics consisting of warp without weft assembled by means of an adhesive - manufacture of labels, badges etc. - manufacture of ornamental trimmings: braids, tassels, pompons etc. - manufacture of textile fabrics impregnated, coated, covered or laminated with plastics - manufacture of metallised yarn , rubber thread and cord covered with textile material, textile yarn covered, impregnated, coated or sheathed with rubber or plastics - manufacture of tyre cord fabric of high-tenacity man-made yarn - manufacture of other treated or coated fabrics e.g. buckram and similar stiffened textile fabrics, fabrics coated with gum or amylaceous substances - manufacture of diverse textile articles e.g. textile wicks, incandescent gas mantles, tubular gas - manufacture of mantle fabric, hose piping, transmission or conveyor belts or belting (whether or not reinforced with metal or other material), bolting cloth, straining cloth - manufacture of automotive trimmings - manufacture of artists' canvas boards and tracing cloth
top concept of: Statistical Classification of Economic Activities in the European Community, Rev. 2.1 (NACE Rev. 2.1)
Mapping Cardinality: n m

ConceptNoneRandom0.09721973136394912
type: ConceptAssociation
description: NACE Rev. 2.1 class 07.29 is mapped to NACE Rev. 2 class 07.29
Type: 1:1
Source Concept: Mining of other non-ferrous metal ores
Target Concept: http://data.europa.eu/ux2/nace2/0729
in scheme: Statistical Classification of Economic Activities in the European Community, Rev. 2.1 (NACE Rev. 2.1)
scope note: the content of the NACE Rev 2.1 class is fully covered in the corresponding NACE Rev 2 class
top concept of: Statistical Classification of Economic Activities in the European Community, Rev. 2.1 (NACE Rev. 2.1)
Mapping Cardinality: 1 1

Tour operator activities
type: Concept
CoreContentNote: This class includes: - arranging, assembling and marketing packaged tours: • pre-packaged tours, domestic (national) and international • customised tour packages for groups, domestic (national) and international Package tours usually include passenger and baggage transport, accommodation, food and sightseeing services. Tour operators are engaged in the operation of tour packages that are sold by travel agencies, including arranging and assembling different services in the packaged tour. Tour operators might be employed or contracted by a travel agency, or they might operate as independent tour operators.
Exclusion Note: This class excludes: - sale of packaged tours, see 79.11
broader: Travel agency and tour operator activities
in scheme: Statistical Classification of Economic Activities in the European Community, Rev. 2.1 (NACE Rev. 2.1)
Notation: 79.12
top concept of: Statistical Classification of Economic Activities in the European Community, Rev. 2.1 (NACE Rev. 2.1)

ConceptNoneRandom0.21943128018761593
type: ConceptAssociation
description: NACE Rev. 2.1 class 46.84 is mapped to NACE Rev. 2 class 46.74
Type: 1:1
Source Concept: Wholesale of hardware, plumbing and heating equipment and supplies
Target Concept: http://data.europa.eu/ux2/nace2/4674
in scheme: Statistical Classification of Economic Activities in the European Community, Rev. 2.1 (NACE Rev. 2.1)
scope note: the content of the NACE Rev 2.1 class is fully covered in the corresponding NACE Rev 2 class
top concept of: Statistical Classification of Economic Activities in the European Community, Rev. 2.1 (NACE Rev. 2.1)
Mapping Cardinality: 1 1

Manufacture of other articles of paper and paperboard
type: Concept
CoreContentNote: This class includes: - manufacture of paper or paperboard labels - manufacture of filter paper and paperboard - manufacture of cigarette paper - manufacture of paper and paperboard bobbins, spools, cops, etc. - manufacture of egg trays and other moulded or pressed articles of paper pulp packaging products - manufacture of paper novelties - manufacture of paper or paperboard cards for use on Jacquard machines
Exclusion Note: This class excludes: - printing of labels, not self-manufactured, see 18.12 - manufacture of playing cards, see 32.40 - manufacture of games and toys of paper or paperboard, see 32.40 - publishing of books, newspapers and other publishing activities, except software publishing, see 58.1
broader: Manufacture of articles of paper and paperboard
in scheme: Statistical Classification of Economic Activities in the European Community, Rev. 2.1 (NACE Rev. 2.1)
Notation: 17.25
top concept of: Statistical Classification of Economic Activities in the European Community, Rev. 2.1 (NACE Rev. 2.1)

ConceptNoneRandom0.6075495392976344
type: ConceptAssociation
description: NACE Rev. 2.1 class 21.10 is mapped to NACE Rev. 2 class 21.10
Type: 1:1
Source Concept: Manufacture of basic pharmaceutical products
Target Concept: http://data.europa.eu/ux2/nace2/2110
in scheme: Statistical Classification of Economic Activities in the European Community, Rev. 2.1 (NACE Rev. 2.1)
scope note: the content of the NACE Rev 2.1 class is fully covered in the corresponding NACE Rev 2 class
top concept of: Statistical Classification of Economic Activities in the European Community, Rev. 2.1 (NACE Rev. 2.1)
Mapping Cardinality: 1 1

ConceptNoneRandom0.7841583593143273
type: ConceptAssociation
description: NACE Rev. 2.1 class 65.12 is mapped to NACE Rev. 2 class 65.12
Type: 1:1
Source Concept: Non-life insurance
Target Concept: http://data.europa.eu/ux2/nace2/6512
in scheme: Statistical Classification of Economic Activities in the European Community, Rev. 2.1 (NACE Rev. 2.1)
scope note: the content of the NACE Rev 2.1 class is fully covered in the corresponding NACE Rev 2 class
top concept of: Statistical Classification of Economic Activities in the European Community, Rev. 2.1 (NACE Rev. 2.1)
Mapping Cardinality: 1 1

ConceptNoneRandom0.7931465354307341
type: ConceptAssociation
description: NACE Rev. 2.1 group 59.1 is mapped to NACE Rev. 2 group 59.1
Type: 1:1
Source Concept: Motion picture, video and television programme activities
Target Concept: http://data.europa.eu/ux2/nace2/591
in scheme: Statistical Classification of Economic Activities in the European Community, Rev. 2.1 (NACE Rev. 2.1)
top concept of: Statistical Classification of Economic Activities in the European Community, Rev. 2.1 (NACE Rev. 2.1)
Mapping Cardinality: 1 1

ConceptNoneRandom0.9075067629055108
type: ConceptAssociation
description: NACE Rev. 2.1 class 43.33 is mapped to NACE Rev. 2 classes 43.33, 43.39
Type: 23:16
Source Concept: Floor and wall covering
Target Concept: http://data.europa.eu/ux2/nace2/4339
Target Concept: http://data.europa.eu/ux2/nace2/4333
in scheme: Statistical Classification of Economic Activities in the European Community, Rev. 2.1 (NACE Rev. 2.1)
scope note: 43.33: - laying, tiling, hanging or fitting in buildings or within other constructions of: • ceramic, concrete or cut stone wall or floor tiles, ceramic stove fitting • parquet and other wooden floor coverings, wooden wall coverings • carpets and linoleum floor coverings, including of rubber or plastic • terrazzo, marble, granite or slate floor or wall coverings • wallpaper - sanding, polishing and sealing of parquet and other wooden floor coverings - floor and wall covering for boats 43.39: - floor and wall covering in boats
top concept of: Statistical Classification of Economic Activities in the European Community, Rev. 2.1 (NACE Rev. 2.1)
Mapping Cardinality: n m

ConceptNoneRandom0.8988130467210069
type: ConceptAssociation
description: NACE Rev. 2.1 group 24.1 is mapped to NACE Rev. 2 group 24.1
Type: 1:1
Source Concept: Manufacture of basic iron and steel and of ferro-alloys
Target Concept: http://data.europa.eu/ux2/nace2/241
in scheme: Statistical Classification of Economic Activities in the European Community, Rev. 2.1 (NACE Rev. 2.1)
top concept of: Statistical Classification of Economic Activities in the European Community, Rev. 2.1 (NACE Rev. 2.1)
Mapping Cardinality: 1 1

Historical site and monument activities
type: Concept
CoreContentNote: This class includes the operation and preservation of cultural heritage places as a result of human intervention in its surroundings, from landscapes to gardens and from buildings to sites (natural and built heritage). This class includes: - operation and preservation of historical sites and buildings - operation and preservation of archaeological sites open to visitors
Exclusion Note: This class excludes: - renovation, renewal, reconstruction and retrofitting of historical and archaeological sites and buildings, see 43.99 - conservation and restoration of cultural heritage, see 91.30 - architectural activities to support the conservation and restoration of cultural heritage properties, see 71.11 - archaeological excavations, see 72.20
broader: Museum, collection, historical site and monument activities
in scheme: Statistical Classification of Economic Activities in the European Community, Rev. 2.1 (NACE Rev. 2.1)
Notation: 91.22
top concept of: Statistical Classification of Economic Activities in the European Community, Rev. 2.1 (NACE Rev. 2.1)

ConceptNoneRandom0.21610490186995313
type: ConceptAssociation
description: NACE Rev. 2.1 class 82.91 is mapped to NACE Rev. 2 classes 82.91, 82.99
Type: 78:65
Source Concept: Activities of collection agencies and credit bureaus
Target Concept: http://data.europa.eu/ux2/nace2/8291
Target Concept: http://data.europa.eu/ux2/nace2/8299
in scheme: Statistical Classification of Economic Activities in the European Community, Rev. 2.1 (NACE Rev. 2.1)
scope note: 82.91: - collection of payments for claims and remittance of payments collected to the clients, such as bill or debt collection services - compiling and provision of information, such as credit or employment history, to financial institutions, retailers and others who have a need to evaluate the creditworthiness of individuals or businesses 82.99: - repossession services
top concept of: Statistical Classification of Economic Activities in the European Community, Rev. 2.1 (NACE Rev. 2.1)
Mapping Cardinality: n m

Manufacturing n.e.c.
type: Concept
broader: Other manufacturing
in scheme: Statistical Classification of Economic Activities in the European Community, Rev. 2.1 (NACE Rev. 2.1)
Notation: 32.9
top concept of: Statistical Classification of Economic Activities in the European Community, Rev. 2.1 (NACE Rev. 2.1)

ConceptNoneRandom0.7805768815904036
type: ConceptAssociation
description: NACE Rev. 2.1 group 02.3 is mapped to NACE Rev. 2 group 02.3
Type: 1:1
Source Concept: Gathering of wild growing non-wood products
Target Concept: http://data.europa.eu/ux2/nace2/023
in scheme: Statistical Classification of Economic Activities in the European Community, Rev. 2.1 (NACE Rev. 2.1)
top concept of: Statistical Classification of Economic Activities in the European Community, Rev. 2.1 (NACE Rev. 2.1)
Mapping Cardinality: 1 1

ConceptNoneRandom0.017367308496886613
type: ConceptAssociation
description: NACE Rev. 2.1 group 28.9 is mapped to NACE Rev. 2 groups 28.2, 28.9
Type: 18:19
Source Concept: Manufacture of other special-purpose machinery
Target Concept: http://data.europa.eu/ux2/nace2/282
Target Concept: http://data.europa.eu/ux2/nace2/289
in scheme: Statistical Classification of Economic Activities in the European Community, Rev. 2.1 (NACE Rev. 2.1)
top concept of: Statistical Classification of Economic Activities in the European Community, Rev. 2.1 (NACE Rev. 2.1)
Mapping Cardinality: n m

Manufacture of abrasive products
type: Concept
Additional Content Note: This class also includes: - manufacture of natural or artificial abrasive powder or grain, on a base of textile material, of paper, of paperboard or of other materials, whether or not cut to shape or sewn or otherwise made
CoreContentNote: This class includes: - manufacture of millstones, grindstones, grinding wheels, etc., without frameworks, for grinding, sharpening, trueing or cutting, hand sharpening or polishing stones
broader: Manufacture of abrasive products and non-metallic mineral products n.e.c.
in scheme: Statistical Classification of Economic Activities in the European Community, Rev. 2.1 (NACE Rev. 2.1)
Notation: 23.91
top concept of: Statistical Classification of Economic Activities in the European Community, Rev. 2.1 (NACE Rev. 2.1)

ConceptNoneRandom0.44795067808177025
type: ConceptAssociation
description: NACE Rev. 2.1 class 25.92 is mapped to NACE Rev. 2 class 25.92
Type: 1:1
Source Concept: Manufacture of light metal packaging
Target Concept: http://data.europa.eu/ux2/nace2/2592
in scheme: Statistical Classification of Economic Activities in the European Community, Rev. 2.1 (NACE Rev. 2.1)
scope note: the content of the NACE Rev 2.1 class is fully covered in the corresponding NACE Rev 2 class
top concept of: Statistical Classification of Economic Activities in the European Community, Rev. 2.1 (NACE Rev. 2.1)
Mapping Cardinality: 1 1

Wholesale of grain, unmanufactured tobacco, seeds and animal feeds
type: Concept
CoreContentNote: This class includes: - wholesale of grains and seeds for planting - wholesale of oleaginous fruits - wholesale of unmanufactured tobacco - wholesale of livestock feed and agricultural raw materials
Exclusion Note: This class excludes: - wholesale of seeds of flowers and plants, see 46.22 - wholesale of food for pets, see 46.38 - wholesale of fertilisers and agrochemical products, see 46.85 - wholesale of textile fibres, see 46.86
broader: Wholesale of agricultural raw materials and live animals
in scheme: Statistical Classification of Economic Activities in the European Community, Rev. 2.1 (NACE Rev. 2.1)
Notation: 46.21
top concept of: Statistical Classification of Economic Activities in the European Community, Rev. 2.1 (NACE Rev. 2.1)

Retail sale of electrical household appliances
type: Concept
CoreContentNote: This class includes the retail sale of electrical household appliances.
Exclusion Note: This class excludes: - retail sale of audio and video equipment, see 47.40 - retail sale of lawnmowers, see 47.52 - retail sale of power hand tools, see 47.52
broader: Retail sale of other household equipment
in scheme: Statistical Classification of Economic Activities in the European Community, Rev. 2.1 (NACE Rev. 2.1)
Notation: 47.54
top concept of: Statistical Classification of Economic Activities in the European Community, Rev. 2.1 (NACE Rev. 2.1)

ConceptNoneRandom0.006144024759873745
type: ConceptAssociation
description: NACE Rev. 2.1 division 12 is mapped to NACE Rev. 2 division 12
Type: 1:1
Source Concept: Manufacture of tobacco products
Target Concept: http://data.europa.eu/ux2/nace2/12
in scheme: Statistical Classification of Economic Activities in the European Community, Rev. 2.1 (NACE Rev. 2.1)
top concept of: Statistical Classification of Economic Activities in the European Community, Rev. 2.1 (NACE Rev. 2.1)
Mapping Cardinality: 1 1

Manufacture of railway locomotives and rolling stock
type: Concept
Additional Content Note: This class also includes: - manufacture of mining locomotives and mine carts - manufacture of mechanical and electromechanical signalling, safety and traffic control equipment (e.g. for railways, tramways, inland waterways, roads, parking facilities, airfields) - manufacture of railway car seats
CoreContentNote: This class includes: - manufacture of electric, diesel, steam and other rail locomotives - manufacture of self-propelled railway or tramway coaches, vans and trucks - manufacture of railway or tramway maintenance or service vehicles - manufacture of railway or tramway rolling stock, not self-propelled, e.g.: • passenger coaches, goods vans, tank wagons, self-discharging vans and wagons, workshop vans, crane vans, tenders - manufacture of specialised parts of railway or tramway locomotives or of rolling stock, e.g.: • bogies, axles and wheels, brakes and parts of brakes; hooks and coupling devices, buffers and buffer parts; shock absorbers; wagon and locomotive frames; bodies; corridor connections
Exclusion Note: This class excludes: - manufacture of unassembled rails, see 24.10 - manufacture of assembled railway or tramway track fixtures and fittings, see 25.99 - manufacture of electric motors not for motor vehicles, see 27.11 - manufacture of electrical signalling, safety or traffic-control equipment for railways or tramways, see 27.90 - manufacture of engines and turbines, except motor vehicle, aircraft and motorcycle engines, see 28.11 - manufacture of railway engines, see 28.11
broader: Manufacture of railway locomotives and rolling stock
in scheme: Statistical Classification of Economic Activities in the European Community, Rev. 2.1 (NACE Rev. 2.1)
Notation: 30.20
top concept of: Statistical Classification of Economic Activities in the European Community, Rev. 2.1 (NACE Rev. 2.1)

Manufacture of grain mill products
type: Concept
CoreContentNote: This class includes: - grain milling: production of flour, semolina, groats, meal or pellets of wheat, rye, oats, maize (corn) or other cereal grains - rice milling: production of husked, milled, polished, glazed, parboiled or converted rice; production of rice flour - vegetable milling: production of flour or meal of dried leguminous vegetables, of roots or tubers, or of edible nuts - manufacture of cereal breakfast foods - manufacture of flour mixes and prepared blended flour and dough for bread, cakes, biscuits, pancakes, etc.
Exclusion Note: This class excludes: - preparation of crops for primary markets (e.g. cleaning, trimming, grading etc.), see 01.63 - grain drying on a fee or contract basis, see 01.63 - manufacture of potato flour and meal, see 10.31 - wet corn milling, see 10.62
broader: Manufacture of grain mill products, starches and starch products
in scheme: Statistical Classification of Economic Activities in the European Community, Rev. 2.1 (NACE Rev. 2.1)
Notation: 10.61
top concept of: Statistical Classification of Economic Activities in the European Community, Rev. 2.1 (NACE Rev. 2.1)

ConceptNoneRandom0.9620102121301616
type: ConceptAssociation
description: NACE Rev. 2.1 class 13.95 is mapped to NACE Rev. 2 class 13.95
Type: 1:1
Source Concept: Manufacture of non-wovens and non-woven articles
Target Concept: http://data.europa.eu/ux2/nace2/1395
in scheme: Statistical Classification of Economic Activities in the European Community, Rev. 2.1 (NACE Rev. 2.1)
scope note: the content of the NACE Rev 2.1 class is fully covered in the corresponding NACE Rev 2 class
top concept of: Statistical Classification of Economic Activities in the European Community, Rev. 2.1 (NACE Rev. 2.1)
Mapping Cardinality: 1 1

Travel agency activities
type: Concept
Additional Content Note: This class also includes: - intermediation of packaged travel services in the destination
CoreContentNote: This class includes: - activities of agencies, primarily engaged in the sale of packaged tours and cruises to the general public or to commercial clients, alongside additional accommodation advice or expertise: • reservation services for pre-packaged tours, domestic (national) and international • reservation services for customised tour packages for groups, domestic (national) or international - intermediation service activities for the conclusion of contracts for the provision of tourist services from tour operators
Exclusion Note: This class excludes: - intermediation service activities for passenger transport only, see 52.32 - intermediation service activities for accommodation only, see 55.40 - activities of factual and legal actions related to the conclusion of contracts for the provision of tourist services, at the request of the customer, see division 69 - selling of deferred travel services: form of distribution of a service linked to travel, which can be of any nature (hotels, restaurants, personal care, leisure activities, etc.), see 82.99
broader: Travel agency and tour operator activities
in scheme: Statistical Classification of Economic Activities in the European Community, Rev. 2.1 (NACE Rev. 2.1)
Notation: 79.11
top concept of: Statistical Classification of Economic Activities in the European Community, Rev. 2.1 (NACE Rev. 2.1)

ConceptNoneRandom0.9746091398906231
type: ConceptAssociation
description: NACE Rev. 2.1 class 65.11 is mapped to NACE Rev. 2 class 65.11
Type: 1:1
Source Concept: Life insurance
Target Concept: http://data.europa.eu/ux2/nace2/6511
in scheme: Statistical Classification of Economic Activities in the European Community, Rev. 2.1 (NACE Rev. 2.1)
scope note: the content of the NACE Rev 2.1 class is fully covered in the corresponding NACE Rev 2 class
top concept of: Statistical Classification of Economic Activities in the European Community, Rev. 2.1 (NACE Rev. 2.1)
Mapping Cardinality: 1 1

Manufacture of wallpaper
type: Concept
CoreContentNote: This class includes: - manufacture of wallpaper and similar wall coverings, including vinyl-coated and textile wallpaper
Exclusion Note: This class excludes: - manufacture of paper or paperboard, see 17.12 - manufacture of plastic wallpaper, see 22.26
broader: Manufacture of articles of paper and paperboard
in scheme: Statistical Classification of Economic Activities in the European Community, Rev. 2.1 (NACE Rev. 2.1)
Notation: 17.24
top concept of: Statistical Classification of Economic Activities in the European Community, Rev. 2.1 (NACE Rev. 2.1)

Activities auxiliary to insurance and pension funding n.e.c.
type: Concept
Additional Content Note: This class also includes: - financial supervisory activities for insurance and pension funding (not by the central bank)
CoreContentNote: This class includes: - activities involved in or closely related to insurance and pension funding, except financial intermediation, claims adjusting and activities of insurance agents: • salvage administration • actuarial services • pension and insurance advisory activities • administration of financial markets for insurance and pension funding
Exclusion Note: This class excludes: - marine salvage activities, see 52.22 - publishing of insurance software/applications, see 58.29
broader: Activities auxiliary to insurance and pension funding
in scheme: Statistical Classification of Economic Activities in the European Community, Rev. 2.1 (NACE Rev. 2.1)
Notation: 66.29
top concept of: Statistical Classification of Economic Activities in the European Community, Rev. 2.1 (NACE Rev. 2.1)

ConceptNoneRandom0.6731238460748512
type: ConceptAssociation
description: NACE Rev. 2.1 class 46.85 is mapped to NACE Rev. 2 class 46.75
Type: 1:1
Source Concept: Wholesale of chemical products
Target Concept: http://data.europa.eu/ux2/nace2/4675
in scheme: Statistical Classification of Economic Activities in the European Community, Rev. 2.1 (NACE Rev. 2.1)
scope note: the content of the NACE Rev 2.1 class is fully covered in the corresponding NACE Rev 2 class
top concept of: Statistical Classification of Economic Activities in the European Community, Rev. 2.1 (NACE Rev. 2.1)
Mapping Cardinality: 1 1

ConceptNoneRandom0.08577377616792436
type: ConceptAssociation
description: NACE Rev. 2.1 group 59.2 is mapped to NACE Rev. 2 group 59.2
Type: 1:1
Source Concept: Sound recording and music publishing activities
Target Concept: http://data.europa.eu/ux2/nace2/592
in scheme: Statistical Classification of Economic Activities in the European Community, Rev. 2.1 (NACE Rev. 2.1)
top concept of: Statistical Classification of Economic Activities in the European Community, Rev. 2.1 (NACE Rev. 2.1)
Mapping Cardinality: 1 1

ConceptNoneRandom0.4569829893130847
type: ConceptAssociation
description: NACE Rev. 2.1 class 43.34 is mapped to NACE Rev. 2 classes 43.34, 43.39
Type: 23:16
Source Concept: Painting and glazing
Target Concept: http://data.europa.eu/ux2/nace2/4339
Target Concept: http://data.europa.eu/ux2/nace2/4334
in scheme: Statistical Classification of Economic Activities in the European Community, Rev. 2.1 (NACE Rev. 2.1)
scope note: 43.34: - interior and exterior painting of buildings - painting of civil engineering structures - installation of glass, mirrors, etc. - coating of metals on buildings and civil engineering structures - interior painting and glazing of boats 43.39: - painting and glazing of interior in boats
top concept of: Statistical Classification of Economic Activities in the European Community, Rev. 2.1 (NACE Rev. 2.1)
Mapping Cardinality: n m

Provision of domestic personal service activities
type: Concept
CoreContentNote: This class includes the provision of a range of domestic personal service activities like cooking, washing, cleaning and ironing services, at home for households. When only one activity is performed it is classified according to this activity.
Exclusion Note: This class excludes: - cleaning of buildings, see 81.21 - home care services for older persons, including live-in care services, see 88.10 - day-care activities for children provided in private homes or day-care centres, see 88.91 - after-school care services, see 88.91
broader: Other personal service activities
in scheme: Statistical Classification of Economic Activities in the European Community, Rev. 2.1 (NACE Rev. 2.1)
Notation: 96.91
top concept of: Statistical Classification of Economic Activities in the European Community, Rev. 2.1 (NACE Rev. 2.1)

Pension funding
type: Concept
CoreContentNote: This class includes the provision of retirement income benefits exclusively for the sponsor’s employees or members and other insurance products regulated as employer-related funds. It includes pension plans with defined benefits as well as defined contributions. This class includes: - provision of employee benefit plans - provision of pension funds and plans - provision of retirement plans
Exclusion Note: This class excludes: - management of pension funds, see 66.30 - compulsory social security schemes, see 84.30
broader: Pension funding
in scheme: Statistical Classification of Economic Activities in the European Community, Rev. 2.1 (NACE Rev. 2.1)
Notation: 65.30
top concept of: Statistical Classification of Economic Activities in the European Community, Rev. 2.1 (NACE Rev. 2.1)

Manufacture of other food products
type: Concept
CoreContentNote: This group includes the production of sugar and confectionery, prepared meals and dishes, coffee, tea and spices.
broader: Manufacture of food products
in scheme: Statistical Classification of Economic Activities in the European Community, Rev. 2.1 (NACE Rev. 2.1)
Notation: 10.8
top concept of: Statistical Classification of Economic Activities in the European Community, Rev. 2.1 (NACE Rev. 2.1)

ConceptNoneRandom0.996298522945475
type: ConceptAssociation
description: NACE Rev. 2.1 class 23.31 is mapped to NACE Rev. 2 class 23.31
Type: 1:1
Source Concept: Manufacture of ceramic tiles and flags
Target Concept: http://data.europa.eu/ux2/nace2/2331
in scheme: Statistical Classification of Economic Activities in the European Community, Rev. 2.1 (NACE Rev. 2.1)
scope note: the content of the NACE Rev 2.1 class is fully covered in the corresponding NACE Rev 2 class
top concept of: Statistical Classification of Economic Activities in the European Community, Rev. 2.1 (NACE Rev. 2.1)
Mapping Cardinality: 1 1

ConceptNoneRandom0.9002223257489742
type: ConceptAssociation
description: NACE Rev. 2.1 class 94.99 is mapped to NACE Rev. 2 class 94.99
Type: 1:1
Source Concept: Activities of other membership organisations n.e.c.
Target Concept: http://data.europa.eu/ux2/nace2/9499
in scheme: Statistical Classification of Economic Activities in the European Community, Rev. 2.1 (NACE Rev. 2.1)
scope note: the content of the NACE Rev 2.1 class is fully covered in the corresponding NACE Rev 2 class
top concept of: Statistical Classification of Economic Activities in the European Community, Rev. 2.1 (NACE Rev. 2.1)
Mapping Cardinality: 1 1

ConceptNoneRandom0.2334655849602918
type: ConceptAssociation
description: NACE Rev. 2.1 group 94.1 is mapped to NACE Rev. 2 group 94.1
Type: 1:1
Source Concept: Activities of business, employers and professional membership organisations
Target Concept: http://data.europa.eu/ux2/nace2/941
in scheme: Statistical Classification of Economic Activities in the European Community, Rev. 2.1 (NACE Rev. 2.1)
top concept of: Statistical Classification of Economic Activities in the European Community, Rev. 2.1 (NACE Rev. 2.1)
Mapping Cardinality: 1 1

ConceptNoneRandom0.13290044152142988
type: ConceptAssociation
description: NACE Rev. 2.1 group 85.6 is mapped to NACE Rev. 2 groups 82.9, 85.6
Type: 42:34
Source Concept: Educational support activities
Target Concept: http://data.europa.eu/ux2/nace2/856
Target Concept: http://data.europa.eu/ux2/nace2/829
in scheme: Statistical Classification of Economic Activities in the European Community, Rev. 2.1 (NACE Rev. 2.1)
top concept of: Statistical Classification of Economic Activities in the European Community, Rev. 2.1 (NACE Rev. 2.1)
Mapping Cardinality: n m

Processing and finishing of plastic products
type: Concept
Additional Content Note: This class also includes: - cladding of metal pipes with plastics - welding of plastic tanks and pipes - metal coating of plastics
CoreContentNote: This class includes general activities for the processing and finishing of plastic products, typically carried out on a fee or contract basis: - processing of plastics (e.g. by cutting, chamfering, turning, milling, drilling, threading by computer numerical control (CNC) or other machineries) - bending, gluing and welding of plastic materials - processing of plastic surfaces (e.g. by engraving, sandblasting, microblasting, polishing) - coating of plastic surfaces (e.g. painting, varnishing and metallisation of plastics)
Exclusion Note: This class excludes: - plastic coating of metal surfaces, see 25.51
broader: Manufacture of plastic products
in scheme: Statistical Classification of Economic Activities in the European Community, Rev. 2.1 (NACE Rev. 2.1)
Notation: 22.25
top concept of: Statistical Classification of Economic Activities in the European Community, Rev. 2.1 (NACE Rev. 2.1)

ConceptNoneRandom0.47448196286606614
type: ConceptAssociation
description: NACE Rev. 2.1 class 33.11 is mapped to NACE Rev. 2 class 33.11
Type: 10:9
Source Concept: Repair and maintenance of fabricated metal products
Target Concept: http://data.europa.eu/ux2/nace2/3311
in scheme: Statistical Classification of Economic Activities in the European Community, Rev. 2.1 (NACE Rev. 2.1)
scope note: the content of the NACE Rev 2.1 class is fully covered in the corresponding NACE Rev 2 class
top concept of: Statistical Classification of Economic Activities in the European Community, Rev. 2.1 (NACE Rev. 2.1)
Mapping Cardinality: n m

Other specialised construction activities n.e.c.
type: Concept
Additional Content Note: This class also includes: - renovation, renewal, reconstruction and retrofitting of historical and archaeological sites and buildings
CoreContentNote: This class includes: - construction activities specialising in one aspect common to different kinds of structures, requiring specialised skill or equipment, n.e.c.: • reinforcement steel bending activities, at the construction site • scaffolds and work platform erecting and dismantling - erection of construction site safety equipment - work with specialist access requirements necessitating climbing skills and the use of related equipment (e.g. working at height on tall structures) - rental of cranes and other building equipment which cannot be allocated to a specific construction type, with an operator - repairing of reinforced concrete structures (e.g. beams, columns) - erection of billboards or advertising columns - concreting works
Exclusion Note: This class excludes: - rental of scaffolds and work platforms, without erection and dismantling, see 77.32 - rental of construction machinery and equipment without an operator, see 77.32
broader: Other specialised construction activities
in scheme: Statistical Classification of Economic Activities in the European Community, Rev. 2.1 (NACE Rev. 2.1)
Notation: 43.99
top concept of: Statistical Classification of Economic Activities in the European Community, Rev. 2.1 (NACE Rev. 2.1)

Lead, zinc and tin production
type: Concept
Additional Content Note: This class also includes: - manufacture of zinc powder by atomisation of molten zinc
CoreContentNote: This class includes: - production of unwrought lead, zinc and tin, alloyed or not alloyed, from ores or from lead, zinc or tin waste and scrap - manufacture of bars, rods, profiles, wire, plates, sheets, strip and foil of lead, zinc or tin
Exclusion Note: This class excludes: - casting of lead, zinc or tin, see 24.54 - shredding of lead, zinc or tin waste and scrap, see 38.21
broader: Manufacture of basic precious and other non-ferrous metals
in scheme: Statistical Classification of Economic Activities in the European Community, Rev. 2.1 (NACE Rev. 2.1)
Notation: 24.43
top concept of: Statistical Classification of Economic Activities in the European Community, Rev. 2.1 (NACE Rev. 2.1)

Manufacture of other plastic products
type: Concept
Additional Content Note: This class also includes: - manufacture of plastic equipment for cleaning
CoreContentNote: This class includes: - manufacture of plastic tableware, kitchenware and toilet articles - manufacture of diverse plastic products, e.g.: • plastic headgear excluding safety headgear, insulating fittings, parts of light fittings, office or school supplies, articles of apparel, fittings for furniture, statuettes, transmission and conveyer belts, plastic shoe-lasts, plastic cigar and cigarette holders, combs, plastic hair curlers, plastic novelties - manufacture of products from polymer clay
Exclusion Note: This class excludes: - manufacture of plastic luggage, see 15.12 - manufacture of plastic footwear, see 15.20 - manufacture of plastic furniture, see 31.00 - manufacture of mattresses of uncovered cellular plastic, see 31.00 - manufacture of plastic sports requisites, see 32.30 - manufacture of plastic games and toys, see 32.40 - manufacture of plastic medical and dental appliances, see 32.50 - manufacture of plastic ophthalmic goods, see 32.50 - manufacture of plastic safety headgear and other personal safety equipment of plastics, see 32.99
broader: Manufacture of plastic products
in scheme: Statistical Classification of Economic Activities in the European Community, Rev. 2.1 (NACE Rev. 2.1)
Notation: 22.26
top concept of: Statistical Classification of Economic Activities in the European Community, Rev. 2.1 (NACE Rev. 2.1)

Other professional, scientific and technical activities
type: Concept
CoreContentNote: This division includes the provision of professional, scientific and technical services (except legal and accounting activities; architecture and engineering activities; technical testing and analysis; management and management consultancy activities; research and development; and advertising activities).
broader: PROFESSIONAL, SCIENTIFIC AND TECHNICAL ACTIVITIES
in scheme: Statistical Classification of Economic Activities in the European Community, Rev. 2.1 (NACE Rev. 2.1)
Notation: 74
top concept of: Statistical Classification of Economic Activities in the European Community, Rev. 2.1 (NACE Rev. 2.1)

ConceptNoneRandom0.9243280064551618
type: ConceptAssociation
description: NACE Rev. 2.1 class 46.42 is mapped to NACE Rev. 2 class 46.42
Type: 1:1
Source Concept: Wholesale of clothing and footwear
Target Concept: http://data.europa.eu/ux2/nace2/4642
in scheme: Statistical Classification of Economic Activities in the European Community, Rev. 2.1 (NACE Rev. 2.1)
scope note: the content of the NACE Rev 2.1 class is fully covered in the corresponding NACE Rev 2 class
top concept of: Statistical Classification of Economic Activities in the European Community, Rev. 2.1 (NACE Rev. 2.1)
Mapping Cardinality: 1 1

ConceptNoneRandom0.9852482309424191
type: ConceptAssociation
description: NACE Rev. 2.1 class 47.75 is mapped to NACE Rev. 2 classes 47.75, 47.89, 47.91, 47.99
Type: 78:65
Source Concept: Retail sale of cosmetic and toilet articles
Target Concept: http://data.europa.eu/ux2/nace2/4791
Target Concept: http://data.europa.eu/ux2/nace2/4799
Target Concept: http://data.europa.eu/ux2/nace2/4789
Target Concept: http://data.europa.eu/ux2/nace2/4775
in scheme: Statistical Classification of Economic Activities in the European Community, Rev. 2.1 (NACE Rev. 2.1)
scope note: 47.75: - retail sale of perfumery, cosmetic, toiletries, personal care products etc. 47.89: - retail sale via stalls and markets of perfumery, cosmetic, toiletries, personal care products etc. 47.91: - retail sale via mail order houses or via Internet of perfumery, cosmetic, toiletries, personal care products etc. 47.99: - retail sale not in stores, stalls or markets of perfumery, cosmetic, toiletries, personal care products etc.
top concept of: Statistical Classification of Economic Activities in the European Community, Rev. 2.1 (NACE Rev. 2.1)
Mapping Cardinality: n m

ConceptNoneRandom0.9854677459814476
type: ConceptAssociation
description: NACE Rev. 2.1 class 47.77 is mapped to NACE Rev. 2 classes 47.77, 47.89, 47.91, 47.99
Type: 78:65
Source Concept: Retail sale of watches and jewellery
Target Concept: http://data.europa.eu/ux2/nace2/4791
Target Concept: http://data.europa.eu/ux2/nace2/4799
Target Concept: http://data.europa.eu/ux2/nace2/4777
Target Concept: http://data.europa.eu/ux2/nace2/4789
in scheme: Statistical Classification of Economic Activities in the European Community, Rev. 2.1 (NACE Rev. 2.1)
scope note: 47.77: - retail sale of watches and jewellery - retail sale of silverware articles 47.89: - retail sale via stalls and markets of watches and jewellery - retail sale via stalls and markets of silverware articles 47.91: - retail sale via mail order houses or via Internet of watches and jewellery - retail sale via mail order houses or via Internet of silverware articles 47.99: - retail sale not in stores, stalls or markets of watches and jewellery - retail sale not in stores, stalls or markets of silverware articles
top concept of: Statistical Classification of Economic Activities in the European Community, Rev. 2.1 (NACE Rev. 2.1)
Mapping Cardinality: n m

ConceptNoneRandom0.08573247286520103
type: ConceptAssociation
description: NACE Rev. 2.1 class 23.32 is mapped to NACE Rev. 2 class 23.32
Type: 1:1
Source Concept: Manufacture of bricks, tiles and construction products, in baked clay
Target Concept: http://data.europa.eu/ux2/nace2/2332
in scheme: Statistical Classification of Economic Activities in the European Community, Rev. 2.1 (NACE Rev. 2.1)
scope note: the content of the NACE Rev 2.1 class is fully covered in the corresponding NACE Rev 2 class
top concept of: Statistical Classification of Economic Activities in the European Community, Rev. 2.1 (NACE Rev. 2.1)
Mapping Cardinality: 1 1

Undifferentiated goods-producing activities of private households for own use
type: Concept
broader: Undifferentiated goods- and service-producing activities of private households for own use
in scheme: Statistical Classification of Economic Activities in the European Community, Rev. 2.1 (NACE Rev. 2.1)
Notation: 98.1
top concept of: Statistical Classification of Economic Activities in the European Community, Rev. 2.1 (NACE Rev. 2.1)

Manufacture of prepared animal feeds
type: Concept
broader: Manufacture of food products
in scheme: Statistical Classification of Economic Activities in the European Community, Rev. 2.1 (NACE Rev. 2.1)
Notation: 10.9
top concept of: Statistical Classification of Economic Activities in the European Community, Rev. 2.1 (NACE Rev. 2.1)

Residential nursing care activities
type: Concept
CoreContentNote: This class includes the provision of residential care, with medical assistance, nursing and rehabilitation treatments. These establishments have a permanent core staff of registered or licensed practical nurses that, along with other staff, provide nursing care in combination with personal care. The medical or nursing care services typically include administering medication, performing medical diagnoses and dressing wounds, and are chiefly provided without the supervision of a medical doctor located on the premises. This class includes activities of: - homes for older persons with nursing care - convalescent homes, other than mental health and substance abuse facilities - rest homes with nursing care - nursing care facilities - nursing homes/hospices - inpatient care hospices for palliative care
Exclusion Note: This class excludes: - palliative nursing care for outpatients, see 86.94 - activities of homes for older persons without or with only minimal nursing care, see 87.30 - provision of residential care and assistance services (e.g. orphanages, children’s boarding homes and hostels, temporary homeless shelters), see 87.99
broader: Residential nursing care activities
in scheme: Statistical Classification of Economic Activities in the European Community, Rev. 2.1 (NACE Rev. 2.1)
Notation: 87.10
top concept of: Statistical Classification of Economic Activities in the European Community, Rev. 2.1 (NACE Rev. 2.1)

ConceptNoneRandom0.36157280468324027
type: ConceptAssociation
description: NACE Rev. 2.1 group 94.2 is mapped to NACE Rev. 2 group 94.2
Type: 1:1
Source Concept: Activities of trade unions
Target Concept: http://data.europa.eu/ux2/nace2/942
in scheme: Statistical Classification of Economic Activities in the European Community, Rev. 2.1 (NACE Rev. 2.1)
top concept of: Statistical Classification of Economic Activities in the European Community, Rev. 2.1 (NACE Rev. 2.1)
Mapping Cardinality: 1 1

ConceptNoneRandom0.8286402456467524
type: ConceptAssociation
description: NACE Rev. 2.1 class 74.91 is mapped to NACE Rev. 2 class 74.90
Type: 3:2
Source Concept: Patent brokering and marketing service activities
Target Concept: http://data.europa.eu/ux2/nace2/7490
in scheme: Statistical Classification of Economic Activities in the European Community, Rev. 2.1 (NACE Rev. 2.1)
scope note: the content of the NACE Rev 2.1 class is fully covered in the corresponding NACE Rev 2 class
top concept of: Statistical Classification of Economic Activities in the European Community, Rev. 2.1 (NACE Rev. 2.1)
Mapping Cardinality: n m

Manufacture of irradiation, electromedical and electrotherapeutic equipment
type: Concept
Additional Content Note: This class also includes: - manufacture of food and milk irradiation equipment
CoreContentNote: This class includes: - manufacture of irradiation apparatus and tubes (e.g. industrial, medical diagnostic, medical therapeutic, research, scientific): • alpha, beta, gamma, X-ray or other radiation equipment - manufacture of computed tomography (CT) scanners - manufacture of positron emission tomography (PET) scanners - manufacture of magnetic resonance imaging (MRI) equipment - manufacture of medical ultrasound equipment - manufacture of electrocardiographs - manufacture of electromedical endoscopic equipment - manufacture of medical laser equipment - manufacture of artificial respiration or therapeutic respiration apparatus - manufacture of pacemakers - manufacture of hearing aids
Exclusion Note: This class excludes: - manufacture of tanning beds, see 27.90
broader: Manufacture of irradiation, electromedical and electrotherapeutic equipment
in scheme: Statistical Classification of Economic Activities in the European Community, Rev. 2.1 (NACE Rev. 2.1)
Notation: 26.60
top concept of: Statistical Classification of Economic Activities in the European Community, Rev. 2.1 (NACE Rev. 2.1)

ConceptNoneRandom0.5960316145595375
type: ConceptAssociation
description: NACE Rev. 2.1 class 35.30 is mapped to NACE Rev. 2 class 35.30
Type: 1:1
Source Concept: Steam and air conditioning supply
Target Concept: http://data.europa.eu/ux2/nace2/3530
in scheme: Statistical Classification of Economic Activities in the European Community, Rev. 2.1 (NACE Rev. 2.1)
scope note: the content of the NACE Rev 2.1 class is fully covered in the corresponding NACE Rev 2 class
top concept of: Statistical Classification of Economic Activities in the European Community, Rev. 2.1 (NACE Rev. 2.1)
Mapping Cardinality: 1 1

ConceptNoneRandom0.7261082729001852
type: ConceptAssociation
description: NACE Rev. 2.1 group 63.9 is mapped to NACE Rev. 2 groups 63.1, 63.9
Type: 42:34
Source Concept: Web search portal activities and other information service activities
Target Concept: http://data.europa.eu/ux2/nace2/631
Target Concept: http://data.europa.eu/ux2/nace2/639
in scheme: Statistical Classification of Economic Activities in the European Community, Rev. 2.1 (NACE Rev. 2.1)
top concept of: Statistical Classification of Economic Activities in the European Community, Rev. 2.1 (NACE Rev. 2.1)
Mapping Cardinality: n m

Manufacture of builders’ ware of plastic
type: Concept
Additional Content Note: This class also includes: - manufacture of sanitaryware made out of a mixture of plastics and minerals, with the minerals serving as a filler
CoreContentNote: This class includes: - manufacture of builders’ plastics ware: • skirting boards • tanks, reservoirs • plastic floor, wall or ceiling coverings in rolls or in the form of tiles, etc. • plastic sanitaryware like plastic baths, shower baths, washbasins, lavatory pans, flushing cisterns, etc. - manufacture of resilient floor coverings (e.g. vinyl, linoleum)
Exclusion Note: This class excludes: - manufacture of rubber floors, see 22.12 - manufacture of doors and windows of plastic, see 22.23
broader: Manufacture of plastic products
in scheme: Statistical Classification of Economic Activities in the European Community, Rev. 2.1 (NACE Rev. 2.1)
Notation: 22.24
top concept of: Statistical Classification of Economic Activities in the European Community, Rev. 2.1 (NACE Rev. 2.1)

ConceptNoneRandom0.09282505729445811
type: ConceptAssociation
description: NACE Rev. 2.1 class 56.22 is mapped to NACE Rev. 2 class 56.29
Type: 1:1
Source Concept: Contract catering service activities and other food service activities
Target Concept: http://data.europa.eu/ux2/nace2/5629
in scheme: Statistical Classification of Economic Activities in the European Community, Rev. 2.1 (NACE Rev. 2.1)
scope note: the content of the NACE Rev 2.1 class is fully covered in the corresponding NACE Rev 2 class
top concept of: Statistical Classification of Economic Activities in the European Community, Rev. 2.1 (NACE Rev. 2.1)
Mapping Cardinality: 1 1

Description

Aluminium production
type: Concept
Additional Content Note: This class also includes: - production of aluminium oxide (alumina)
CoreContentNote: This class includes: - production of unwrought aluminium, alloyed or not alloyed, from alumina or from aluminium waste and scrap - manufacture of aluminium bars, rods, profiles and wire - manufacture of aluminium tubes, pipes, tube and pipe fittings - manufacture of aluminium plates, sheets and strip, whether or not painted, varnished or coated with plastics - manufacture of aluminium foil, whether or not printed or backed with paper, paperboard, plastics or similar backing materials
Exclusion Note: This class excludes: - casting of aluminium and other light metals, see 24.53 - shredding of aluminium waste and scrap, see 38.21
broader: Manufacture of basic precious and other non-ferrous metals
in scheme: Statistical Classification of Economic Activities in the European Community, Rev. 2.1 (NACE Rev. 2.1)
Notation: 24.42
top concept of: Statistical Classification of Economic Activities in the European Community, Rev. 2.1 (NACE Rev. 2.1)

ConceptNoneRandom0.4387546104164318
type: ConceptAssociation
description: NACE Rev. 2.1 class 33.12 is mapped to NACE Rev. 2 class 33.12
Type: 5:4
Source Concept: Repair and maintenance of machinery
Target Concept: http://data.europa.eu/ux2/nace2/3312
in scheme: Statistical Classification of Economic Activities in the European Community, Rev. 2.1 (NACE Rev. 2.1)
scope note: the content of the NACE Rev 2.1 class is fully covered in the corresponding NACE Rev 2 class
top concept of: Statistical Classification of Economic Activities in the European Community, Rev. 2.1 (NACE Rev. 2.1)
Mapping Cardinality: n m

ConceptNoneRandom0.820383862063379
type: ConceptAssociation
description: NACE Rev. 2.1 class 62.90 is mapped to NACE Rev. 2 class 62.09
Type: 1:1
Source Concept: Other information technology and computer service activities
Target Concept: http://data.europa.eu/ux2/nace2/6209
in scheme: Statistical Classification of Economic Activities in the European Community, Rev. 2.1 (NACE Rev. 2.1)
scope note: the content of the NACE Rev 2.1 class is fully covered in the corresponding NACE Rev 2 class
top concept of: Statistical Classification of Economic Activities in the European Community, Rev. 2.1 (NACE Rev. 2.1)
Mapping Cardinality: 1 1

Veterinary activities
type: Concept
Additional Content Note: It also includes animal ambulance activities.
CoreContentNote: This division includes the provision of animal health care and control activities for farm animals or pets. These activities are carried out by qualified veterinarians in veterinary hospitals as well as when visiting farms, kennels or homes, in own consulting and surgery rooms or elsewhere.
broader: PROFESSIONAL, SCIENTIFIC AND TECHNICAL ACTIVITIES
in scheme: Statistical Classification of Economic Activities in the European Community, Rev. 2.1 (NACE Rev. 2.1)
Notation: 75
top concept of: Statistical Classification of Economic Activities in the European Community, Rev. 2.1 (NACE Rev. 2.1)

ConceptNoneRandom0.058468833229014194
type: ConceptAssociation
description: NACE Rev. 2.1 group 06.1 is mapped to NACE Rev. 2 group 06.1
Type: 1:1
Source Concept: Extraction of crude petroleum
Target Concept: http://data.europa.eu/ux2/nace2/061
in scheme: Statistical Classification of Economic Activities in the European Community, Rev. 2.1 (NACE Rev. 2.1)
top concept of: Statistical Classification of Economic Activities in the European Community, Rev. 2.1 (NACE Rev. 2.1)
Mapping Cardinality: 1 1

ConceptNoneRandom0.28456494239841157
type: ConceptAssociation
description: NACE Rev. 2.1 class 68.20 is mapped to NACE Rev. 2 class 68.20
Type: 2:2
Source Concept: Rental and operating of own or leased real estate
Target Concept: http://data.europa.eu/ux2/nace2/6820
in scheme: Statistical Classification of Economic Activities in the European Community, Rev. 2.1 (NACE Rev. 2.1)
scope note: the content of the NACE Rev 2.1 class is fully covered in the corresponding NACE Rev 2 class
top concept of: Statistical Classification of Economic Activities in the European Community, Rev. 2.1 (NACE Rev. 2.1)
Mapping Cardinality: n m

Finishing of textiles
type: Concept
Additional Content Note: This class also includes: - bleaching of jeans - pleating and similar work on textiles - waterproofing, coating, rubberising, or impregnating purchased garments - printing of textile fabrics as an intermediate process within the manufacture of textiles
CoreContentNote: This class includes finishing of textiles and wearing apparel, in other words, bleaching, dyeing, dressing and similar activities. This class includes: - bleaching and dyeing of textile fibres, yarns, fabrics and textile articles, including wearing apparel - dressing, drying, steaming, shrinking, mending, sanforising, mercerising of textiles and textile articles, including wearing apparel
Exclusion Note: This class excludes: - printing, including silkscreen printing, on textiles and wearing apparel, not as an intermediate process within the manufacture of textiles, see 18.12 - laser engraving on textiles, see 18.12 - manufacture of textile fabric impregnated, coated, covered or laminated with rubber where rubber is the primary constituent, see 22.12
broader: Finishing of textiles
in scheme: Statistical Classification of Economic Activities in the European Community, Rev. 2.1 (NACE Rev. 2.1)
Notation: 13.30
top concept of: Statistical Classification of Economic Activities in the European Community, Rev. 2.1 (NACE Rev. 2.1)

ConceptNoneRandom0.8670564049862876
type: ConceptAssociation
description: NACE Rev. 2.1 class 25.99 is mapped to NACE Rev. 2 class 25.99
Type: 1:1
Source Concept: Manufacture of other fabricated metal products n.e.c.
Target Concept: http://data.europa.eu/ux2/nace2/2599
in scheme: Statistical Classification of Economic Activities in the European Community, Rev. 2.1 (NACE Rev. 2.1)
scope note: the content of the NACE Rev 2.1 class is fully covered in the corresponding NACE Rev 2 class
top concept of: Statistical Classification of Economic Activities in the European Community, Rev. 2.1 (NACE Rev. 2.1)
Mapping Cardinality: 1 1

ConceptNoneRandom0.043626933541851765
type: ConceptAssociation
description: NACE Rev. 2.1 class 47.76 is mapped to NACE Rev. 2 classes 47.76, 47.89, 47.91, 47.99
Type: 78:65
Source Concept: Retail sale of flowers, plants, fertilisers, pets and pet food
Target Concept: http://data.europa.eu/ux2/nace2/4791
Target Concept: http://data.europa.eu/ux2/nace2/4799
Target Concept: http://data.europa.eu/ux2/nace2/4776
Target Concept: http://data.europa.eu/ux2/nace2/4789
in scheme: Statistical Classification of Economic Activities in the European Community, Rev. 2.1 (NACE Rev. 2.1)
scope note: 47.76: - retail sale of flowers and plants - retail sale of fertilisers and plant protection products - retail sale of pets and articles for pets - retail sale of food for pets and other animals kept at home for pleasure, e.g. chickens, horses - retail sale of toiletries, hygiene products, etc. for pets 47.89: - retail sale via stalls and markets of fertilisers and plant protection products - retail sale via stalls and markets of pets and articles for pets - retail sale via stalls and markets of food for pets and other animals kept at home for pleasure, e.g. chickens, horses - retail sale via stalls and markets of toiletries, hygiene products, etc. for pets 47.91: - retail sale via mail order houses or via Internet of fertilisers and plant protection products - retail sale via mail order houses or via Internet of pets and articles for pets - retail sale via mail order houses or via Internet of food for pets and other animals kept at home for pleasure, e.g. chickens, horses - retail sale via mail order houses or via Internet of toiletries, hygiene products, etc. for pets 47.99: - retail sale not in stores, stalls or markets of fertilisers and plant protection products - retail sale not in stores, stalls or markets of pets and articles for pets - retail sale not in stores, stalls or markets of food for pets and other animals kept at home for pleasure, e.g. chickens, horses - retail sale not in stores, stalls or markets of toiletries, hygiene products, etc. for pets
top concept of: Statistical Classification of Economic Activities in the European Community, Rev. 2.1 (NACE Rev. 2.1)
Mapping Cardinality: n m

ConceptNoneRandom0.23968841439038358
type: ConceptAssociation
description: NACE Rev. 2.1 class 46.43 is mapped to NACE Rev. 2 class 46.43
Type: 3:4
Source Concept: Wholesale of electrical household appliances
Target Concept: http://data.europa.eu/ux2/nace2/4643
in scheme: Statistical Classification of Economic Activities in the European Community, Rev. 2.1 (NACE Rev. 2.1)
scope note: the content of the NACE Rev 2.1 class is fully covered in the corresponding NACE Rev 2 class
top concept of: Statistical Classification of Economic Activities in the European Community, Rev. 2.1 (NACE Rev. 2.1)
Mapping Cardinality: n m

Manufacture of abrasive products and non-metallic mineral products n.e.c.
type: Concept
broader: Manufacture of other non-metallic mineral products
in scheme: Statistical Classification of Economic Activities in the European Community, Rev. 2.1 (NACE Rev. 2.1)
Notation: 23.9
top concept of: Statistical Classification of Economic Activities in the European Community, Rev. 2.1 (NACE Rev. 2.1)

ConceptNoneRandom0.9116347767125562
type: ConceptAssociation
Source Concept: Other specialised wholesale n.e.c.
in scheme: Statistical Classification of Economic Activities in the European Community, Rev. 2.1 (NACE Rev. 2.1)
scope note: NACE Rev. 2.1 class 46.89 has no link with NACE Rev. 2, since it was not possible to link it to existing classes in division 46 of NACE Rev. 2
top concept of: Statistical Classification of Economic Activities in the European Community, Rev. 2.1 (NACE Rev. 2.1)

Manufacture of grain mill products, starches and starch products
type: Concept
Additional Content Note: Also included in this group are the wet milling of corn and vegetables and the manufacture of starch and starch products. This group also includes the manufacture of gluten-free mill products.
CoreContentNote: This group includes the milling of flour or meal from grains or vegetables, the cleaning, polishing and milling of rice, as well as the micronisation and thermal processing of flour and the manufacture of flour mixes or doughs from these products.
Exclusion Note: This group excludes: - grain drying on a fee or contract basis, see 01.63
broader: Manufacture of food products
in scheme: Statistical Classification of Economic Activities in the European Community, Rev. 2.1 (NACE Rev. 2.1)
Notation: 10.6
top concept of: Statistical Classification of Economic Activities in the European Community, Rev. 2.1 (NACE Rev. 2.1)

Medical specialists activities
type: Concept
Additional Content Note: This class also includes: - family planning centres providing medical treatment (e.g. sterilisation, termination of pregnancy), without accommodation - cosmetic surgery activities performed by medical specialists - treatment in outpatient or day clinics (e.g. dialysis, chemotherapy, insulin therapy, respiratory treatment, radiation treatment) - medical analysis and interpretation of diagnostic medical images (x-ray, electrocardiograms, endoscopies, etc.) - activities provided by psychiatrists - activities of vaccination centres (immunisation, inoculation) - activities of thrombosis centres
CoreContentNote: This class includes: - medical consultation and treatment in the field of specialised medicine by medical specialists and surgeons
Exclusion Note: This class excludes: - inpatient hospital activities, see 86.10 - nursing and midwifery activities, see 86.94 - activities of physiotherapists, see 86.95 - beauty treatment activities not performed by medical specialists (e.g. by cosmetologists), see 96.22
broader: Medical and dental practice activities
in scheme: Statistical Classification of Economic Activities in the European Community, Rev. 2.1 (NACE Rev. 2.1)
Notation: 86.22
top concept of: Statistical Classification of Economic Activities in the European Community, Rev. 2.1 (NACE Rev. 2.1)

ConceptNoneRandom0.4697620958758151
type: ConceptAssociation
description: NACE Rev. 2.1 group 72.1 is mapped to NACE Rev. 2 group 72.1
Type: 1:1
Source Concept: Research and experimental development on natural sciences and engineering
Target Concept: http://data.europa.eu/ux2/nace2/721
in scheme: Statistical Classification of Economic Activities in the European Community, Rev. 2.1 (NACE Rev. 2.1)
top concept of: Statistical Classification of Economic Activities in the European Community, Rev. 2.1 (NACE Rev. 2.1)
Mapping Cardinality: 1 1

ConceptNoneRandom0.38231075783911395
type: ConceptAssociation
description: NACE Rev. 2.1 group 85.4 is mapped to NACE Rev. 2 group 85.4
Type: 2:2
Source Concept: Tertiary education
Target Concept: http://data.europa.eu/ux2/nace2/854
in scheme: Statistical Classification of Economic Activities in the European Community, Rev. 2.1 (NACE Rev. 2.1)
top concept of: Statistical Classification of Economic Activities in the European Community, Rev. 2.1 (NACE Rev. 2.1)
Mapping Cardinality: n m

Precious metals production
type: Concept
Additional Content Note: This class also includes: - manufacture of wire of precious metals by drawing - manufacture of precious metal plates, sheets, strips and foil laminates - silver recovery from waste and scrap by electrolytic refining - melting and casting of precious metal into ingots, blocks or similar forms
CoreContentNote: This class includes: - production of basic precious metals: • production and refining of unwrought or wrought precious metals: gold, silver, platinum, etc., from ore and scrap - production of precious metal alloys - production of precious metal in semi-manufactured or in powder forms - cladding of base metals with a covering of silver, gold or platinum, affixed by soldering, brazing, welding, hot-rolling or similar mechanical means
Exclusion Note: This class excludes: - casting of copper, zinc and other non-ferrous metals, see 24.54 - manufacture of precious metal jewellery, see 32.12
broader: Manufacture of basic precious and other non-ferrous metals
in scheme: Statistical Classification of Economic Activities in the European Community, Rev. 2.1 (NACE Rev. 2.1)
Notation: 24.41
top concept of: Statistical Classification of Economic Activities in the European Community, Rev. 2.1 (NACE Rev. 2.1)

ConceptNoneRandom0.24030869318933923
type: ConceptAssociation
description: NACE Rev. 2.1 group 50.3 is mapped to NACE Rev. 2 group 50.3
Type: 1:1
Source Concept: Inland passenger water transport
Target Concept: http://data.europa.eu/ux2/nace2/503
in scheme: Statistical Classification of Economic Activities in the European Community, Rev. 2.1 (NACE Rev. 2.1)
top concept of: Statistical Classification of Economic Activities in the European Community, Rev. 2.1 (NACE Rev. 2.1)
Mapping Cardinality: 1 1

Manufacture of games and toys
type: Concept
broader: Other manufacturing
in scheme: Statistical Classification of Economic Activities in the European Community, Rev. 2.1 (NACE Rev. 2.1)
Notation: 32.4
top concept of: Statistical Classification of Economic Activities in the European Community, Rev. 2.1 (NACE Rev. 2.1)

ConceptNoneRandom0.8895157663755984
type: ConceptAssociation
description: NACE Rev. 2.1 class 56.21 is mapped to NACE Rev. 2 class 56.21
Type: 1:1
Source Concept: Event catering activities
Target Concept: http://data.europa.eu/ux2/nace2/5621
in scheme: Statistical Classification of Economic Activities in the European Community, Rev. 2.1 (NACE Rev. 2.1)
scope note: the content of the NACE Rev 2.1 class is fully covered in the corresponding NACE Rev 2 class
top concept of: Statistical Classification of Economic Activities in the European Community, Rev. 2.1 (NACE Rev. 2.1)
Mapping Cardinality: 1 1

Manufacture of doors and windows of plastic
type: Concept
CoreContentNote: This class includes: - manufacture of doors, windows and their frames of plastic - manufacture of multi-material doors and windows with the frame made of plastic - manufacture of shutters, blinds (including venetian blinds) and similar articles, and parts thereof, made of plastic - manufacture of multi-material shutters for doors and windows with the frame made of plastic
broader: Manufacture of plastic products
in scheme: Statistical Classification of Economic Activities in the European Community, Rev. 2.1 (NACE Rev. 2.1)
Notation: 22.23
top concept of: Statistical Classification of Economic Activities in the European Community, Rev. 2.1 (NACE Rev. 2.1)

Undifferentiated service-producing activities of private households for own use
type: Concept
CoreContentNote: This class includes the undifferentiated subsistence service-producing activities of households. These activities include cooking, teaching, caring for household members and other services produced by the household for its own subsistence.
Exclusion Note: If households are also engaged in the production of multiple goods for subsistence purposes, they are classified to the undifferentiated subsistence goods-producing activities of households.
broader: Undifferentiated service-producing activities of private households for own use
in scheme: Statistical Classification of Economic Activities in the European Community, Rev. 2.1 (NACE Rev. 2.1)
Notation: 98.20
top concept of: Statistical Classification of Economic Activities in the European Community, Rev. 2.1 (NACE Rev. 2.1)

ConceptNoneRandom0.707337909168797
type: ConceptAssociation
description: NACE Rev. 2.1 group 19.1 is mapped to NACE Rev. 2 group 19.1
Type: 1:1
Source Concept: Manufacture of coke oven products
Target Concept: http://data.europa.eu/ux2/nace2/191
in scheme: Statistical Classification of Economic Activities in the European Community, Rev. 2.1 (NACE Rev. 2.1)
top concept of: Statistical Classification of Economic Activities in the European Community, Rev. 2.1 (NACE Rev. 2.1)
Mapping Cardinality: 1 1

ConceptNoneRandom0.46383964597621785
type: ConceptAssociation
description: NACE Rev. 2.1 class 47.73 is mapped to NACE Rev. 2 classes 47.73, 47.91
Type: 78:65
Source Concept: Retail sale of pharmaceutical products
Target Concept: http://data.europa.eu/ux2/nace2/4791
Target Concept: http://data.europa.eu/ux2/nace2/4773
in scheme: Statistical Classification of Economic Activities in the European Community, Rev. 2.1 (NACE Rev. 2.1)
scope note: 47.73: - retail sale of pharmaceuticals - retail sale of veterinary medicine - retail sale of homeopathic products and medicines without prescription - retail sale of herbal medicinal products and herbal remedies 47.91: - retail sale via mail order houses or via Internet of pharmaceuticals - retail sale via mail order houses or via Internet of veterinary medicine - retail sale via mail order houses or via Internet of homeopathic products and medicines without prescription - retail sale via mail order houses or via Internet of herbal medicinal products and herbal remedies
top concept of: Statistical Classification of Economic Activities in the European Community, Rev. 2.1 (NACE Rev. 2.1)
Mapping Cardinality: n m

ConceptNoneRandom0.34489355036138936
type: ConceptAssociation
description: NACE Rev. 2.1 class 81.21 is mapped to NACE Rev. 2 class 81.21
Type: 4:3
Source Concept: General cleaning of buildings
Target Concept: http://data.europa.eu/ux2/nace2/8121
in scheme: Statistical Classification of Economic Activities in the European Community, Rev. 2.1 (NACE Rev. 2.1)
scope note: the content of the NACE Rev 2.1 class is fully covered in the corresponding NACE Rev 2 class
top concept of: Statistical Classification of Economic Activities in the European Community, Rev. 2.1 (NACE Rev. 2.1)
Mapping Cardinality: n m

Manufacture of bakery and farinaceous products
type: Concept
Additional Content Note: This group also includes: - manufacture of gluten-free bakery and farinaceous products
CoreContentNote: This group includes the production of bakery products, macaroni, noodles and similar products.
broader: Manufacture of food products
in scheme: Statistical Classification of Economic Activities in the European Community, Rev. 2.1 (NACE Rev. 2.1)
Notation: 10.7
top concept of: Statistical Classification of Economic Activities in the European Community, Rev. 2.1 (NACE Rev. 2.1)

Manufacture of medical and dental instruments and supplies
type: Concept
broader: Other manufacturing
in scheme: Statistical Classification of Economic Activities in the European Community, Rev. 2.1 (NACE Rev. 2.1)
Notation: 32.5
top concept of: Statistical Classification of Economic Activities in the European Community, Rev. 2.1 (NACE Rev. 2.1)

Alternative name

Dental practice care activities
type: Concept
Additional Content Note: This class also includes: - dental activities in operating rooms
CoreContentNote: This class includes: - dental practice activities of a general or specialised nature (e.g. dentistry, endodontic and paediatric dentistry); oral pathology - orthodontic activities
Exclusion Note: This class excludes: - production of artificial teeth, denture and prosthetic appliances by dental laboratories, see 32.50 - inpatient hospital activities, see 86.10 - activities of dental paramedical personnel (e.g. dental hygienists, dental therapists), see 86.99
broader: Medical and dental practice activities
in scheme: Statistical Classification of Economic Activities in the European Community, Rev. 2.1 (NACE Rev. 2.1)
Notation: 86.23
top concept of: Statistical Classification of Economic Activities in the European Community, Rev. 2.1 (NACE Rev. 2.1)

ConceptNoneRandom0.10691644773078701
type: ConceptAssociation
description: NACE Rev. 2.1 group 50.4 is mapped to NACE Rev. 2 group 50.4
Type: 1:1
Source Concept: Inland freight water transport
Target Concept: http://data.europa.eu/ux2/nace2/504
in scheme: Statistical Classification of Economic Activities in the European Community, Rev. 2.1 (NACE Rev. 2.1)
top concept of: Statistical Classification of Economic Activities in the European Community, Rev. 2.1 (NACE Rev. 2.1)
Mapping Cardinality: 1 1

ConceptNoneRandom0.19772522421488725
type: ConceptAssociation
description: NACE Rev. 2.1 group 85.5 is mapped to NACE Rev. 2 group 85.5
Type: 5:5
Source Concept: Other education
Target Concept: http://data.europa.eu/ux2/nace2/855
in scheme: Statistical Classification of Economic Activities in the European Community, Rev. 2.1 (NACE Rev. 2.1)
top concept of: Statistical Classification of Economic Activities in the European Community, Rev. 2.1 (NACE Rev. 2.1)
Mapping Cardinality: n m

ConceptNoneRandom0.5110453243327947
type: ConceptAssociation
description: NACE Rev. 2.1 group 72.2 is mapped to NACE Rev. 2 group 72.2
Type: 1:1
Source Concept: Research and experimental development on social sciences and humanities
Target Concept: http://data.europa.eu/ux2/nace2/722
in scheme: Statistical Classification of Economic Activities in the European Community, Rev. 2.1 (NACE Rev. 2.1)
top concept of: Statistical Classification of Economic Activities in the European Community, Rev. 2.1 (NACE Rev. 2.1)
Mapping Cardinality: 1 1

Construction of residential and non-residential buildings
type: Concept
broader: Construction of residential and non-residential buildings
in scheme: Statistical Classification of Economic Activities in the European Community, Rev. 2.1 (NACE Rev. 2.1)
Notation: 41.0
top concept of: Statistical Classification of Economic Activities in the European Community, Rev. 2.1 (NACE Rev. 2.1)

Manufacture of plastic packing goods
type: Concept
CoreContentNote: This class includes: - manufacture of plastic articles for the packing of goods: • plastic bags, sacks, containers, boxes, cases, carboys, bottles, etc.
Exclusion Note: This class excludes: - manufacture of luggage and handbags of plastic, see 15.12
broader: Manufacture of plastic products
in scheme: Statistical Classification of Economic Activities in the European Community, Rev. 2.1 (NACE Rev. 2.1)
Notation: 22.22
top concept of: Statistical Classification of Economic Activities in the European Community, Rev. 2.1 (NACE Rev. 2.1)

Construction of utility projects for fluids
type: Concept
Additional Content Note: This class also includes: - water well drilling - geothermal drilling
CoreContentNote: This class includes the construction of utility distribution lines for the transport of fluids, including gas, and related buildings and structures that are integral part of these systems. This class includes: - construction of civil engineering structures for: • long-distance, underwater and urban pipelines • water mains and water lines • irrigation systems (canals) • reservoirs - construction of: • sewerage systems, including repair • sewage treatment and disposal plants • pumping stations
Exclusion Note: This class excludes: - installation of water and wastewater pipes in buildings, see 43.22 - project management activities related to civil engineering works, see 71.12 - camera inspections in wastewater, water and gas pipes, not associated with repair or installation, see 71.20
broader: Construction of utility projects
in scheme: Statistical Classification of Economic Activities in the European Community, Rev. 2.1 (NACE Rev. 2.1)
Notation: 42.21
top concept of: Statistical Classification of Economic Activities in the European Community, Rev. 2.1 (NACE Rev. 2.1)

Rental and leasing activities
type: Concept
CoreContentNote: This division includes the rental and leasing of tangible and non-financial intangible assets and intermediation service activities thereof. For leasing activities, only the provision of operating leases is included in this division. The renter or lessor has the economic risk for the tangible goods and non-financial intangible assets provided, whereas the intermediator has no economic risk for the tangible goods and non-financial intangible assets that are intermediated. In this division, a wide array of tangible goods is concerned (for example, automobiles, computers, consumer goods, industrial machinery and equipment), provided to customers in return for a periodic rental or lease payment.
Exclusion Note: This division excludes: - rental of equipment with an operator, see corresponding classes according to activities carried out with this equipment (e.g. construction (section F), transport (section H)) - streaming of content (e.g. software, books, by content publishers), see division 58 - audiobook streaming activities not associated with its publishing, see 60.10 - financial leasing, see 64.91 - rental of real estate, see section M
broader: ADMINISTRATIVE AND SUPPORT SERVICE ACTIVITIES
in scheme: Statistical Classification of Economic Activities in the European Community, Rev. 2.1 (NACE Rev. 2.1)
Notation: 77
top concept of: Statistical Classification of Economic Activities in the European Community, Rev. 2.1 (NACE Rev. 2.1)

ConceptNoneRandom0.8295491979169934
type: ConceptAssociation
description: NACE Rev. 2.1 class 13.99 is mapped to NACE Rev. 2 class 13.99
Type: 1:1
Source Concept: Manufacture of other textiles n.e.c.
Target Concept: http://data.europa.eu/ux2/nace2/1399
in scheme: Statistical Classification of Economic Activities in the European Community, Rev. 2.1 (NACE Rev. 2.1)
scope note: the content of the NACE Rev 2.1 class is fully covered in the corresponding NACE Rev 2 class
top concept of: Statistical Classification of Economic Activities in the European Community, Rev. 2.1 (NACE Rev. 2.1)
Mapping Cardinality: 1 1

Plant propagation
type: Concept
CoreContentNote: This class includes the production of all vegetative planting materials, including cuttings, suckers and seedlings either for direct plant propagation or to create plant grafting stock into which a selected scion is grafted for eventual planting to produce crops. This class includes: - growing of plants for planting - growing of plants for ornamental purposes, including turf for transplanting - growing of live plants for bulbs, tubers and roots, cuttings and slips, and mushroom spawn - operation of tree nurseries, except forest tree nurseries
Exclusion Note: This class excludes: - growing of plants for the purpose of seed production, see 01.1, 01.2 - operation of forest tree nurseries, see 02.10
broader: Plant propagation
in scheme: Statistical Classification of Economic Activities in the European Community, Rev. 2.1 (NACE Rev. 2.1)
Notation: 01.30
top concept of: Statistical Classification of Economic Activities in the European Community, Rev. 2.1 (NACE Rev. 2.1)

ConceptNoneRandom0.4554083616262268
type: ConceptAssociation
description: NACE Rev. 2.1 group 19.2 is mapped to NACE Rev. 2 group 19.2
Type: 1:1
Source Concept: Manufacture of refined petroleum products and fossil fuel products
Target Concept: http://data.europa.eu/ux2/nace2/192
in scheme: Statistical Classification of Economic Activities in the European Community, Rev. 2.1 (NACE Rev. 2.1)
top concept of: Statistical Classification of Economic Activities in the European Community, Rev. 2.1 (NACE Rev. 2.1)
Mapping Cardinality: 1 1

ConceptNoneRandom0.8831010243573633
type: ConceptAssociation
description: NACE Rev. 2.1 class 86.91 is mapped to NACE Rev. 2 class 86.90
Type: 7:1
Source Concept: Diagnostic imaging services and medical laboratory activities
Target Concept: http://data.europa.eu/ux2/nace2/8690
in scheme: Statistical Classification of Economic Activities in the European Community, Rev. 2.1 (NACE Rev. 2.1)
scope note: the content of the NACE Rev 2.1 class is fully covered in the corresponding NACE Rev 2 class
top concept of: Statistical Classification of Economic Activities in the European Community, Rev. 2.1 (NACE Rev. 2.1)
Mapping Cardinality: n 1

ConceptNoneRandom0.7447447332346447
type: ConceptAssociation
description: NACE Rev. 2.1 class 47.74 is mapped to NACE Rev. 2 classes 47.74, 47.78, 47.89, 47.91, 47.99
Type: 78:65
Source Concept: Retail sale of medical and orthopaedic goods
Target Concept: http://data.europa.eu/ux2/nace2/4791
Target Concept: http://data.europa.eu/ux2/nace2/4799
Target Concept: http://data.europa.eu/ux2/nace2/4778
Target Concept: http://data.europa.eu/ux2/nace2/4789
Target Concept: http://data.europa.eu/ux2/nace2/4774
in scheme: Statistical Classification of Economic Activities in the European Community, Rev. 2.1 (NACE Rev. 2.1)
scope note: 47.74: - retail sale of hearing aids - retail sale of orthopaedic footwear - retail sale of crutches and wheelchairs - retail sale of orthopaedic prostheses - retail sale of cervical collars and corsets - retail sale of elastocompressive products, e.g. elastic stockings, sleeves - retail sale of non-corrective sunglasses 47.78: - retail sale of corrective and glasses, lenses and sunglasses 47.89: - retail sale via stalls and markets of corrective glasses, lenses and sunglasses - retail sale via stalls and markets of hearing aids - retail sale via stalls and markets of orthopaedic footwear - retail sale via stalls and markets of crutches and wheelchairs - retail sale via stalls and markets of orthopaedic prostheses - retail sale via stalls and markets of cervical collars and corsets - retail sale via stalls and markets of elastocompressive products, e.g. elastic stockings, sleeves - retail sale via stalls and markets of non-corrective sunglasses 47.91: - retail sale via mail order houses or via Internet of corrective glasses, lenses and sunglasses - retail sale via mail order houses or via Internet of hearing aids - retail sale via mail order houses or via Internet of orthopaedic footwear - retail sale via mail order houses or via Internet of crutches and wheelchairs - retail sale via mail order houses or via Internet of orthopaedic prostheses - retail sale via mail order houses or via Internet of cervical collars and corsets - retail sale via mail order houses or via Internet of elastocompressive products, e.g. elastic stockings, sleeves - retail sale via mail order houses or via Internet of non-corrective sunglasses 47.99: - retail sale not in stores, stalls or markets of corrective glasses, lenses and sunglasses - retail sale not in stores, stalls or markets of hearing aids - retail sale not in stores, stalls or markets of orthopaedic footwear - retail sale not in stores, stalls or markets of crutches and wheelchairs - retail sale not in stores, stalls or markets …
top concept of: Statistical Classification of Economic Activities in the European Community, Rev. 2.1 (NACE Rev. 2.1)
Mapping Cardinality: n m

ConceptNoneRandom0.47352025384193686
type: ConceptAssociation
description: NACE Rev. 2.1 class 81.22 is mapped to NACE Rev. 2 classes 43.39, 43.99, 81.22
Type: 23:16
Source Concept: Other building and industrial cleaning activities
Target Concept: http://data.europa.eu/ux2/nace2/4339
Target Concept: http://data.europa.eu/ux2/nace2/8122
Target Concept: http://data.europa.eu/ux2/nace2/4399
in scheme: Statistical Classification of Economic Activities in the European Community, Rev. 2.1 (NACE Rev. 2.1)
scope note: 43.39: - cleaning of new buildings immediately after construction 43.99: - steam cleaning, sand blasting and similar activities for building exteriors 81.22: - exterior cleaning of buildings of all types, e.g. offices, factories, shops, schools and other institutions, other business and professional premises and multiunit residential buildings - specialised cleaning activities for businesses in the food industries, including manufacturing, retail, restaurants etc. - specialised cleaning activities for buildings, e.g. facade and window cleaning, chimney cleaning and cleaning of fireplaces, stoves, furnaces, incinerators, boilers, ventilation ducts and exhaust units - specialised industrial cleaning, e.g. cleaning of industrial machinery - cleaning of water supply pipelines - cleaning of aeraulic ducts - other specialised building and industrial cleaning activities n.e.c.
top concept of: Statistical Classification of Economic Activities in the European Community, Rev. 2.1 (NACE Rev. 2.1)
Mapping Cardinality: n m

ConceptNoneRandom0.5186016289999185
type: ConceptAssociation
description: NACE Rev. 2.1 class 46.41 is mapped to NACE Rev. 2 class 46.41
Type: 1:1
Source Concept: Wholesale of textiles
Target Concept: http://data.europa.eu/ux2/nace2/4641
in scheme: Statistical Classification of Economic Activities in the European Community, Rev. 2.1 (NACE Rev. 2.1)
scope note: the content of the NACE Rev 2.1 class is fully covered in the corresponding NACE Rev 2 class
top concept of: Statistical Classification of Economic Activities in the European Community, Rev. 2.1 (NACE Rev. 2.1)
Mapping Cardinality: 1 1

ConceptNoneRandom0.5841363524161216
type: ConceptAssociation
description: NACE Rev. 2.1 class 25.53 is mapped to NACE Rev. 2 classes 25.61, 25.62
Type: 3:2
Source Concept: Machining of metals
Target Concept: http://data.europa.eu/ux2/nace2/2561
Target Concept: http://data.europa.eu/ux2/nace2/2562
in scheme: Statistical Classification of Economic Activities in the European Community, Rev. 2.1 (NACE Rev. 2.1)
scope note: 25.61: - deburring, sandblasting, tumbling, buffing and engraving of metals 25.62: - boring, turning, milling, eroding, planing, lapping, broaching, levelling, sawing, grinding, sharpening, deburring, sandblasting, tumbling, polishing, buffing, welding, splicing etc. of metalwork pieces - cutting of and engraving or writing on metals by means of laser beams
top concept of: Statistical Classification of Economic Activities in the European Community, Rev. 2.1 (NACE Rev. 2.1)
Mapping Cardinality: n m

Cutting, shaping and finishing of stone
type: Concept
broader: Manufacture of other non-metallic mineral products
in scheme: Statistical Classification of Economic Activities in the European Community, Rev. 2.1 (NACE Rev. 2.1)
Notation: 23.7
top concept of: Statistical Classification of Economic Activities in the European Community, Rev. 2.1 (NACE Rev. 2.1)

ConceptNoneRandom0.22975120813033423
type: ConceptAssociation
description: NACE Rev. 2.1 class 46.47 is mapped to NACE Rev. 2 classes 46.47, 46.65
Type: 1:2
Source Concept: Wholesale of household, office and shop furniture, carpets and lighting equipment
Target Concept: http://data.europa.eu/ux2/nace2/4647
Target Concept: http://data.europa.eu/ux2/nace2/4665
in scheme: Statistical Classification of Economic Activities in the European Community, Rev. 2.1 (NACE Rev. 2.1)
scope note: 46.47: - wholesale of furniture - wholesale of carpets - wholesale of lighting equipment - wholesale of mattresses and box springs - wholesale of furniture for warehouses, churches, medical facilities, etc. 46.65: - wholesale of office and shop furniture
top concept of: Statistical Classification of Economic Activities in the European Community, Rev. 2.1 (NACE Rev. 2.1)
Mapping Cardinality: 1 m

ConceptNoneRandom0.7119380909054241
type: ConceptAssociation
description: NACE Rev. 2.1 class 24.20 is mapped to NACE Rev. 2 class 24.20
Type: 1:1
Source Concept: Manufacture of tubes, pipes, hollow profiles and related fittings, of steel
Target Concept: http://data.europa.eu/ux2/nace2/2420
in scheme: Statistical Classification of Economic Activities in the European Community, Rev. 2.1 (NACE Rev. 2.1)
scope note: the content of the NACE Rev 2.1 class is fully covered in the corresponding NACE Rev 2 class
top concept of: Statistical Classification of Economic Activities in the European Community, Rev. 2.1 (NACE Rev. 2.1)
Mapping Cardinality: 1 1

Intermediation service activities for non-specialised retail sale
type: Concept
Additional Content Note: This class also includes: - activities of space rental, including staff, for the retail sale of second-hand goods
CoreContentNote: This class includes intermediation service activities for non-specialised retail sale that facilitate transactions between buyers and sellers for the ordering and/or delivering of physical goods for a fee or commission, without supplying and taking ownership of the goods that are intermediated. These intermediation activities can be carried out on digital platforms or through non-digital channels (including face-to-face, door-to-door, telephone, mail, and so on). The fee or commission can be received from either the buyers or sellers. Revenue for intermediation service activities for non-specialised retail sale can include other sources of income (for example, revenues from the sale of advertising space).
Exclusion Note: This class excludes: - intermediation service activities for specialised retail sale, see 47.92
broader: Intermediation service activities for retail sale
in scheme: Statistical Classification of Economic Activities in the European Community, Rev. 2.1 (NACE Rev. 2.1)
Notation: 47.91
top concept of: Statistical Classification of Economic Activities in the European Community, Rev. 2.1 (NACE Rev. 2.1)

Manufacture of plastic plates, sheets, tubes and profiles
type: Concept
CoreContentNote: This class includes: - manufacture of semi-manufactures of plastic products: • plates, sheets, blocks, film, foil, strip, etc. - manufacture of finished plastic products: • tubes, pipes and hoses; hose and pipe fittings • cellophane film or sheet - manufacture of flexible or rigid plates and sheets of cellular polyurethane - manufacture of plastic plates, sheets, film, foil and strip, reinforced, laminated, supported or similarly combined with other materials - manufacture of self-adhesive plates, sheets, film, foil, tapes and strip of plastic
Exclusion Note: This class excludes: - manufacture of plastics in primary forms, see 20.16 - manufacture of articles of synthetic or natural rubber, see 22.1 - embedding of metal pipes with polyurethane foam and encasing with a plastic pipe (e.g. for steam and hot water supply services), see 22.25
broader: Manufacture of plastic products
in scheme: Statistical Classification of Economic Activities in the European Community, Rev. 2.1 (NACE Rev. 2.1)
Notation: 22.21
top concept of: Statistical Classification of Economic Activities in the European Community, Rev. 2.1 (NACE Rev. 2.1)

Manufacture of other electrical equipment
type: Concept
CoreContentNote: This class includes the manufacture of miscellaneous electrical equipment other than motors, generators and transformers, batteries and accumulators, wires and wiring devices, lighting equipment or domestic appliances. This class includes: - manufacture of battery chargers, solid-state - manufacture of door opening and closing devices, electrical - manufacture of electric bells - manufacture of extension cords made from purchased insulated wire - manufacture of ultrasonic cleaning machines (except laboratory and dental) - manufacture of tanning beds - manufacture of fuel cells, regulated and unregulated power supplies - manufacture of uninterruptible power supplies (UPS) - manufacture of surge suppressors (except for distribution-level voltage) - manufacture of appliance cords, extension cords, and other electrical cord sets with insulated wire and connectors - manufacture of carbon and graphite electrodes, contacts, and other electrical carbon and graphite products - manufacture of particle accelerators - manufacture of electrical capacitors, resistors, condensers and similar components - manufacture of electromagnets - manufacture of sirens - manufacture of electronic scoreboards - manufacture of electrical signs - manufacture of electrical signalling equipment (e.g. traffic lights, pedestrian signalling equipment) - manufacture of electrical insulators (except glass or porcelain) - manufacture of electrical welding and soldering equipment, including handheld soldering irons - manufacture of electroplating machinery - manufacture of on-board chargers for motor vehicles - manufacture of assembled cables, fitted with connectors - manufacture of charging facilities for cars
Exclusion Note: This class excludes: - manufacture of glass electrical insulators, see 23.15 - manufacture of porcelain electrical insulators, see 23.43 - manufacture of carbon and graphite fibres and products (except electrodes and electrical applications), see 23.99 - manufacture of electronic component-type rectifiers, voltage regulating integrated circuits, power converting integrated circuits, electronic capacitors, electronic resistors, and similar devices, see 26.11 - manufacture of photovoltaic cells, modules and panels, see 26.11 - manufacture of transformers, motors, generators, switchgear, relays and industrial controls, see 27.1 - manufacture of batteries, see 27.20 - manufacture of communication and energy wire, current-carrying and non-current-carrying wiring devices, see 27.3 - manufacture of lighting equipment, see 27.40 - manufacture of household appliances, see 27.5 - manufacture of non-electrical welding and soldering equipment, see 28.29 - manufacture of motor vehicle electrical equipment (e.g. generators, alternators, spark plugs, ignition wiring harnesses, power window and door systems, voltage regulators), see 29.31 - manufacture of inverter modules and fuel cells for cars, see 29.31
broader: Manufacture of other electrical equipment
in scheme: Statistical Classification of Economic Activities in the European Community, Rev. 2.1 (NACE Rev. 2.1)
Notation: 27.90
top concept of: Statistical Classification of Economic Activities in the European Community, Rev. 2.1 (NACE Rev. 2.1)

ConceptNoneRandom0.0318178383266704
type: ConceptAssociation
description: NACE Rev. 2.1 group 81.2 is mapped to NACE Rev. 2 groups 43.3, 43.9, 81.2
Type: 26:18
Source Concept: Cleaning activities
Target Concept: http://data.europa.eu/ux2/nace2/812
Target Concept: http://data.europa.eu/ux2/nace2/439
Target Concept: http://data.europa.eu/ux2/nace2/433
in scheme: Statistical Classification of Economic Activities in the European Community, Rev. 2.1 (NACE Rev. 2.1)
top concept of: Statistical Classification of Economic Activities in the European Community, Rev. 2.1 (NACE Rev. 2.1)
Mapping Cardinality: n m

ConceptNoneRandom0.14337128228760043
type: ConceptAssociation
description: NACE Rev. 2.1 class 90.11 is mapped to NACE Rev. 2 class 90.03
Type: 23:16
Source Concept: Literary creation and musical composition activities
Target Concept: http://data.europa.eu/ux2/nace2/9003
in scheme: Statistical Classification of Economic Activities in the European Community, Rev. 2.1 (NACE Rev. 2.1)
scope note: the content of the NACE Rev 2.1 class is fully covered in the corresponding NACE Rev 2 class
top concept of: Statistical Classification of Economic Activities in the European Community, Rev. 2.1 (NACE Rev. 2.1)
Mapping Cardinality: n m

Manufacture of musical instruments
type: Concept
broader: Other manufacturing
in scheme: Statistical Classification of Economic Activities in the European Community, Rev. 2.1 (NACE Rev. 2.1)
Notation: 32.2
top concept of: Statistical Classification of Economic Activities in the European Community, Rev. 2.1 (NACE Rev. 2.1)

Construction of utility projects for electricity and telecommunications
type: Concept
CoreContentNote: This class includes the construction of distribution lines for electricity and telecommunication and related buildings and structures that are integral part of these systems. This class includes: - construction of civil engineering structures for: • long-distance and urban communication and power lines • power plants (e.g. solar and wind energy farms) - construction of stations for distribution of electricity (e.g. for electric vehicles)
Exclusion Note: This class excludes: - construction of electricity overhead lines and conductor rails for railways, see 42.12 - construction of dams and dykes for hydroelectric power plants, see 42.91 - installation of photovoltaic systems on buildings, see 43.21 - electrical installation of accumulator chargers (e.g. for electric vehicles), see 43.21 - project management activities related to civil engineering works, see 71.12
broader: Construction of utility projects
in scheme: Statistical Classification of Economic Activities in the European Community, Rev. 2.1 (NACE Rev. 2.1)
Notation: 42.22
top concept of: Statistical Classification of Economic Activities in the European Community, Rev. 2.1 (NACE Rev. 2.1)

Manufacture of vegetable and animal oils and fats
type: Concept
CoreContentNote: This group includes the manufacture of crude and refined oils and fats from vegetable or animal materials.
Exclusion Note: This group excludes the rendering or refining of lard and edible animal fats of bovine animals, sheep, goats, pigs and poultry, see 10.1.
broader: Manufacture of food products
in scheme: Statistical Classification of Economic Activities in the European Community, Rev. 2.1 (NACE Rev. 2.1)
Notation: 10.4
top concept of: Statistical Classification of Economic Activities in the European Community, Rev. 2.1 (NACE Rev. 2.1)

Rental and leasing of construction and civil engineering machinery and equipment
type: Concept
CoreContentNote: This class includes: - rental and operating leasing of construction and civil engineering machinery and equipment without an operator: • crane lorries • scaffolds and work platforms, without erection and dismantling
Exclusion Note: This class excludes: - rental of construction and civil engineering machinery or equipment with an operator, see division 43 - rental or operating leasing of scaffolds and work platforms, including erection and dismantling, see 43.99 - rental or operating leasing of mining machinery and equipment, see 77.39
broader: Rental and leasing of other machinery, equipment and tangible goods
in scheme: Statistical Classification of Economic Activities in the European Community, Rev. 2.1 (NACE Rev. 2.1)
Notation: 77.32
top concept of: Statistical Classification of Economic Activities in the European Community, Rev. 2.1 (NACE Rev. 2.1)

ConceptNoneRandom0.9003349045232403
type: ConceptAssociation
description: NACE Rev. 2.1 class 33.16 is mapped to NACE Rev. 2 class 33.16
Type: 5:4
Source Concept: Repair and maintenance of civilian air and spacecraft
Target Concept: http://data.europa.eu/ux2/nace2/3316
in scheme: Statistical Classification of Economic Activities in the European Community, Rev. 2.1 (NACE Rev. 2.1)
scope note: the content of the NACE Rev 2.1 class is fully covered in the corresponding NACE Rev 2 class
top concept of: Statistical Classification of Economic Activities in the European Community, Rev. 2.1 (NACE Rev. 2.1)
Mapping Cardinality: n m

Activities of head offices and management consultancy
type: Concept
Additional Content Note: This division also includes: - the overseeing and managing of other units of the same enterprise or group of enterprises, i.e. the activities of head offices
CoreContentNote: This division includes the provision of advice and assistance to businesses and other organisations on management issues (for example, strategic and organisational planning; financial planning and budgeting; marketing objectives and policies; human resources policies, practices and planning; production scheduling and control planning).
broader: PROFESSIONAL, SCIENTIFIC AND TECHNICAL ACTIVITIES
in scheme: Statistical Classification of Economic Activities in the European Community, Rev. 2.1 (NACE Rev. 2.1)
Notation: 70
top concept of: Statistical Classification of Economic Activities in the European Community, Rev. 2.1 (NACE Rev. 2.1)

ConceptNoneRandom0.9478164768052783
type: ConceptAssociation
description: NACE Rev. 2.1 class 69.10 is mapped to NACE Rev. 2 class 69.10
Type: 1:1
Source Concept: Legal activities
Target Concept: http://data.europa.eu/ux2/nace2/6910
in scheme: Statistical Classification of Economic Activities in the European Community, Rev. 2.1 (NACE Rev. 2.1)
scope note: the content of the NACE Rev 2.1 class is fully covered in the corresponding NACE Rev 2 class
top concept of: Statistical Classification of Economic Activities in the European Community, Rev. 2.1 (NACE Rev. 2.1)
Mapping Cardinality: 1 1

ConceptNoneRandom0.5855906537046739
type: ConceptAssociation
description: NACE Rev. 2.1 group 28.2 is mapped to NACE Rev. 2 groups 25.2, 28.2
Type: 18:19
Source Concept: Manufacture of other general-purpose machinery
Target Concept: http://data.europa.eu/ux2/nace2/282
Target Concept: http://data.europa.eu/ux2/nace2/252
in scheme: Statistical Classification of Economic Activities in the European Community, Rev. 2.1 (NACE Rev. 2.1)
top concept of: Statistical Classification of Economic Activities in the European Community, Rev. 2.1 (NACE Rev. 2.1)
Mapping Cardinality: n m

ConceptNoneRandom0.014559679207990395
type: ConceptAssociation
description: NACE Rev. 2.1 class 02.40 is mapped to NACE Rev. 2 class 02.40
Type: 1:1
Source Concept: Support services to forestry
Target Concept: http://data.europa.eu/ux2/nace2/0240
in scheme: Statistical Classification of Economic Activities in the European Community, Rev. 2.1 (NACE Rev. 2.1)
scope note: the content of the NACE Rev 2.1 class is fully covered in the corresponding NACE Rev 2 class
top concept of: Statistical Classification of Economic Activities in the European Community, Rev. 2.1 (NACE Rev. 2.1)
Mapping Cardinality: 1 1

Operation of arts facilities and sites
type: Concept
Additional Content Note: This class also includes: - operation of music venues, music clubs and similar facilities for live performances
CoreContentNote: This class includes: - operation of arts facilities (e.g. concert halls, theatre halls, cultural centres) - operation of arts facilities which support artistic creation in visual arts
Exclusion Note: This class excludes: - retail sale of paintings and sculptures (activities of commercial art galleries), see 47.69 - activities of bars, pubs and similar facilities which predominantly serve beverages, which may include the provision of live music and dance activities, see 56.30 - operation of cinemas, see 59.14 - intermediation service activities for theatrical, sport, amusement and entertainment tickets, see 82.40 - operation of arts facilities for own ensemble, see 90.20 - operation of museums of all kinds, see 91.21 - operation of dance floors and ballrooms where beverage serving is not the main activity, see 93.29
broader: Support activities to arts creation and performing arts
in scheme: Statistical Classification of Economic Activities in the European Community, Rev. 2.1 (NACE Rev. 2.1)
Notation: 90.31
top concept of: Statistical Classification of Economic Activities in the European Community, Rev. 2.1 (NACE Rev. 2.1)

ConceptNoneRandom0.1915206984452903
type: ConceptAssociation
description: NACE Rev. 2.1 class 46.48 is mapped to NACE Rev. 2 class 46.48
Type: 1:1
Source Concept: Wholesale of watches and jewellery
Target Concept: http://data.europa.eu/ux2/nace2/4648
in scheme: Statistical Classification of Economic Activities in the European Community, Rev. 2.1 (NACE Rev. 2.1)
scope note: the content of the NACE Rev 2.1 class is fully covered in the corresponding NACE Rev 2 class
top concept of: Statistical Classification of Economic Activities in the European Community, Rev. 2.1 (NACE Rev. 2.1)
Mapping Cardinality: 1 1

Manufacture of dairy products and edible ice
type: Concept
Exclusion Note: This group excludes: - production of plant-based milk substitutes, see 11.07
broader: Manufacture of food products
in scheme: Statistical Classification of Economic Activities in the European Community, Rev. 2.1 (NACE Rev. 2.1)
Notation: 10.5
top concept of: Statistical Classification of Economic Activities in the European Community, Rev. 2.1 (NACE Rev. 2.1)

Source Concept

ConceptNoneRandom0.7700673270664097
type: ConceptAssociation
description: NACE Rev. 2.1 group 81.3 is mapped to NACE Rev. 2 group 81.3
Type: 1:1
Source Concept: Landscape service activities
Target Concept: http://data.europa.eu/ux2/nace2/813
in scheme: Statistical Classification of Economic Activities in the European Community, Rev. 2.1 (NACE Rev. 2.1)
top concept of: Statistical Classification of Economic Activities in the European Community, Rev. 2.1 (NACE Rev. 2.1)
Mapping Cardinality: 1 1

Intermediation service activities for specialised retail sale
type: Concept
CoreContentNote: This class includes intermediation service activities for specialised retail sale that facilitate transactions between buyers and sellers for the ordering and/or delivering of physical goods for a fee or commission, without supplying and taking ownership of the goods that are intermediated. These intermediation activities can be carried out on digital platforms or through non-digital channels (including face-to-face, door-to-door, telephone, mail, and so on.). The fee or commission can be received from either the buyers or sellers. Revenue for intermediation service activities for specialised retail sale can include other sources of income (for example, revenues from the sale of advertising space).
Exclusion Note: This class excludes: - retail sale of petrol in combination with electro fuels (e-fuels), if the sale of electro fuels is not predominant, see 47.30 - intermediation service activities for non-specialised retail sale, see 47.91
broader: Intermediation service activities for retail sale
in scheme: Statistical Classification of Economic Activities in the European Community, Rev. 2.1 (NACE Rev. 2.1)
Notation: 47.92
top concept of: Statistical Classification of Economic Activities in the European Community, Rev. 2.1 (NACE Rev. 2.1)

Manufacture of sports goods
type: Concept
broader: Other manufacturing
in scheme: Statistical Classification of Economic Activities in the European Community, Rev. 2.1 (NACE Rev. 2.1)
Notation: 32.3
top concept of: Statistical Classification of Economic Activities in the European Community, Rev. 2.1 (NACE Rev. 2.1)

Rental and leasing of agricultural machinery and equipment
type: Concept
CoreContentNote: This class includes: - rental and operating leasing of agricultural and forestry machinery and equipment without an operator: • rental of products produced within the manufacture of agricultural and forestry machinery (class 28.30), e.g. agricultural tractors
Exclusion Note: This class excludes: - rental of agricultural and forestry machinery or equipment with an operator, see 01.61, 02.40
broader: Rental and leasing of other machinery, equipment and tangible goods
in scheme: Statistical Classification of Economic Activities in the European Community, Rev. 2.1 (NACE Rev. 2.1)
Notation: 77.31
top concept of: Statistical Classification of Economic Activities in the European Community, Rev. 2.1 (NACE Rev. 2.1)

ConceptNoneRandom0.2548765570480319
type: ConceptAssociation
description: NACE Rev. 2.1 class 33.17 is mapped to NACE Rev. 2 classes 33.11, 33.17
Type: 10:9
Source Concept: Repair and maintenance of other civilian transport equipment
Target Concept: http://data.europa.eu/ux2/nace2/3317
Target Concept: http://data.europa.eu/ux2/nace2/3311
in scheme: Statistical Classification of Economic Activities in the European Community, Rev. 2.1 (NACE Rev. 2.1)
scope note: 33.11: - repair and maintenance of shopping carts 33.17: - repair and maintenance of locomotives and the conversion of railway cars - repair of animal-drawn buggies and wagons - repair and maintenance of vehicles for the disabled - repair of hand-propelled or animal-drawn vehicles
top concept of: Statistical Classification of Economic Activities in the European Community, Rev. 2.1 (NACE Rev. 2.1)
Mapping Cardinality: n m

ConceptNoneRandom0.10342622922325562
type: ConceptAssociation
description: NACE Rev. 2.1 division 19 is mapped to NACE Rev. 2 division 19
Type: 1:1
Source Concept: Manufacture of coke and refined petroleum products
Target Concept: http://data.europa.eu/ux2/nace2/19
in scheme: Statistical Classification of Economic Activities in the European Community, Rev. 2.1 (NACE Rev. 2.1)
top concept of: Statistical Classification of Economic Activities in the European Community, Rev. 2.1 (NACE Rev. 2.1)
Mapping Cardinality: 1 1

Architectural and engineering activities; technical testing and analysis
type: Concept
Additional Content Note: This division also includes the performance of physical, chemical and other analytical testing services, and the provision of technical certification services.
CoreContentNote: This division includes the provision of architectural services, engineering services, drafting services, building inspection services, and surveying and mapping services.
broader: PROFESSIONAL, SCIENTIFIC AND TECHNICAL ACTIVITIES
in scheme: Statistical Classification of Economic Activities in the European Community, Rev. 2.1 (NACE Rev. 2.1)
Notation: 71
top concept of: Statistical Classification of Economic Activities in the European Community, Rev. 2.1 (NACE Rev. 2.1)

ConceptNoneRandom0.16957544226606736
type: ConceptAssociation
description: NACE Rev. 2.1 class 49.50 is mapped to NACE Rev. 2 class 49.50
Type: 1:1
Source Concept: Transport via pipeline
Target Concept: http://data.europa.eu/ux2/nace2/4950
in scheme: Statistical Classification of Economic Activities in the European Community, Rev. 2.1 (NACE Rev. 2.1)
scope note: the content of the NACE Rev 2.1 class is fully covered in the corresponding NACE Rev 2 class
top concept of: Statistical Classification of Economic Activities in the European Community, Rev. 2.1 (NACE Rev. 2.1)
Mapping Cardinality: 1 1

ConceptNoneRandom0.6621522199493036
type: ConceptAssociation
description: NACE Rev. 2.1 group 28.3 is mapped to NACE Rev. 2 groups 28.3, 28.9
Type: 18:19
Source Concept: Manufacture of agricultural and forestry machinery
Target Concept: http://data.europa.eu/ux2/nace2/283
Target Concept: http://data.europa.eu/ux2/nace2/289
in scheme: Statistical Classification of Economic Activities in the European Community, Rev. 2.1 (NACE Rev. 2.1)
top concept of: Statistical Classification of Economic Activities in the European Community, Rev. 2.1 (NACE Rev. 2.1)
Mapping Cardinality: n m

ConceptNoneRandom0.18790239443202228
type: ConceptAssociation
description: NACE Rev. 2.1 class 47.78 is mapped to NACE Rev. 2 classes 47.78, 47.89, 47.91, 47.99
Type: 78:65
Source Concept: Retail sale of other new goods
Target Concept: http://data.europa.eu/ux2/nace2/4791
Target Concept: http://data.europa.eu/ux2/nace2/4799
Target Concept: http://data.europa.eu/ux2/nace2/4778
Target Concept: http://data.europa.eu/ux2/nace2/4789
in scheme: Statistical Classification of Economic Activities in the European Community, Rev. 2.1 (NACE Rev. 2.1)
scope note: 47.78: - retail sale of photographic, and precision equipment - retail sale of optical equipment (excluding spectacles and lenses) such as telescopes, microscopes, binoculars - retail sale of household fuel oil, bottled gas, coal and fuel wood, pellets of wood or biomass - retail sale of packaging articles - retail sale of funeral and cemetery articles, e.g. urns, tombstones - retail sale of imitation jewellery - retail sale of cleaning products (detergents, sponges, etc.) - retail sale of souvenirs, craftwork and religious articles - retail sale of non-food products n.e.c. - retail sale of artificial flowers and plants 47.89: - retail sale via stalls and markets of photographic, and precision equipment - retail sale via stalls and markets of optical equipment, excluding spectacles and lenses, e.g. telescopes, microscopes, binoculars - retail sale via stalls and markets of household fuel oil, bottled gas, coal and fuel wood, pellets of wood or biomass - retail sale via stalls and markets of packaging articles - retail sale via stalls and markets of funeral and cemetery articles, e.g. urns, tombstones - retail sale via stalls and markets of imitation jewellery - retail sale via stalls and markets of cleaning products, e.g. detergents, sponges - retail sale via stalls and markets of souvenirs, craftwork and religious articles - retail sale via stalls and markets of non-food products n.e.c. - retail sale via stalls and markets of artificial flowers and plants 47.91: - retail sale via mail order houses or via Internet of photographic, and precision equipment - retail sale via mail order houses or via Internet of optical equipment, excluding spectacles and lenses, e.g. telescopes, microscopes, binoculars - retail sale via mail order houses or via Internet of household fuel oil, bottled gas, coal and fuel wood, pellets of wood or biomass - retail sale via mail order houses or via Internet of packaging articles - retail sale via mail order houses or via Internet of funeral…
top concept of: Statistical Classification of Economic Activities in the European Community, Rev. 2.1 (NACE Rev. 2.1)
Mapping Cardinality: n m

ConceptNoneRandom0.6441287018553415
type: ConceptAssociation
description: NACE Rev. 2.1 class 46.45 is mapped to NACE Rev. 2 class 46.45
Type: 1:1
Source Concept: Wholesale of perfume and cosmetics
Target Concept: http://data.europa.eu/ux2/nace2/4645
in scheme: Statistical Classification of Economic Activities in the European Community, Rev. 2.1 (NACE Rev. 2.1)
scope note: the content of the NACE Rev 2.1 class is fully covered in the corresponding NACE Rev 2 class
top concept of: Statistical Classification of Economic Activities in the European Community, Rev. 2.1 (NACE Rev. 2.1)
Mapping Cardinality: 1 1

ConceptNoneRandom0.715694320473376
type: ConceptAssociation
description: NACE Rev. 2.1 class 25.51 is mapped to NACE Rev. 2 class 25.61
Type: 3:2
Source Concept: Coating of metals
Target Concept: http://data.europa.eu/ux2/nace2/2561
in scheme: Statistical Classification of Economic Activities in the European Community, Rev. 2.1 (NACE Rev. 2.1)
scope note: the content of the NACE Rev 2.1 class is fully covered in the corresponding NACE Rev 2 class
top concept of: Statistical Classification of Economic Activities in the European Community, Rev. 2.1 (NACE Rev. 2.1)
Mapping Cardinality: n m

Hunting, trapping and related service activities
type: Concept
broader: Crop and animal production, hunting and related service activities
in scheme: Statistical Classification of Economic Activities in the European Community, Rev. 2.1 (NACE Rev. 2.1)
Notation: 01.7
top concept of: Statistical Classification of Economic Activities in the European Community, Rev. 2.1 (NACE Rev. 2.1)

Risk and damage evaluation
type: Concept
CoreContentNote: This class includes the provision of administration services of insurance, for example: - assessing insurance claims • claims adjusting • risk assessing • risk and damage evaluation • average and loss adjusting - settling insurance claims
Exclusion Note: This class excludes: - appraisal of real estate, see 68.31 - appraisal for other purposes, see 74.99 - investigation activities, see 80.01
broader: Activities auxiliary to insurance and pension funding
in scheme: Statistical Classification of Economic Activities in the European Community, Rev. 2.1 (NACE Rev. 2.1)
Notation: 66.21
top concept of: Statistical Classification of Economic Activities in the European Community, Rev. 2.1 (NACE Rev. 2.1)

ConceptNoneRandom0.2635347287464148
type: ConceptAssociation
description: NACE Rev. 2.1 class 90.13 is mapped to NACE Rev. 2 class 90.03
Type: 23:16
Source Concept: Other arts creation activities
Target Concept: http://data.europa.eu/ux2/nace2/9003
in scheme: Statistical Classification of Economic Activities in the European Community, Rev. 2.1 (NACE Rev. 2.1)
scope note: the content of the NACE Rev 2.1 class is fully covered in the corresponding NACE Rev 2 class
top concept of: Statistical Classification of Economic Activities in the European Community, Rev. 2.1 (NACE Rev. 2.1)
Mapping Cardinality: n m

Manufacture of lime and plaster
type: Concept
Additional Content Note: This class also includes: - manufacture of calcined or sintered dolomite
CoreContentNote: This class includes: - manufacture of quicklime, slaked lime and hydraulic lime - manufacture of plasters of calcined gypsum or calcium sulphate
Exclusion Note: This class excludes: - manufacture of pure calcium oxide and calcium hydroxide, see 20.12 - manufacture of articles of plaster, see 23.62, 23.66
broader: Manufacture of cement, lime and plaster
in scheme: Statistical Classification of Economic Activities in the European Community, Rev. 2.1 (NACE Rev. 2.1)
Notation: 23.52
top concept of: Statistical Classification of Economic Activities in the European Community, Rev. 2.1 (NACE Rev. 2.1)

Manufacture of cement, lime and plaster
type: Concept
broader: Manufacture of other non-metallic mineral products
in scheme: Statistical Classification of Economic Activities in the European Community, Rev. 2.1 (NACE Rev. 2.1)
Notation: 23.5
top concept of: Statistical Classification of Economic Activities in the European Community, Rev. 2.1 (NACE Rev. 2.1)

ConceptNoneRandom0.16299383151698188
type: ConceptAssociation
description: NACE Rev. 2.1 class 33.13 is mapped to NACE Rev. 2 class 33.13
Type: 1:1
Source Concept: Repair and maintenance of electronic and optical equipment
Target Concept: http://data.europa.eu/ux2/nace2/3313
in scheme: Statistical Classification of Economic Activities in the European Community, Rev. 2.1 (NACE Rev. 2.1)
scope note: the content of the NACE Rev 2.1 class is fully covered in the corresponding NACE Rev 2 class
top concept of: Statistical Classification of Economic Activities in the European Community, Rev. 2.1 (NACE Rev. 2.1)
Mapping Cardinality: 1 1

Processing and preserving of fish, crustaceans and molluscs
type: Concept
broader: Manufacture of food products
in scheme: Statistical Classification of Economic Activities in the European Community, Rev. 2.1 (NACE Rev. 2.1)
Notation: 10.2
top concept of: Statistical Classification of Economic Activities in the European Community, Rev. 2.1 (NACE Rev. 2.1)

ConceptNoneRandom0.9841638714526966
type: ConceptAssociation
description: NACE Rev. 2.1 class 33.14 is mapped to NACE Rev. 2 class 33.14
Type: 1:1
Source Concept: Repair and maintenance of electrical equipment
Target Concept: http://data.europa.eu/ux2/nace2/3314
in scheme: Statistical Classification of Economic Activities in the European Community, Rev. 2.1 (NACE Rev. 2.1)
scope note: the content of the NACE Rev 2.1 class is fully covered in the corresponding NACE Rev 2 class
top concept of: Statistical Classification of Economic Activities in the European Community, Rev. 2.1 (NACE Rev. 2.1)
Mapping Cardinality: 1 1

Rental and leasing of water transport equipment
type: Concept
CoreContentNote: This class includes: - rental and operating leasing of water transport equipment without an operator: • commercial boats, ships and hovercraft
Exclusion Note: This class excludes: - rental of water transport equipment with an operator, see division 50 - rental of pleasure boats without an operator, see 77.21
broader: Rental and leasing of other machinery, equipment and tangible goods
in scheme: Statistical Classification of Economic Activities in the European Community, Rev. 2.1 (NACE Rev. 2.1)
Notation: 77.34
top concept of: Statistical Classification of Economic Activities in the European Community, Rev. 2.1 (NACE Rev. 2.1)

ConceptNoneRandom0.9415301139085509
type: ConceptAssociation
description: NACE Rev. 2.1 group 06.2 is mapped to NACE Rev. 2 group 06.2
Type: 1:1
Source Concept: Extraction of natural gas
Target Concept: http://data.europa.eu/ux2/nace2/062
in scheme: Statistical Classification of Economic Activities in the European Community, Rev. 2.1 (NACE Rev. 2.1)
top concept of: Statistical Classification of Economic Activities in the European Community, Rev. 2.1 (NACE Rev. 2.1)
Mapping Cardinality: 1 1

Scientific research and development
type: Concept
Additional Content Note: This division also includes: - developing and producing prototypes with the primary objective to make further improvements, whether or not associated with its production
CoreContentNote: This division includes the activities of three types of research and development: (1) basic research: experimental or theoretical work undertaken primarily to acquire new knowledge of the underlying foundations of phenomena and observable facts, without particular application or use in view; (2) applied research: original investigation undertaken in order to acquire new knowledge, directed primarily towards a specific practical aim or objective; and (3) experimental development: systematic work, drawing on existing knowledge gained from research and/or practical experience, directed to producing new materials, products and devices, to installing new processes, systems and services, and to improving substantially those already produced or installed. Research and experimental development activities in this division are not to be regarded as ancillary activities. They are subdivided into the two following categories: natural sciences and engineering; social sciences and the humanities.
Exclusion Note: This division excludes: - market research and public opinion polling, see 73.20
broader: PROFESSIONAL, SCIENTIFIC AND TECHNICAL ACTIVITIES
in scheme: Statistical Classification of Economic Activities in the European Community, Rev. 2.1 (NACE Rev. 2.1)
Notation: 72
top concept of: Statistical Classification of Economic Activities in the European Community, Rev. 2.1 (NACE Rev. 2.1)

Processing and preserving of fish, crustaceans and molluscs
type: Concept
Additional Content Note: This class also includes: - activities of factory vessels not engaged in fishing and only in the processing and preserving of fish - processing of seaweed - removing fish heads, gutting and cutting fish into pieces, and then freezing
CoreContentNote: This class includes: - preparation and preservation of fish, crustaceans and molluscs (e.g. freezing, deep-freezing, drying, cooking, smoking, salting, immersing in brine, canning) - production of fish, crustacean and mollusc products: fish fillets, roes, caviar, caviar substitutes, etc. - production of fishmeal for human consumption or animal feed - production of meals and solubles from fish and other aquatic animals unfit for human consumption
Exclusion Note: This class excludes: - processing and preserving of fish on vessels engaged in fishing, see 03.11 - processing of whales on land or specialised vessels, see 10.11 - production of oils and fats of fish and marine mammals, see 10.41 - manufacture of prepared fish dishes, see 10.85 - manufacture of fish soups, see 10.89
broader: Processing and preserving of fish, crustaceans and molluscs
in scheme: Statistical Classification of Economic Activities in the European Community, Rev. 2.1 (NACE Rev. 2.1)
Notation: 10.20
top concept of: Statistical Classification of Economic Activities in the European Community, Rev. 2.1 (NACE Rev. 2.1)

ConceptNoneRandom0.9537807205757162
type: ConceptAssociation
description: NACE Rev. 2.1 class 46.44 is mapped to NACE Rev. 2 class 46.44
Type: 1:1
Source Concept: Wholesale of china and glassware and cleaning materials
Target Concept: http://data.europa.eu/ux2/nace2/4644
in scheme: Statistical Classification of Economic Activities in the European Community, Rev. 2.1 (NACE Rev. 2.1)
scope note: the content of the NACE Rev 2.1 class is fully covered in the corresponding NACE Rev 2 class
top concept of: Statistical Classification of Economic Activities in the European Community, Rev. 2.1 (NACE Rev. 2.1)
Mapping Cardinality: 1 1

Intermediation service activities for food and beverage services activities
type: Concept
Additional Content Note: This class also includes: - reservation services for restaurants
CoreContentNote: This class includes the intermediation of food and beverage services by bringing clients and service providers together for a fee or commission without the intermediary providing the food and beverage services intermediated. These intermediation activities can be carried out on digital platforms or through non-digital channels (including face-to-face, door-to-door, telephone, post, and so on). The fee or commission can be received from either the client or the provider of the food and beverage service. Revenue for the intermediation activities can include other sources of income (for example, revenues from the sale of advertising space).
Exclusion Note: This class excludes: - operation of online platforms to allow people to book a food delivery, see 53.30
broader: Intermediation service activities for food and beverage services activities
in scheme: Statistical Classification of Economic Activities in the European Community, Rev. 2.1 (NACE Rev. 2.1)
Notation: 56.40
top concept of: Statistical Classification of Economic Activities in the European Community, Rev. 2.1 (NACE Rev. 2.1)

ConceptNoneRandom0.40620261786285716
type: ConceptAssociation
description: NACE Rev. 2.1 class 46.46 is mapped to NACE Rev. 2 class 46.46
Type: 1:1
Source Concept: Wholesale of pharmaceutical and medical goods
Target Concept: http://data.europa.eu/ux2/nace2/4646
in scheme: Statistical Classification of Economic Activities in the European Community, Rev. 2.1 (NACE Rev. 2.1)
scope note: the content of the NACE Rev 2.1 class is fully covered in the corresponding NACE Rev 2 class
top concept of: Statistical Classification of Economic Activities in the European Community, Rev. 2.1 (NACE Rev. 2.1)
Mapping Cardinality: 1 1

ConceptNoneRandom0.44241868314512256
type: ConceptAssociation
description: NACE Rev. 2.1 class 25.52 is mapped to NACE Rev. 2 class 25.61
Type: 3:2
Source Concept: Heat treatment of metals
Target Concept: http://data.europa.eu/ux2/nace2/2561
in scheme: Statistical Classification of Economic Activities in the European Community, Rev. 2.1 (NACE Rev. 2.1)
scope note: the content of the NACE Rev 2.1 class is fully covered in the corresponding NACE Rev 2 class
top concept of: Statistical Classification of Economic Activities in the European Community, Rev. 2.1 (NACE Rev. 2.1)
Mapping Cardinality: n m

ConceptNoneRandom0.0023468375430762967
type: ConceptAssociation
description: NACE Rev. 2.1 class 47.79 is mapped to NACE Rev. 2 classes 47.79, 47.82, 47.89, 47.91, 47.99
Type: 78:65
Source Concept: Retail sale of second-hand goods
Target Concept: http://data.europa.eu/ux2/nace2/4791
Target Concept: http://data.europa.eu/ux2/nace2/4782
Target Concept: http://data.europa.eu/ux2/nace2/4799
Target Concept: http://data.europa.eu/ux2/nace2/4779
Target Concept: http://data.europa.eu/ux2/nace2/4789
in scheme: Statistical Classification of Economic Activities in the European Community, Rev. 2.1 (NACE Rev. 2.1)
scope note: 47.79: - retail sale of second-hand books in stores - retail sale of antiques in stores - retail sale of other second-hand goods in stores - retail sale of second-hand clothes in stores 47.82: - retail sale via stalls and markets of second-hand textiles and clothes 47.89: - retail sale via stalls and markets of second-hand books - retail sale via stalls and markets of antiques - retail sale via stalls and markets of second-hand furniture - retail sale via stalls and markets of second-hand household appliances - retail sale via stalls and markets of other second-hand goods 47.91: - retail sale via mail order houses or via Internet of second-hand books - retail sale via mail order houses or via Internet of antiques - retail sale via mail order houses or via Internet of second-hand clothes - retail sale via mail order houses or via Internet of second-hand furniture - retail sale via mail order houses or via Internet of second-hand household appliances - retail sale via mail order houses or via Internet of other second-hand goods 47.99: - retail sale not in stores, stalls or markets of second-hand books - retail sale not in stores, stalls or markets of antiques - retail sale not in stores, stalls or markets of second-hand clothes - retail sale not in stores, stalls or markets of second-hand furniture - retail sale not in stores, stalls or markets of second-hand household appliances - retail sale not in stores, stalls or markets of other second-hand goods
top concept of: Statistical Classification of Economic Activities in the European Community, Rev. 2.1 (NACE Rev. 2.1)
Mapping Cardinality: n m

Depth

ConceptNoneRandom0.21327636544868123
type: ConceptAssociation
description: NACE Rev. 2.1 group 81.1 is mapped to NACE Rev. 2 group 81.1
Type: 1:1
Source Concept: Combined facilities support activities
Target Concept: http://data.europa.eu/ux2/nace2/811
in scheme: Statistical Classification of Economic Activities in the European Community, Rev. 2.1 (NACE Rev. 2.1)
top concept of: Statistical Classification of Economic Activities in the European Community, Rev. 2.1 (NACE Rev. 2.1)
Mapping Cardinality: 1 1

Manufacture of cement
type: Concept
CoreContentNote: This class includes: - manufacture of clinker and hydraulic cements, including Portland cement, aluminous cement, slag cement, supersulphate cement and similar hydraulic cements, whether or not coloured or in the form of clinker
Exclusion Note: This class excludes: - manufacture of refractory mortars, concrete, etc., see 23.20 - manufacture of ready-mixed and dry-mix concrete and mortars, see 23.63, 23.64 - manufacture of articles of cement, see 23.65, 23.66 - manufacture of cements used in dentistry, see 32.50
broader: Manufacture of cement, lime and plaster
in scheme: Statistical Classification of Economic Activities in the European Community, Rev. 2.1 (NACE Rev. 2.1)
Notation: 23.51
top concept of: Statistical Classification of Economic Activities in the European Community, Rev. 2.1 (NACE Rev. 2.1)

ConceptNoneRandom0.9266902952644144
type: ConceptAssociation
description: NACE Rev. 2.1 class 90.12 is mapped to NACE Rev. 2 class 90.03
Type: 23:16
Source Concept: Visual arts creation activities
Target Concept: http://data.europa.eu/ux2/nace2/9003
in scheme: Statistical Classification of Economic Activities in the European Community, Rev. 2.1 (NACE Rev. 2.1)
scope note: the content of the NACE Rev 2.1 class is fully covered in the corresponding NACE Rev 2 class
top concept of: Statistical Classification of Economic Activities in the European Community, Rev. 2.1 (NACE Rev. 2.1)
Mapping Cardinality: n m

Wholesale of agricultural machinery, equipment and supplies
type: Concept
Additional Content Note: This class also includes: - wholesale of garden and landscaping equipment (e.g. lawn mowers)
CoreContentNote: This class includes: - wholesale of agricultural and forestry machinery and equipment: • ploughs, manure spreaders, seeders • harvesters • threshers • milking machines • poultry-keeping machines, bee-keeping equipment • agricultural and forestry tractors
Exclusion Note: This class excludes: - wholesale of livestock feed, see 46.21 - wholesale of fertilisers and agrochemical products, see 46.85
broader: Wholesale of other machinery, equipment and supplies
in scheme: Statistical Classification of Economic Activities in the European Community, Rev. 2.1 (NACE Rev. 2.1)
Notation: 46.61
top concept of: Statistical Classification of Economic Activities in the European Community, Rev. 2.1 (NACE Rev. 2.1)

Processing and preserving of fruit and vegetables
type: Concept
broader: Manufacture of food products
in scheme: Statistical Classification of Economic Activities in the European Community, Rev. 2.1 (NACE Rev. 2.1)
Notation: 10.3
top concept of: Statistical Classification of Economic Activities in the European Community, Rev. 2.1 (NACE Rev. 2.1)

Manufacture of articles of concrete, cement and plaster
type: Concept
broader: Manufacture of other non-metallic mineral products
in scheme: Statistical Classification of Economic Activities in the European Community, Rev. 2.1 (NACE Rev. 2.1)
Notation: 23.6
top concept of: Statistical Classification of Economic Activities in the European Community, Rev. 2.1 (NACE Rev. 2.1)

Manufacture of jewellery, bijouterie and related articles
type: Concept
CoreContentNote: This group includes the manufacture of jewellery and imitation jewellery articles.
broader: Other manufacturing
in scheme: Statistical Classification of Economic Activities in the European Community, Rev. 2.1 (NACE Rev. 2.1)
Notation: 32.1
top concept of: Statistical Classification of Economic Activities in the European Community, Rev. 2.1 (NACE Rev. 2.1)

Manufacture of other non-metallic mineral products n.e.c.
type: Concept
CoreContentNote: This class includes: - manufacture of friction material and unmounted articles thereof with a base of mineral substances or of cellulose - manufacture of mineral insulating materials, e.g.: • slag wool, rock wool and similar mineral wools; exfoliated vermiculite, expanded clays and similar heat-insulating, sound-insulating or sound-absorbing materials - manufacture of articles of diverse mineral substances, e.g.: • worked mica and articles of mica, of peat, of graphite (other than electrical articles) - manufacture of articles of asphalt or similar material (e.g. petroleum bitumen or coal tar pitch) - manufacture of carbon and graphite fibres and products (except electrodes and electrical applications) - manufacture of artificial corundum
Exclusion Note: This class excludes: - manufacture of glass wool and non-woven glass wool products, see 23.14 - manufacture of graphite electrodes, see 27.90 - manufacture of carbon or graphite gaskets, see 28.29
broader: Manufacture of abrasive products and non-metallic mineral products n.e.c.
in scheme: Statistical Classification of Economic Activities in the European Community, Rev. 2.1 (NACE Rev. 2.1)
Notation: 23.99
top concept of: Statistical Classification of Economic Activities in the European Community, Rev. 2.1 (NACE Rev. 2.1)

ConceptNoneRandom0.14135667472887659
type: ConceptAssociation
description: NACE Rev. 2.1 class 33.15 is mapped to NACE Rev. 2 classes 33.12, 33.15
Type: 5:4
Source Concept: Repair and maintenance of civilian ships and boats
Target Concept: http://data.europa.eu/ux2/nace2/3315
Target Concept: http://data.europa.eu/ux2/nace2/3312
in scheme: Statistical Classification of Economic Activities in the European Community, Rev. 2.1 (NACE Rev. 2.1)
scope note: 33.12: - repair and maintenance of civilian ship and boat engines, including electric outboard motors 33.15: - repair and routine maintenance of civilian ships - repair and maintenance of pleasure boats - repair and maintenance of floating structures
top concept of: Statistical Classification of Economic Activities in the European Community, Rev. 2.1 (NACE Rev. 2.1)
Mapping Cardinality: n m

Activities of advertising, market research and public relations
type: Concept
CoreContentNote: This division includes the creation of advertising campaigns and placement of such advertising in periodicals, newspapers, radio, television, over the internet or other media, as well as the design of display structures and sites. These advertising activities are often provided via advertising agencies and media representatives. This division also includes market and opinion research (for example on the attitudes, values and behaviour of the population and of various socio-demographic and socio-economic groups with regard to economic, social and political issues). It also includes public relations and communication activities.
Exclusion Note: This division excludes: - activities by which income is generated by advertising are classified according to the actual activity (e.g. publishing of advertising newspapers) - sale of advertising time or space directly by owners of the time or space (publishers, etc.), see the corresponding activity class
broader: PROFESSIONAL, SCIENTIFIC AND TECHNICAL ACTIVITIES
in scheme: Statistical Classification of Economic Activities in the European Community, Rev. 2.1 (NACE Rev. 2.1)
Notation: 73
top concept of: Statistical Classification of Economic Activities in the European Community, Rev. 2.1 (NACE Rev. 2.1)

Rental and leasing of office machinery, equipment and computers
type: Concept
CoreContentNote: This class includes: - rental and operating leasing of office machinery and equipment without an operator: • computers and computer peripheral equipment • duplicating machines, typewriters and word-processing machines • accounting machinery and equipment: cash registers, electronic calculators, etc. • office furniture
broader: Rental and leasing of other machinery, equipment and tangible goods
in scheme: Statistical Classification of Economic Activities in the European Community, Rev. 2.1 (NACE Rev. 2.1)
Notation: 77.33
top concept of: Statistical Classification of Economic Activities in the European Community, Rev. 2.1 (NACE Rev. 2.1)

ConceptNoneRandom0.42847641811455883
type: ConceptAssociation
description: NACE Rev. 2.1 class 47.30 is mapped to NACE Rev. 2 class 47.30
Type: 78:65
Source Concept: Retail sale of automotive fuel
Target Concept: http://data.europa.eu/ux2/nace2/4730
in scheme: Statistical Classification of Economic Activities in the European Community, Rev. 2.1 (NACE Rev. 2.1)
scope note: the content of the NACE Rev 2.1 class is fully covered in the corresponding NACE Rev 2 class
top concept of: Statistical Classification of Economic Activities in the European Community, Rev. 2.1 (NACE Rev. 2.1)
Mapping Cardinality: n m

ConceptNoneRandom0.87259192737634
type: ConceptAssociation
description: NACE Rev. 2.1 class 82.99 is mapped to NACE Rev. 2 class 82.99
Type: 78:65
Source Concept: Other business support service activities n.e.c.
Target Concept: http://data.europa.eu/ux2/nace2/8299
in scheme: Statistical Classification of Economic Activities in the European Community, Rev. 2.1 (NACE Rev. 2.1)
scope note: the content of the NACE Rev 2.1 class is fully covered in the corresponding NACE Rev 2 class
top concept of: Statistical Classification of Economic Activities in the European Community, Rev. 2.1 (NACE Rev. 2.1)
Mapping Cardinality: n m

ConceptNoneRandom0.08382907967707309
type: ConceptAssociation
description: NACE Rev. 2.1 group 28.1 is mapped to NACE Rev. 2 group 28.1
Type: 18:19
Source Concept: Manufacture of general-purpose machinery
Target Concept: http://data.europa.eu/ux2/nace2/281
in scheme: Statistical Classification of Economic Activities in the European Community, Rev. 2.1 (NACE Rev. 2.1)
top concept of: Statistical Classification of Economic Activities in the European Community, Rev. 2.1 (NACE Rev. 2.1)
Mapping Cardinality: n m

ConceptNoneRandom0.7963322870969592
type: ConceptAssociation
description: NACE Rev. 2.1 class 30.92 is mapped to NACE Rev. 2 classes 30.91, 30.92
Type: 8:9
Source Concept: Manufacture of bicycles and invalid carriages
Target Concept: http://data.europa.eu/ux2/nace2/3092
Target Concept: http://data.europa.eu/ux2/nace2/3091
in scheme: Statistical Classification of Economic Activities in the European Community, Rev. 2.1 (NACE Rev. 2.1)
scope note: 30.91: - manufacture of bicycles with an auxiliary electric motor 30.92: - manufacture of non-motorised bicycles and other cycles, including (delivery) tricycles, tandems, children's bicycles and tricycles - manufacture of parts and accessories of bicycles, e.g. frames, forks, wheel rims and spokes, hubs, brakes, saddles, pedals, crank-gear and derailleur gears - manufacture of carriages for disabled persons with or without motor - manufacture of parts and accessories of carriages for disabled persons - manufacture of personal transporters, e.g. electric skateboard and kick scooters - manufacture of baby carriages and parts thereof
top concept of: Statistical Classification of Economic Activities in the European Community, Rev. 2.1 (NACE Rev. 2.1)
Mapping Cardinality: n m

ConceptNoneRandom0.37746630524381986
type: ConceptAssociation
description: NACE Rev. 2.1 class 01.12 is mapped to NACE Rev. 2 class 01.12
Type: 1:1
Source Concept: Growing of rice
Target Concept: http://data.europa.eu/ux2/nace2/0112
in scheme: Statistical Classification of Economic Activities in the European Community, Rev. 2.1 (NACE Rev. 2.1)
scope note: the content of the NACE Rev 2.1 class is fully covered in the corresponding NACE Rev 2 class
top concept of: Statistical Classification of Economic Activities in the European Community, Rev. 2.1 (NACE Rev. 2.1)
Mapping Cardinality: 1 1

ConceptNoneRandom0.031999869545523585
type: ConceptAssociation
description: NACE Rev. 2.1 group 64.2 is mapped to NACE Rev. 2 groups 64.2, 64.9
Type: 2:2
Source Concept: Activities of holding companies and financing conduits
Target Concept: http://data.europa.eu/ux2/nace2/649
Target Concept: http://data.europa.eu/ux2/nace2/642
in scheme: Statistical Classification of Economic Activities in the European Community, Rev. 2.1 (NACE Rev. 2.1)
top concept of: Statistical Classification of Economic Activities in the European Community, Rev. 2.1 (NACE Rev. 2.1)
Mapping Cardinality: n m

ConceptNoneRandom0.4443748651538707
type: ConceptAssociation
description: NACE Rev. 2.1 class 94.11 is mapped to NACE Rev. 2 class 94.11
Type: 1:1
Source Concept: Activities of business and employers membership organisations
Target Concept: http://data.europa.eu/ux2/nace2/9411
in scheme: Statistical Classification of Economic Activities in the European Community, Rev. 2.1 (NACE Rev. 2.1)
scope note: the content of the NACE Rev 2.1 class is fully covered in the corresponding NACE Rev 2 class
top concept of: Statistical Classification of Economic Activities in the European Community, Rev. 2.1 (NACE Rev. 2.1)
Mapping Cardinality: 1 1

ConceptNoneRandom0.6929455046387467
type: ConceptAssociation
description: NACE Rev. 2.1 class 03.30 is mapped to NACE Rev. 2 classes 03.11, 03.12, 03.21, 03.22, 33.11
Type: 10:9
Source Concept: Support activities for fishing and aquaculture
Target Concept: http://data.europa.eu/ux2/nace2/0312
Target Concept: http://data.europa.eu/ux2/nace2/0322
Target Concept: http://data.europa.eu/ux2/nace2/0311
Target Concept: http://data.europa.eu/ux2/nace2/0321
Target Concept: http://data.europa.eu/ux2/nace2/3311
in scheme: Statistical Classification of Economic Activities in the European Community, Rev. 2.1 (NACE Rev. 2.1)
scope note: 03.11: - service activities incidental to marine fishery e.g.: • other support activities on fishing n.e.c. - marine fishery (fishery guard) control 03.12: - service activities incidental to freshwater fishery e.g.: • other support activities on fishing n.e.c. - freshwater fishery (fishery guard) control 03.21: - service activities incidental to marine aquaculture e.g.: • other support activities on aquaculture n.e.c. - marine aquaculture control 03.22: - service activities incidental to freshwater aquaculture e.g.: • other support activities on aquaculture n.e.c. - freshwater aquaculture control 33.11: - repair and maintenance service activities for fish cages
top concept of: Statistical Classification of Economic Activities in the European Community, Rev. 2.1 (NACE Rev. 2.1)
Mapping Cardinality: n m

ConceptNoneRandom0.684111156216484
type: ConceptAssociation
description: NACE Rev. 2.1 group 77.5 is mapped to NACE Rev. 2 groups 79.1, 79.9, 82.9
Type: 42:34
Source Concept: Intermediation service activities for rental and leasing of tangible goods and non-financial intangible assets
Target Concept: http://data.europa.eu/ux2/nace2/799
Target Concept: http://data.europa.eu/ux2/nace2/791
Target Concept: http://data.europa.eu/ux2/nace2/829
in scheme: Statistical Classification of Economic Activities in the European Community, Rev. 2.1 (NACE Rev. 2.1)
top concept of: Statistical Classification of Economic Activities in the European Community, Rev. 2.1 (NACE Rev. 2.1)
Mapping Cardinality: n m

ConceptNoneRandom0.8098507672444163
type: ConceptAssociation
description: NACE Rev. 2.1 group 20.6 is mapped to NACE Rev. 2 group 20.6
Type: 1:1
Source Concept: Manufacture of man-made fibres
Target Concept: http://data.europa.eu/ux2/nace2/206
in scheme: Statistical Classification of Economic Activities in the European Community, Rev. 2.1 (NACE Rev. 2.1)
top concept of: Statistical Classification of Economic Activities in the European Community, Rev. 2.1 (NACE Rev. 2.1)
Mapping Cardinality: 1 1

Retail sale of other household equipment
type: Concept
CoreContentNote: This group includes the specialised retail sale of household equipment (for example, textiles, hardware, carpets, electrical appliances, furniture).
Exclusion Note: This group excludes: - retail sale of audio and video equipment, see 47.40 - retail sale of second-hand household equipment, see 47.79
broader: Retail trade
in scheme: Statistical Classification of Economic Activities in the European Community, Rev. 2.1 (NACE Rev. 2.1)
Notation: 47.5
top concept of: Statistical Classification of Economic Activities in the European Community, Rev. 2.1 (NACE Rev. 2.1)

Growing of fibre crops
type: Concept
CoreContentNote: This class includes growing of fibre crops, e.g.: - growing of cotton - growing of jute, kenaf and other textile bast fibres - growing of flax and hemp - growing of sisal and other textile fibre of the genus agave - growing of abaca, ramie and other vegetable textile fibres
broader: Growing of non-perennial crops
in scheme: Statistical Classification of Economic Activities in the European Community, Rev. 2.1 (NACE Rev. 2.1)
Notation: 01.16
top concept of: Statistical Classification of Economic Activities in the European Community, Rev. 2.1 (NACE Rev. 2.1)

Manufacture of rubber and plastic products
type: Concept
Additional Content Note: This division also includes the manufacture of products of composite materials in which plastic is the predominant material.
CoreContentNote: This division includes the manufacture of rubber and plastic products. This division is characterised by the raw materials used in the manufacturing process. However, this does not imply that the manufacture of all products made of these materials is classified here.
broader: MANUFACTURING
in scheme: Statistical Classification of Economic Activities in the European Community, Rev. 2.1 (NACE Rev. 2.1)
Notation: 22
top concept of: Statistical Classification of Economic Activities in the European Community, Rev. 2.1 (NACE Rev. 2.1)

ConceptNoneRandom0.5429847991807211
type: ConceptAssociation
description: NACE Rev. 2.1 class 86.96 is mapped to NACE Rev. 2 class 86.90
Type: 7:1
Source Concept: Traditional, complementary and alternative medicine activities
Target Concept: http://data.europa.eu/ux2/nace2/8690
in scheme: Statistical Classification of Economic Activities in the European Community, Rev. 2.1 (NACE Rev. 2.1)
scope note: the content of the NACE Rev 2.1 class is fully covered in the corresponding NACE Rev 2 class
top concept of: Statistical Classification of Economic Activities in the European Community, Rev. 2.1 (NACE Rev. 2.1)
Mapping Cardinality: n 1

Amusement and recreation activities n.e.c.
type: Concept
Additional Content Note: This class also includes: - activities of producers or entrepreneurs of live amusement and recreation events, with or without facilities - technical planning, supply, setting-up and operation of audiovisual equipment and special effects associated with the organisation of non-artistic events
CoreContentNote: This class includes activities related to entertainment and recreation (except amusement parks and theme parks) not elsewhere classified: - operation (exploitation) of coin-operated games - rental of leisure and pleasure equipment as an integral part of recreational facilities - operation of mechanical rides, games and shows by independent providers (e.g. at fairgrounds, festivals, Christmas markets) - activities of beaches, including rental of facilities (e.g. bathhouses, beach chairs and umbrellas) - activities of independent animators in amusement and recreation facilities - operation of dance floors and ballrooms where beverage serving is not the main activity - operation of computer rooms for playing computer games - operation of self-service amusement devices (e.g. rocking chairs/horses/cars/spaceships) - operation of airsoft and paintball courts - operation of virtual reality or geolocated games/experiences - amusement and recreation activities related to the infrastructure of marinas - operation of billiard halls - operation of escape rooms - operation of bowling alleys - creation and presentation of light and sound shows - activities of guides for underwater excursions - creation and presentation of fireworks displays - operation of picnic grounds - operation of laser games - entertainment activities in retirement homes
Exclusion Note: This class excludes: - transport by cableways, ski lifts and chairlifts, which may include the preparation of ski slopes, see 49.34 - fishing trips, see 50.10, 50.30 - provision of space and facilities for short-stay visitors in recreational parks, forests and camping grounds, see 55.30 - recreational camps, hunting and fishing camps, campsites and camping grounds, see 55.30 - mobile food service activities, see 56.12 - activities of security personnel for events, concerts, fairs and exhibitions, see 80.01 - organisation of conferences, conventions and trade shows, see 82.30 - provision of services for events, fairs and exhibitions that are part of public order and safety activities, see 84.24 - theatrical and circus groups, see 90.20 - operation of arts facilities (e.g. concert halls, theatre halls, music venues, music clubs and similar facilities for live performances), see 90.31 - technical planning, supply, setting-up and operation of audiovisual equipment and special effects associated with the organisation of artistic events, see 90.39 - operation of gambling or lottery games, see 92.00 - operation of sports facilities (e.g. swimming pools, skating rinks), see 93.11 - activities of water sports clubs (canoeing, rowing, sailing, etc.), see 93.12 - activities of amusement parks and theme parks, see 93.21
broader: Amusement and recreation activities
in scheme: Statistical Classification of Economic Activities in the European Community, Rev. 2.1 (NACE Rev. 2.1)
Notation: 93.29
top concept of: Statistical Classification of Economic Activities in the European Community, Rev. 2.1 (NACE Rev. 2.1)

ConceptNoneRandom0.4886534287144081
type: ConceptAssociation
description: NACE Rev. 2.1 class 13.10 is mapped to NACE Rev. 2 class 13.10
Type: 1:1
Source Concept: Preparation and spinning of textile fibres
Target Concept: http://data.europa.eu/ux2/nace2/1310
in scheme: Statistical Classification of Economic Activities in the European Community, Rev. 2.1 (NACE Rev. 2.1)
scope note: the content of the NACE Rev 2.1 class is fully covered in the corresponding NACE Rev 2 class
top concept of: Statistical Classification of Economic Activities in the European Community, Rev. 2.1 (NACE Rev. 2.1)
Mapping Cardinality: 1 1

Market research and public opinion polling
type: Concept
Additional Content Note: This class also includes scientific conducting of market and opinion research with: - qualitative and quantitative methodological orientation - reactive and non-reactive survey procedures - collection of research data through questioning, observation, measurement and counting - face-to-face, postal, telephone and online interviews to collect research data
CoreContentNote: This class includes: - conducting market research studies on the awareness, evaluation and use of goods and services, on product development and pricing, on the use of media and on the recall and impact of advertising - conducting studies of opinion research on the quality of life and lifestyles, on social participation and political participation, on political party preference and voting behaviour
Exclusion Note: This class excludes: - advertising, see 73.1 - public relations and communication activities, see 73.30 - undertaking telephone interviews for market and opinion research surveys on a contract or fee basis, see 82.20
broader: Market research and public opinion polling
in scheme: Statistical Classification of Economic Activities in the European Community, Rev. 2.1 (NACE Rev. 2.1)
Notation: 73.20
top concept of: Statistical Classification of Economic Activities in the European Community, Rev. 2.1 (NACE Rev. 2.1)

ConceptNoneRandom0.7283001876274504
type: ConceptAssociation
description: NACE Rev. 2.1 class 84.30 is mapped to NACE Rev. 2 class 84.30
Type: 1:1
Source Concept: Compulsory social security activities
Target Concept: http://data.europa.eu/ux2/nace2/8430
in scheme: Statistical Classification of Economic Activities in the European Community, Rev. 2.1 (NACE Rev. 2.1)
scope note: the content of the NACE Rev 2.1 class is fully covered in the corresponding NACE Rev 2 class
top concept of: Statistical Classification of Economic Activities in the European Community, Rev. 2.1 (NACE Rev. 2.1)
Mapping Cardinality: 1 1

ConceptNoneRandom0.9810918815392706
type: ConceptAssociation
description: NACE Rev. 2.1 class 01.13 is mapped to NACE Rev. 2 classes 01.13, 01.19, 01.28
Type: 3:3
Source Concept: Growing of vegetables and melons, roots and tubers
Target Concept: http://data.europa.eu/ux2/nace2/0128
Target Concept: http://data.europa.eu/ux2/nace2/0119
Target Concept: http://data.europa.eu/ux2/nace2/0113
in scheme: Statistical Classification of Economic Activities in the European Community, Rev. 2.1 (NACE Rev. 2.1)
scope note: 01.13: - growing of leafy or stem vegetables, e.g.: • artichokes • asparagus • cabbages • cauliflower and broccoli • lettuce and chicory • spinach - growing of fruit bearing vegetables, e.g.: • cucumbers and gherkins • eggplants (aubergines) • tomatoes • watermelons - growing of root, bulb or tuberous vegetables, e.g.: • carrots • turnips • garlic • onions (incl. shallots) • leeks and other alliaceous vegetables - growing of mushrooms and truffles - growing of vegetable seeds, including sugar beet seeds, excluding other beet seeds - growing of sugar beet - growing of roots and tubers, e.g.: • potatoes • sweet potatoes • cassava • yams 01.19: - growing of roots and tubers, e.g.: • swedes and mangolds 01.28: - growing of chillies, peppers (Capsicum spp.)
top concept of: Statistical Classification of Economic Activities in the European Community, Rev. 2.1 (NACE Rev. 2.1)
Mapping Cardinality: n m

ConceptNoneRandom0.3672260230402872
type: ConceptAssociation
description: NACE Rev. 2.1 class 01.11 is mapped to NACE Rev. 2 class 01.11
Type: 1:1
Source Concept: Growing of cereals, other than rice, leguminous crops and oil seeds
Target Concept: http://data.europa.eu/ux2/nace2/0111
in scheme: Statistical Classification of Economic Activities in the European Community, Rev. 2.1 (NACE Rev. 2.1)
scope note: the content of the NACE Rev 2.1 class is fully covered in the corresponding NACE Rev 2 class
top concept of: Statistical Classification of Economic Activities in the European Community, Rev. 2.1 (NACE Rev. 2.1)
Mapping Cardinality: 1 1

ConceptNoneRandom0.019321288033244177
type: ConceptAssociation
description: NACE Rev. 2.1 class 74.99 is mapped to NACE Rev. 2 class 74.90
Type: 3:2
Source Concept: All other professional, scientific and technical activities n.e.c.
Target Concept: http://data.europa.eu/ux2/nace2/7490
in scheme: Statistical Classification of Economic Activities in the European Community, Rev. 2.1 (NACE Rev. 2.1)
scope note: the content of the NACE Rev 2.1 class is fully covered in the corresponding NACE Rev 2 class
top concept of: Statistical Classification of Economic Activities in the European Community, Rev. 2.1 (NACE Rev. 2.1)
Mapping Cardinality: n m

ConceptNoneRandom0.5041942428128554
type: ConceptAssociation
description: NACE Rev. 2.1 group 86.1 is mapped to NACE Rev. 2 group 86.1
Type: 1:1
Source Concept: Hospital activities
Target Concept: http://data.europa.eu/ux2/nace2/861
in scheme: Statistical Classification of Economic Activities in the European Community, Rev. 2.1 (NACE Rev. 2.1)
top concept of: Statistical Classification of Economic Activities in the European Community, Rev. 2.1 (NACE Rev. 2.1)
Mapping Cardinality: 1 1

ConceptNoneRandom0.051540102108862396
type: ConceptAssociation
description: NACE Rev. 2.1 group 64.3 is mapped to NACE Rev. 2 group 64.3
Type: 1:1
Source Concept: Activities of trusts, funds and similar financial entities
Target Concept: http://data.europa.eu/ux2/nace2/643
in scheme: Statistical Classification of Economic Activities in the European Community, Rev. 2.1 (NACE Rev. 2.1)
top concept of: Statistical Classification of Economic Activities in the European Community, Rev. 2.1 (NACE Rev. 2.1)
Mapping Cardinality: 1 1

ConceptNoneRandom0.5697633918410014
type: ConceptAssociation
description: NACE Rev. 2.1 division 82 is mapped to NACE Rev. 2 divisions 79, 82
Type: 48:49
Source Concept: Office administrative, office support and other business support activities
Target Concept: http://data.europa.eu/ux2/nace2/82
Target Concept: http://data.europa.eu/ux2/nace2/79
in scheme: Statistical Classification of Economic Activities in the European Community, Rev. 2.1 (NACE Rev. 2.1)
top concept of: Statistical Classification of Economic Activities in the European Community, Rev. 2.1 (NACE Rev. 2.1)
Mapping Cardinality: n m

Primary education
type: Concept
Additional Content Note: This class also includes the provision of education programmes within or outside the school system which are equivalent in content to programmes in primary education but are intended for those considered too old to enter primary schools. Examples of such programmes are adult literacy programmes, second chance or reintegration programmes.
CoreContentNote: This class includes primary education: the furnishing of academic courses and associated coursework that give students a sound basic education in reading, writing and mathematics and an elementary understanding of other subjects (for example, history, geography, natural science, social science, art and music).
Exclusion Note: This class excludes: - non-formal education and training regardless of the age or field of education, see 85.5 - child day-care activities, including day nurseries for pupils, see 88.91
broader: Primary education
in scheme: Statistical Classification of Economic Activities in the European Community, Rev. 2.1 (NACE Rev. 2.1)
Notation: 85.20
top concept of: Statistical Classification of Economic Activities in the European Community, Rev. 2.1 (NACE Rev. 2.1)

Restaurants and mobile food service activities
type: Concept
CoreContentNote: This group includes: - restaurant and mobile food service activities for a general public, on a regular basis
broader: Food and beverage service activities
in scheme: Statistical Classification of Economic Activities in the European Community, Rev. 2.1 (NACE Rev. 2.1)
Notation: 56.1
top concept of: Statistical Classification of Economic Activities in the European Community, Rev. 2.1 (NACE Rev. 2.1)

Retail sale of cultural and recreational goods
type: Concept
CoreContentNote: This group includes the specialised retail sale of cultural and recreation goods (for example, books, newspapers, audio and video recordings on physical media, sports equipment, games and toys).
broader: Retail trade
in scheme: Statistical Classification of Economic Activities in the European Community, Rev. 2.1 (NACE Rev. 2.1)
Notation: 47.6
top concept of: Statistical Classification of Economic Activities in the European Community, Rev. 2.1 (NACE Rev. 2.1)

Manufacture of metal structures and parts of structures
type: Concept
Additional Content Note: This class also includes: - manufacture of supporting structures of metal (e.g. for lights or loudspeakers)
CoreContentNote: This class includes: - manufacture of metal frameworks or skeletons for construction and parts thereof (towers, lattice masts, trusses, bridges, bridge sections, etc.) - manufacture of equipment for scaffolding, shuttering, propping or pit-propping - manufacture of industrial frameworks in metal (frameworks for blast furnaces, lifting and handling equipment, etc.) - manufacture of prefabricated buildings mainly of metal: • site huts, modular exhibition elements, etc.
Exclusion Note: This class excludes: - manufacture of parts for marine or power boilers, see 25.21 - manufacture of assembled railway track fixtures, see 25.99 - manufacture of coachwork, see 29.20 - manufacture of sections of ships, see 30.11, 30.13
broader: Manufacture of structural metal products
in scheme: Statistical Classification of Economic Activities in the European Community, Rev. 2.1 (NACE Rev. 2.1)
Notation: 25.11
top concept of: Statistical Classification of Economic Activities in the European Community, Rev. 2.1 (NACE Rev. 2.1)

ConceptNoneRandom0.7832131040054924
type: ConceptAssociation
description: NACE Rev. 2.1 class 86.97 is mapped to NACE Rev. 2 class 82.99
Type: 78:65
Source Concept: Intermediation service activities for medical, dental and other human health services
Target Concept: http://data.europa.eu/ux2/nace2/8299
in scheme: Statistical Classification of Economic Activities in the European Community, Rev. 2.1 (NACE Rev. 2.1)
scope note: the content of the NACE Rev 2.1 class is fully covered in the corresponding NACE Rev 2 class
top concept of: Statistical Classification of Economic Activities in the European Community, Rev. 2.1 (NACE Rev. 2.1)
Mapping Cardinality: n m

ConceptNoneRandom0.5879105742724017
type: ConceptAssociation
description: NACE Rev. 2.1 class 42.91 is mapped to NACE Rev. 2 class 42.91
Type: 1:1
Source Concept: Construction of water projects
Target Concept: http://data.europa.eu/ux2/nace2/4291
in scheme: Statistical Classification of Economic Activities in the European Community, Rev. 2.1 (NACE Rev. 2.1)
scope note: the content of the NACE Rev 2.1 class is fully covered in the corresponding NACE Rev 2 class
top concept of: Statistical Classification of Economic Activities in the European Community, Rev. 2.1 (NACE Rev. 2.1)
Mapping Cardinality: 1 1

Manufacture of other non-metallic mineral products
type: Concept
Additional Content Note: The manufacture of shaped and finished stone and other mineral products is also included in this division. This division also includes the manufacture of products of composite materials in which glass and non-metallic minerals (for example, sand, gravel, stone or clay) are the predominant material.
CoreContentNote: This division includes manufacturing activities related to a single substance of mineral origin. This division includes the manufacture of glass and glass products (for example, flat glass, hollow glass, fibres, technical glassware), ceramic products, tiles and baked clay products, cement, concrete and plaster, from raw materials to finished articles.
broader: MANUFACTURING
in scheme: Statistical Classification of Economic Activities in the European Community, Rev. 2.1 (NACE Rev. 2.1)
Notation: 23
top concept of: Statistical Classification of Economic Activities in the European Community, Rev. 2.1 (NACE Rev. 2.1)

Manufacture of doors and windows of metal
type: Concept
Additional Content Note: This class also includes: - manufacture of temporary spatial extensions made of metal
CoreContentNote: This class includes: - manufacture of metal doors, windows and their frames, thresholds for doors, shutters and gates - metal room partitions for floor attachment - manufacture of metal blinds, metal sunblinds and insect screens
broader: Manufacture of structural metal products
in scheme: Statistical Classification of Economic Activities in the European Community, Rev. 2.1 (NACE Rev. 2.1)
Notation: 25.12
top concept of: Statistical Classification of Economic Activities in the European Community, Rev. 2.1 (NACE Rev. 2.1)

Passenger heavy rail transport
type: Concept
Additional Content Note: This class also includes: - passenger heavy rail transport for sightseeing
CoreContentNote: This class includes: - rail transport of passengers using railway rolling stock on mainline networks - operation of sleeping cars or dining cars as an integrated operation of railway companies
Exclusion Note: This class excludes: - passenger transport by metro, tramway, subway, underground etc., see 49.12 - passenger terminal activities, see 52.21 - operation of railway infrastructure and related activities (e.g. switching and shunting), see 52.21 - operation of sleeping cars or dining cars when operated by separate units, see 55.90, 56.11
broader: Passenger rail transport
in scheme: Statistical Classification of Economic Activities in the European Community, Rev. 2.1 (NACE Rev. 2.1)
Notation: 49.11
top concept of: Statistical Classification of Economic Activities in the European Community, Rev. 2.1 (NACE Rev. 2.1)

ConceptNoneRandom0.7533949470374198
type: ConceptAssociation
description: NACE Rev. 2.1 class 25.11 is mapped to NACE Rev. 2 class 25.11
Type: 1:1
Source Concept: Manufacture of metal structures and parts of structures
Target Concept: http://data.europa.eu/ux2/nace2/2511
in scheme: Statistical Classification of Economic Activities in the European Community, Rev. 2.1 (NACE Rev. 2.1)
scope note: the content of the NACE Rev 2.1 class is fully covered in the corresponding NACE Rev 2 class
top concept of: Statistical Classification of Economic Activities in the European Community, Rev. 2.1 (NACE Rev. 2.1)
Mapping Cardinality: 1 1

ConceptNoneRandom0.8661150396155619
type: ConceptAssociation
description: NACE Rev. 2.1 class 26.40 is mapped to NACE Rev. 2 classes 26.20, 26.40
Type: 3:3
Source Concept: Manufacture of consumer electronics
Target Concept: http://data.europa.eu/ux2/nace2/2640
Target Concept: http://data.europa.eu/ux2/nace2/2620
in scheme: Statistical Classification of Economic Activities in the European Community, Rev. 2.1 (NACE Rev. 2.1)
scope note: 26.20: - manufacture of virtual reality helmets 26.40: - manufacture of video recorders and duplicating equipment - manufacture of televisions - manufacture of television monitors and displays - manufacture of audio recording and duplicating equipment - manufacture of multimedia projectors suitable for use only or principally with transmission and reception apparatus for television-broadcasting - manufacture of stereo equipment - manufacture of radio receivers - manufacture of speaker systems - manufacture of household-type video cameras - manufacture of jukeboxes - manufacture of amplifiers for musical instruments and public address systems - manufacture of microphones - manufacture of optical media players with optical reading system - manufacture of karaoke machines - manufacture of headphones, e.g. for radio, stereo, computer - manufacture of video game consoles - manufacture of personal audio and video headsets, including virtual reality headsets - manufacture of home theatre audio and video equipment
top concept of: Statistical Classification of Economic Activities in the European Community, Rev. 2.1 (NACE Rev. 2.1)
Mapping Cardinality: n m

ConceptNoneRandom0.023616188404951943
type: ConceptAssociation
description: NACE Rev. 2.1 group 20.4 is mapped to NACE Rev. 2 group 20.4
Type: 1:1
Source Concept: Manufacture of washing, cleaning and polishing preparations
Target Concept: http://data.europa.eu/ux2/nace2/204
in scheme: Statistical Classification of Economic Activities in the European Community, Rev. 2.1 (NACE Rev. 2.1)
top concept of: Statistical Classification of Economic Activities in the European Community, Rev. 2.1 (NACE Rev. 2.1)
Mapping Cardinality: 1 1

ConceptNoneRandom0.5948790894707711
type: ConceptAssociation
description: NACE Rev. 2.1 group 77.3 is mapped to NACE Rev. 2 group 77.3
Type: 2:2
Source Concept: Rental and leasing of other machinery, equipment and tangible goods
Target Concept: http://data.europa.eu/ux2/nace2/773
in scheme: Statistical Classification of Economic Activities in the European Community, Rev. 2.1 (NACE Rev. 2.1)
top concept of: Statistical Classification of Economic Activities in the European Community, Rev. 2.1 (NACE Rev. 2.1)
Mapping Cardinality: n m

ConceptNoneRandom0.2859547438689335
type: ConceptAssociation
description: NACE Rev. 2.1 class 46.49 is mapped to NACE Rev. 2 classes 46.43, 46.49
Type: 3:4
Source Concept: Wholesale of other household goods
Target Concept: http://data.europa.eu/ux2/nace2/4649
Target Concept: http://data.europa.eu/ux2/nace2/4643
in scheme: Statistical Classification of Economic Activities in the European Community, Rev. 2.1 (NACE Rev. 2.1)
scope note: 46.43: - wholesale of recorded media 46.49: - wholesale of woodenware, wickerwork and corkware etc. - wholesale of bicycles, electric bicycles, monowheels, hoverboards, kickscooters, including related parts and accessories - wholesale of stationery, books, magazines and newspapers - wholesale of leather goods, excluding clothing and footwear, and travel accessories - wholesale of musical instruments - wholesale of games and toys, including party and magic items - wholesale of sports goods, including special sports footwear, e.g. ski boots, football shoes, skates, ballet shoes - wholesale of recreational boats - wholesale of baby equipment, e.g. baby carriages, pushchairs, baby walkers, baby carriers, baby car seats - wholesale of medals and sports cups - wholesale of tents and sleeping bags - wholesale in promotional items - wholesale of saucepans and pans - wholesale of cutlery - wholesale of imitation jewellery
top concept of: Statistical Classification of Economic Activities in the European Community, Rev. 2.1 (NACE Rev. 2.1)
Mapping Cardinality: n m

Other content distribution activities
type: Concept
CoreContentNote: This class includes: - distribution services of content sharing sites (e.g. wiki sites, social network sites) which publish content produced and edited by users and are not under editorial responsibility and control - operation of online gaming / video game sites, independent of publishing the games - provision of e-books as streaming or downloading services, not associated with publishing - online provision of software, not associated with publishing - content distribution via blogs
Exclusion Note: This class excludes: - intermediation service activities for retail sale, see 47.9 - intermediation service activities for passenger transport, see 52.32 - intermediation service activities for accommodation, see 55.40 - publishing of e-books, see 58.11 - publishing of video games and other software, see 58.2 - audiovisual production activities, see 59.11 - activities of music platforms, see 60.10 - activities of video game streaming sites for viewing only, see 60.20 - news agency activities, see 60.31 - provision of audio or video data hosting for streaming or downloading services (i.e. particularly data storing and sending) without having acquired the rights to the audio or video content, see 63.10 - provision of computing infrastructure and hosting services, see 63.10 - activities of web search portals, see 63.91 - activities of journalists and other writers whose content is published by a third party, see 90.11 - activities of actors and other performing artists, see 90.20 - activities of libraries and archives, see 91.1 - activities of gambling sites, see 92.00
broader: News agency and other content distribution activities
in scheme: Statistical Classification of Economic Activities in the European Community, Rev. 2.1 (NACE Rev. 2.1)
Notation: 60.39
top concept of: Statistical Classification of Economic Activities in the European Community, Rev. 2.1 (NACE Rev. 2.1)

ConceptNoneRandom0.14965991669646006
type: ConceptAssociation
description: NACE Rev. 2.1 group 42.2 is mapped to NACE Rev. 2 group 42.2
Type: 1:1
Source Concept: Construction of utility projects
Target Concept: http://data.europa.eu/ux2/nace2/422
in scheme: Statistical Classification of Economic Activities in the European Community, Rev. 2.1 (NACE Rev. 2.1)
top concept of: Statistical Classification of Economic Activities in the European Community, Rev. 2.1 (NACE Rev. 2.1)
Mapping Cardinality: 1 1

Legal activities
type: Concept
broader: Legal and accounting activities
in scheme: Statistical Classification of Economic Activities in the European Community, Rev. 2.1 (NACE Rev. 2.1)
Notation: 69.1
top concept of: Statistical Classification of Economic Activities in the European Community, Rev. 2.1 (NACE Rev. 2.1)

ConceptNoneRandom0.09503648138847642
type: ConceptAssociation
description: NACE Rev. 2.1 division 85 is mapped to NACE Rev. 2 divisions 82, 85, 88
Type: 48:49
Source Concept: Education
Target Concept: http://data.europa.eu/ux2/nace2/82
Target Concept: http://data.europa.eu/ux2/nace2/85
Target Concept: http://data.europa.eu/ux2/nace2/88
in scheme: Statistical Classification of Economic Activities in the European Community, Rev. 2.1 (NACE Rev. 2.1)
top concept of: Statistical Classification of Economic Activities in the European Community, Rev. 2.1 (NACE Rev. 2.1)
Mapping Cardinality: n m

Retail sale of automotive fuel
type: Concept
broader: Retail trade
in scheme: Statistical Classification of Economic Activities in the European Community, Rev. 2.1 (NACE Rev. 2.1)
Notation: 47.3
top concept of: Statistical Classification of Economic Activities in the European Community, Rev. 2.1 (NACE Rev. 2.1)

Treatment and coating of metals; machining
type: Concept
CoreContentNote: This group includes general activities for the treatment of metal (for example, plating, coating, engraving, boring, polishing or welding), which are typically carried out on a fee or contract basis.
broader: Manufacture of fabricated metal products, except machinery and equipment
in scheme: Statistical Classification of Economic Activities in the European Community, Rev. 2.1 (NACE Rev. 2.1)
Notation: 25.5
top concept of: Statistical Classification of Economic Activities in the European Community, Rev. 2.1 (NACE Rev. 2.1)

Growing of sugar cane
type: Concept
Exclusion Note: This class excludes: - growing of sugar beet, see 01.13
broader: Growing of non-perennial crops
in scheme: Statistical Classification of Economic Activities in the European Community, Rev. 2.1 (NACE Rev. 2.1)
Notation: 01.14
top concept of: Statistical Classification of Economic Activities in the European Community, Rev. 2.1 (NACE Rev. 2.1)

Growing of vegetables and melons, roots and tubers
type: Concept
Additional Content Note: This class also includes: - growing of sweetcorn
CoreContentNote: This class includes: - growing of leafy or stem vegetables, e.g.: • artichokes • asparagus • cabbages • cauliflower and broccoli • lettuce and chicory • spinach - growing of fruit-bearing vegetables, e.g.: • cucumbers and gherkins • eggplants (aubergines) • tomatoes • watermelons - growing of root, bulb or tuberous vegetables, e.g.: • carrots • turnips • garlic • onions (including shallots) • leeks and other alliaceous vegetables - growing of mushrooms and truffles - growing of vegetable seeds, including sugar beet seeds, excluding other beet seeds - growing of sugar beet - growing of chillies, peppers (Capsicum spp.) - growing of roots and tubers, e.g.: • potatoes • sweet potatoes • cassava • yams • swedes and mangolds
Exclusion Note: This class excludes: - growing of spices and aromatic, drug and pharmaceutical crops, see 01.28 - growing of mushroom spawn, see 01.30
broader: Growing of non-perennial crops
in scheme: Statistical Classification of Economic Activities in the European Community, Rev. 2.1 (NACE Rev. 2.1)
Notation: 01.13
top concept of: Statistical Classification of Economic Activities in the European Community, Rev. 2.1 (NACE Rev. 2.1)

Other passenger rail transport
type: Concept
Additional Content Note: This class also includes: - passenger light rail transport for sightseeing
CoreContentNote: This class includes: - passenger transport by metro, subway, underground and elevated railway, metropolitan railway and tramway - passenger transport by funicular railway
Exclusion Note: This class excludes: - passenger terminal activities, see 52.21 - operation of railway infrastructure and related activities (e.g. switching and shunting), see 52.21
broader: Passenger rail transport
in scheme: Statistical Classification of Economic Activities in the European Community, Rev. 2.1 (NACE Rev. 2.1)
Notation: 49.12
top concept of: Statistical Classification of Economic Activities in the European Community, Rev. 2.1 (NACE Rev. 2.1)

Manufacture of basic metals
type: Concept
Additional Content Note: This division also includes the manufacture of metal alloys and super-alloys by introducing other chemical elements to pure metals. The output of smelting and refining, usually in ingot form, is used in rolling, drawing and extruding operations to make, for example, plate, sheet, strip, bars, rods, wire or tubes, pipes and hollow profiles and other basic metal products, and in molten form to make castings.
CoreContentNote: This division includes the activities of smelting and/or refining ferrous and non-ferrous metals from ore, pig, metal waste or scrap, using electro-metallurgic and other metallurgical process techniques.
broader: MANUFACTURING
in scheme: Statistical Classification of Economic Activities in the European Community, Rev. 2.1 (NACE Rev. 2.1)
Notation: 24
top concept of: Statistical Classification of Economic Activities in the European Community, Rev. 2.1 (NACE Rev. 2.1)

ConceptNoneRandom0.7115974407048068
type: ConceptAssociation
description: NACE Rev. 2.1 class 33.18 is mapped to NACE Rev. 2 classes 30.40, 33.12, 33.15, 33.16
Type: 5:4
Source Concept: Repair and maintenance of military fighting vehicles, ships, boats, air and spacecraft
Target Concept: http://data.europa.eu/ux2/nace2/3040
Target Concept: http://data.europa.eu/ux2/nace2/3316
Target Concept: http://data.europa.eu/ux2/nace2/3315
Target Concept: http://data.europa.eu/ux2/nace2/3312
in scheme: Statistical Classification of Economic Activities in the European Community, Rev. 2.1 (NACE Rev. 2.1)
scope note: 30.40: - repair and maintenance of military fighting vehicles - repair and maintenance of engines for military fighting vehicles 33.12: - repair and maintenance of engines for vessels, ships, boats 33.15: - repair and maintenance of military ships, boats and floating structure 33.16: - repair and maintenance of military air and spacecraft - repair and maintenance of engines for military aircraft and spacecraft
top concept of: Statistical Classification of Economic Activities in the European Community, Rev. 2.1 (NACE Rev. 2.1)
Mapping Cardinality: n m

Activities of professional membership organisations
type: Concept
Additional Content Note: This class also includes: - activities of learned societies
CoreContentNote: This class includes: - activities of organisations whose members’ interests centre chiefly on a particular scholarly discipline or professional practice or technical field (e.g. medical associations, legal associations, accounting associations, engineering associations, architects’ associations) - activities of associations of specialists engaged in scientific, academic or cultural activities (e.g. associations of writers, painters, performers of various kinds, journalists) - dissemination of information, the establishment and supervision of standards of practice, representation before government agencies, public relations of professional organisations
Exclusion Note: This class excludes: - education provided by professional membership organisations, see division 85 - activities of business and employers’ membership organisations, see 94.11 - activities of trade unions, see 94.20 - activities of other membership organisations n.e.c., see 94.99
broader: Activities of business, employers and professional membership organisations
in scheme: Statistical Classification of Economic Activities in the European Community, Rev. 2.1 (NACE Rev. 2.1)
Notation: 94.12
top concept of: Statistical Classification of Economic Activities in the European Community, Rev. 2.1 (NACE Rev. 2.1)

Funeral and related activities
type: Concept
CoreContentNote: This class includes: - burial and incineration of human or animal corpses and related activities: • preparing the dead for burial or cremation; embalming and morticians’ services • providing burial or cremation services • rental of equipped space in funeral parlours - rental or sale of graves - maintenance of graves and mausoleums - transport of human remains
Exclusion Note: This class excludes: - cemetery gardening, see 81.30 - religious funeral service activities, see 94.91
broader: Funeral and related activities
in scheme: Statistical Classification of Economic Activities in the European Community, Rev. 2.1 (NACE Rev. 2.1)
Notation: 96.30
top concept of: Statistical Classification of Economic Activities in the European Community, Rev. 2.1 (NACE Rev. 2.1)

ConceptNoneRandom0.35000241432954515
type: ConceptAssociation
description: NACE Rev. 2.1 class 60.31 is mapped to NACE Rev. 2 class 63.91
Type: 1:1
Source Concept: News agency activities
Target Concept: http://data.europa.eu/ux2/nace2/6391
in scheme: Statistical Classification of Economic Activities in the European Community, Rev. 2.1 (NACE Rev. 2.1)
scope note: the content of the NACE Rev 2.1 class is fully covered in the corresponding NACE Rev 2 class
top concept of: Statistical Classification of Economic Activities in the European Community, Rev. 2.1 (NACE Rev. 2.1)
Mapping Cardinality: 1 1

ConceptNoneRandom0.46745963203799246
type: ConceptAssociation
description: NACE Rev. 2.1 class 01.15 is mapped to NACE Rev. 2 class 01.15
Type: 1:1
Source Concept: Growing of tobacco
Target Concept: http://data.europa.eu/ux2/nace2/0115
in scheme: Statistical Classification of Economic Activities in the European Community, Rev. 2.1 (NACE Rev. 2.1)
scope note: the content of the NACE Rev 2.1 class is fully covered in the corresponding NACE Rev 2 class
top concept of: Statistical Classification of Economic Activities in the European Community, Rev. 2.1 (NACE Rev. 2.1)
Mapping Cardinality: 1 1

Sea and coastal passenger water transport
type: Concept
Additional Content Note: This class also includes: - rental of pleasure boats with crew for sea and coastal water transport (e.g. for fishing trips) - ferry transport of passengers with or without a vehicle
CoreContentNote: This class includes: - transport of passengers over seas and coastal waters, whether scheduled or not: • operation of excursion, cruise or sightseeing boats • operation of ferries, water taxis, etc. - operation of other passenger sea or coastal transport
Exclusion Note: This class excludes: - restaurant and bar activities aboard ships, when provided by separate units, see 56.11, 56.30 - rental of pleasure boats and yachts without crew, see 77.21 - rental of commercial ships or boats without crew, see 77.34 - operation of floating casinos, not transporting passengers, see 92.00
broader: Sea and coastal passenger water transport
in scheme: Statistical Classification of Economic Activities in the European Community, Rev. 2.1 (NACE Rev. 2.1)
Notation: 50.10
top concept of: Statistical Classification of Economic Activities in the European Community, Rev. 2.1 (NACE Rev. 2.1)

ConceptNoneRandom0.5863299631366183
type: ConceptAssociation
description: NACE Rev. 2.1 class 30.91 is mapped to NACE Rev. 2 classes 28.11, 30.91
Type: 8:9
Source Concept: Manufacture of motorcycles
Target Concept: http://data.europa.eu/ux2/nace2/2811
Target Concept: http://data.europa.eu/ux2/nace2/3091
in scheme: Statistical Classification of Economic Activities in the European Community, Rev. 2.1 (NACE Rev. 2.1)
scope note: 28.11: - manufacture of pistons, piston rings and carburettors for motorcycles 30.91: - manufacture of motorcycles and mopeds - manufacture of engines for motorcycles - manufacture of sidecars for motorcycles - manufacture of parts and accessories for motorcycles, e.g. brakes, gear boxes, clutches, road wheels, silencers and exhaust pipes, and parts thereof
top concept of: Statistical Classification of Economic Activities in the European Community, Rev. 2.1 (NACE Rev. 2.1)
Mapping Cardinality: n m

ConceptNoneRandom0.9486676882695583
type: ConceptAssociation
description: NACE Rev. 2.1 group 77.4 is mapped to NACE Rev. 2 group 77.4
Type: 1:1
Source Concept: Leasing of intellectual property and similar products, except copyrighted works
Target Concept: http://data.europa.eu/ux2/nace2/774
in scheme: Statistical Classification of Economic Activities in the European Community, Rev. 2.1 (NACE Rev. 2.1)
top concept of: Statistical Classification of Economic Activities in the European Community, Rev. 2.1 (NACE Rev. 2.1)
Mapping Cardinality: 1 1

ConceptNoneRandom0.4118585368612505
type: ConceptAssociation
description: NACE Rev. 2.1 class 94.12 is mapped to NACE Rev. 2 class 94.12
Type: 1:1
Source Concept: Activities of professional membership organisations
Target Concept: http://data.europa.eu/ux2/nace2/9412
in scheme: Statistical Classification of Economic Activities in the European Community, Rev. 2.1 (NACE Rev. 2.1)
scope note: the content of the NACE Rev 2.1 class is fully covered in the corresponding NACE Rev 2 class
top concept of: Statistical Classification of Economic Activities in the European Community, Rev. 2.1 (NACE Rev. 2.1)
Mapping Cardinality: 1 1

ConceptNoneRandom0.7279988052142987
type: ConceptAssociation
description: NACE Rev. 2.1 group 64.1 is mapped to NACE Rev. 2 group 64.1
Type: 1:1
Source Concept: Monetary intermediation
Target Concept: http://data.europa.eu/ux2/nace2/641
in scheme: Statistical Classification of Economic Activities in the European Community, Rev. 2.1 (NACE Rev. 2.1)
top concept of: Statistical Classification of Economic Activities in the European Community, Rev. 2.1 (NACE Rev. 2.1)
Mapping Cardinality: 1 1

Other human health activities n.e.c.
type: Concept
Additional Content Note: This class also includes: - activities of dental paramedical personnel (e.g. dental therapists, school dental nurses or dental hygienists) who may work remote from – but are periodically supervised by – dentists - activities of blood banks, tissue banks, sperm banks, transplant organ banks, biobanks, genome data centres, etc., including collecting, processing, storage and shipping - operation of bone marrow donor registries - activities of orthoptists - activities of podiatrists - activities of skin therapists - health-related monitoring activities (infant nutrition, child health) - activities of dieticians - prevention health activities and disease detection (cancer, tuberculosis, venereal diseases) - transport of blood and body organs/fluids - shiatsu, Thai massage, Watsu, tui na qigong - animal therapy activities (e.g. hippotherapy) - colonic hydrotherapy - dance and movement therapy - art therapy
CoreContentNote: This class includes: - activities for human health n.e.c.: • activities of paramedical practitioners in the field of optometry, hydrotherapy, speech therapy, podiatry/chiropody, etc.
Exclusion Note: This class excludes: - production of artificial teeth, denture and prosthetic appliances by dental laboratories, see 32.50 - non-medical laboratory testing, see 71.20 - testing activities in the field of food hygiene, see 71.20 - hospital activities, see 86.10 - medical and dental practice activities, see 86.2 - diagnostic imaging services and medical laboratory activities, see 86.91 - activities of psychologists (e.g. clinical psychologists, health psychologists, psychotherapists, except medical doctors), see 86.93 - nursing and midwifery activities, see 86.94 - physiotherapy activities, see 86.95 - activities of medical massage therapists, see 86.95 - residential nursing care facilities, see 87.10 - activities of massage salons for non-medical massage, see 96.23
broader: Other human health activities
in scheme: Statistical Classification of Economic Activities in the European Community, Rev. 2.1 (NACE Rev. 2.1)
Notation: 86.99
top concept of: Statistical Classification of Economic Activities in the European Community, Rev. 2.1 (NACE Rev. 2.1)

ConceptNoneRandom0.8368531674632986
type: ConceptAssociation
description: NACE Rev. 2.1 division 84 is mapped to NACE Rev. 2 divisions 84, 93
Type: 48:49
Source Concept: Public administration and defence; compulsory social security
Target Concept: http://data.europa.eu/ux2/nace2/93
Target Concept: http://data.europa.eu/ux2/nace2/84
in scheme: Statistical Classification of Economic Activities in the European Community, Rev. 2.1 (NACE Rev. 2.1)
top concept of: Statistical Classification of Economic Activities in the European Community, Rev. 2.1 (NACE Rev. 2.1)
Mapping Cardinality: n m

Accounting, bookkeeping and auditing activities; tax consultancy
type: Concept
broader: Legal and accounting activities
in scheme: Statistical Classification of Economic Activities in the European Community, Rev. 2.1 (NACE Rev. 2.1)
Notation: 69.2
top concept of: Statistical Classification of Economic Activities in the European Community, Rev. 2.1 (NACE Rev. 2.1)

Retail sale of information and communication equipment
type: Concept
Exclusion Note: This group excludes: - streaming and downloading of contents on digital platforms, see section J
broader: Retail trade
in scheme: Statistical Classification of Economic Activities in the European Community, Rev. 2.1 (NACE Rev. 2.1)
Notation: 47.4
top concept of: Statistical Classification of Economic Activities in the European Community, Rev. 2.1 (NACE Rev. 2.1)

ConceptNoneRandom0.5444848960834705
type: ConceptAssociation
description: NACE Rev. 2.1 group 20.5 is mapped to NACE Rev. 2 groups 20.1, 20.5
Type: 4:4
Source Concept: Manufacture of other chemical products
Target Concept: http://data.europa.eu/ux2/nace2/201
Target Concept: http://data.europa.eu/ux2/nace2/205
in scheme: Statistical Classification of Economic Activities in the European Community, Rev. 2.1 (NACE Rev. 2.1)
top concept of: Statistical Classification of Economic Activities in the European Community, Rev. 2.1 (NACE Rev. 2.1)
Mapping Cardinality: n m

ConceptNoneRandom0.7572691552493818
type: ConceptAssociation
description: NACE Rev. 2.1 class 96.30 is mapped to NACE Rev. 2 class 96.03
Type: 1:1
Source Concept: Funeral and related activities
Target Concept: http://data.europa.eu/ux2/nace2/9603
in scheme: Statistical Classification of Economic Activities in the European Community, Rev. 2.1 (NACE Rev. 2.1)
scope note: the content of the NACE Rev 2.1 class is fully covered in the corresponding NACE Rev 2 class
top concept of: Statistical Classification of Economic Activities in the European Community, Rev. 2.1 (NACE Rev. 2.1)
Mapping Cardinality: 1 1

Manufacture of computer, electronic and optical products
type: Concept
Additional Content Note: The division also contains the manufacture of consumer electronics, measuring, testing and navigating equipment, irradiation, electromedical and electrotherapeutic equipment, optical instruments and equipment, and the manufacture of magnetic and optical media.
CoreContentNote: This division includes the manufacture of computers, computer peripherals, communication equipment, and similar electronic products, as well as the manufacture of components for such products. Production processes of this division are characterised by the design and use of integrated circuits and the application of highly specialised miniaturisation technologies.
Exclusion Note: This division excludes the manufacture of conductors for electronic use and of optical fibre cables, see division 27.
broader: MANUFACTURING
in scheme: Statistical Classification of Economic Activities in the European Community, Rev. 2.1 (NACE Rev. 2.1)
Notation: 26
top concept of: Statistical Classification of Economic Activities in the European Community, Rev. 2.1 (NACE Rev. 2.1)

Growing of tobacco
type: Concept
Additional Content Note: This class also includes: - preliminary processing of tobacco when associated with the growing of tobacco
CoreContentNote: This class includes: - growing of unmanufactured tobacco
Exclusion Note: This class excludes: - preparation of tobacco leaves (e.g. sun drying) by a third party, see 01.63 - manufacture of tobacco products, see 12.00
broader: Growing of non-perennial crops
in scheme: Statistical Classification of Economic Activities in the European Community, Rev. 2.1 (NACE Rev. 2.1)
Notation: 01.15
top concept of: Statistical Classification of Economic Activities in the European Community, Rev. 2.1 (NACE Rev. 2.1)

Manufacture of cutlery, tools and general hardware
type: Concept
CoreContentNote: This group includes the manufacture of cutlery, metal hand tools and general hardware.
broader: Manufacture of fabricated metal products, except machinery and equipment
in scheme: Statistical Classification of Economic Activities in the European Community, Rev. 2.1 (NACE Rev. 2.1)
Notation: 25.6
top concept of: Statistical Classification of Economic Activities in the European Community, Rev. 2.1 (NACE Rev. 2.1)

ConceptNoneRandom0.9165410601733414
type: ConceptAssociation
description: NACE Rev. 2.1 class 73.20 is mapped to NACE Rev. 2 class 73.20
Type: 1:1
Source Concept: Market research and public opinion polling
Target Concept: http://data.europa.eu/ux2/nace2/7320
in scheme: Statistical Classification of Economic Activities in the European Community, Rev. 2.1 (NACE Rev. 2.1)
scope note: the content of the NACE Rev 2.1 class is fully covered in the corresponding NACE Rev 2 class
top concept of: Statistical Classification of Economic Activities in the European Community, Rev. 2.1 (NACE Rev. 2.1)
Mapping Cardinality: 1 1

Manufacture of fabricated metal products, except machinery and equipment
type: Concept
Additional Content Note: This division also includes the manufacture of products of composite materials in which metals are the predominant material. The manufacture of weapons and ammunition is also included in this division.
CoreContentNote: This division includes the manufacture of pure metal products (for example, parts, containers, structures), usually with a static, immovable function. This is in contrast to divisions 26 to 30, which cover the manufacture of combinations or assemblies of such metal products (sometimes with other materials) into more complex units that – unless they are purely electrical, electronic or optical – work with moving parts.
Exclusion Note: This division excludes: - specialised repair and maintenance activities of fabricated metal products, machinery and equipment, see 33.1 - specialised installation of manufactured goods produced in this division in buildings (e.g. central heating boilers), see 43.22
broader: MANUFACTURING
in scheme: Statistical Classification of Economic Activities in the European Community, Rev. 2.1 (NACE Rev. 2.1)
Notation: 25
top concept of: Statistical Classification of Economic Activities in the European Community, Rev. 2.1 (NACE Rev. 2.1)

ConceptNoneRandom0.5884855488336196
type: ConceptAssociation
description: NACE Rev. 2.1 class 86.99 is mapped to NACE Rev. 2 class 86.90
Type: 7:1
Source Concept: Other human health activities n.e.c.
Target Concept: http://data.europa.eu/ux2/nace2/8690
in scheme: Statistical Classification of Economic Activities in the European Community, Rev. 2.1 (NACE Rev. 2.1)
scope note: the content of the NACE Rev 2.1 class is fully covered in the corresponding NACE Rev 2 class
top concept of: Statistical Classification of Economic Activities in the European Community, Rev. 2.1 (NACE Rev. 2.1)
Mapping Cardinality: n 1

ConceptNoneRandom0.6035191826526386
type: ConceptAssociation
description: NACE Rev. 2.1 class 33.19 is mapped to NACE Rev. 2 class 33.19
Type: 23:16
Source Concept: Repair and maintenance of other equipment
Target Concept: http://data.europa.eu/ux2/nace2/3319
in scheme: Statistical Classification of Economic Activities in the European Community, Rev. 2.1 (NACE Rev. 2.1)
scope note: the content of the NACE Rev 2.1 class is fully covered in the corresponding NACE Rev 2 class
top concept of: Statistical Classification of Economic Activities in the European Community, Rev. 2.1 (NACE Rev. 2.1)
Mapping Cardinality: n m

Manufacture of bicycles and invalid carriages
type: Concept
CoreContentNote: This class includes: - manufacture of non-motorised bicycles and other cycles, including (delivery) tricycles, tandems, children’s bicycles and tricycles - manufacture of parts and accessories of bicycles (e.g. frames, forks, wheel rims and spokes, hubs, brakes, saddles, pedals, crank gear and derailleur gears) - manufacture of bicycles with an auxiliary electric motor - manufacture of carriages for disabled persons with or without motor - manufacture of parts and accessories of carriages for disabled persons - manufacture of personal transporters (e.g. electric skateboards and kickscooters) - manufacture of baby carriages and parts thereof
Exclusion Note: This class excludes: - manufacture of pneumatic tyres and inner tubes of rubber, of a kind used for bicycles, see 22.11 - manufacture of wheeled toys designed to be ridden, including plastic bicycles and tricycles, see 32.40
broader: Manufacture of transport equipment n.e.c.
in scheme: Statistical Classification of Economic Activities in the European Community, Rev. 2.1 (NACE Rev. 2.1)
Notation: 30.92
top concept of: Statistical Classification of Economic Activities in the European Community, Rev. 2.1 (NACE Rev. 2.1)

ConceptNoneRandom0.6779015056305286
type: ConceptAssociation
description: NACE Rev. 2.1 class 01.14 is mapped to NACE Rev. 2 class 01.14
Type: 1:1
Source Concept: Growing of sugar cane
Target Concept: http://data.europa.eu/ux2/nace2/0114
in scheme: Statistical Classification of Economic Activities in the European Community, Rev. 2.1 (NACE Rev. 2.1)
scope note: the content of the NACE Rev 2.1 class is fully covered in the corresponding NACE Rev 2 class
top concept of: Statistical Classification of Economic Activities in the European Community, Rev. 2.1 (NACE Rev. 2.1)
Mapping Cardinality: 1 1

Repair and maintenance of other equipment
type: Concept
CoreContentNote: This class includes the repair and maintenance of equipment not covered in other groups of this division. This class includes: - repair of fishing nets, including mending - repair of ropes, riggings, canvas and tarpaulins - repair of fertiliser and chemical storage bags - repair or reconditioning of wooden pallets, shipping drums or barrels, and similar items - repair of gaming and gambling machines - repair of hospital beds
Exclusion Note: This class excludes: - repair of household- and office-type furniture, see 95.24 - repair of bicycles, see 95.29 - repair and alteration of clothing, see 95.29
broader: Repair and maintenance of fabricated metal products, machinery and equipment
in scheme: Statistical Classification of Economic Activities in the European Community, Rev. 2.1 (NACE Rev. 2.1)
Notation: 33.19
top concept of: Statistical Classification of Economic Activities in the European Community, Rev. 2.1 (NACE Rev. 2.1)

ConceptNoneRandom0.15097352129692354
type: ConceptAssociation
description: NACE Rev. 2.1 group 73.1 is mapped to NACE Rev. 2 group 73.1
Type: 1:1
Source Concept: Advertising
Target Concept: http://data.europa.eu/ux2/nace2/731
in scheme: Statistical Classification of Economic Activities in the European Community, Rev. 2.1 (NACE Rev. 2.1)
top concept of: Statistical Classification of Economic Activities in the European Community, Rev. 2.1 (NACE Rev. 2.1)
Mapping Cardinality: 1 1

Manufacture of weapons and ammunition
type: Concept
broader: Manufacture of fabricated metal products, except machinery and equipment
in scheme: Statistical Classification of Economic Activities in the European Community, Rev. 2.1 (NACE Rev. 2.1)
Notation: 25.3
top concept of: Statistical Classification of Economic Activities in the European Community, Rev. 2.1 (NACE Rev. 2.1)

Non-specialised retail sale
type: Concept
CoreContentNote: This group includes the retail sale of a variety of product lines in the same unit (non-specialised sale, for example, supermarkets, hypermarkets, department stores).
Exclusion Note: This group excludes: - specialised retail sale, see 47.2 to 47.8 - intermediation services for specialised and non-specialised retail sale, see 47.9
broader: Retail trade
in scheme: Statistical Classification of Economic Activities in the European Community, Rev. 2.1 (NACE Rev. 2.1)
Notation: 47.1
top concept of: Statistical Classification of Economic Activities in the European Community, Rev. 2.1 (NACE Rev. 2.1)

Manufacture of tobacco products
type: Concept
broader: Manufacture of tobacco products
in scheme: Statistical Classification of Economic Activities in the European Community, Rev. 2.1 (NACE Rev. 2.1)
Notation: 12.0
top concept of: Statistical Classification of Economic Activities in the European Community, Rev. 2.1 (NACE Rev. 2.1)

ConceptNoneRandom0.7750745243444398
type: ConceptAssociation
description: NACE Rev. 2.1 class 95.40 is mapped to NACE Rev. 2 class 82.99
Type: 78:65
Source Concept: Intermediation service activities for repair and maintenance of computers, personal and household goods, and motor vehicles and motorcycles
Target Concept: http://data.europa.eu/ux2/nace2/8299
in scheme: Statistical Classification of Economic Activities in the European Community, Rev. 2.1 (NACE Rev. 2.1)
scope note: the content of the NACE Rev 2.1 class is fully covered in the corresponding NACE Rev 2 class
top concept of: Statistical Classification of Economic Activities in the European Community, Rev. 2.1 (NACE Rev. 2.1)
Mapping Cardinality: n m

ConceptNoneRandom0.6042241136397644
type: ConceptAssociation
description: NACE Rev. 2.1 class 70.10 is mapped to NACE Rev. 2 class 70.10
Type: 1:1
Source Concept: Activities of head offices
Target Concept: http://data.europa.eu/ux2/nace2/7010
in scheme: Statistical Classification of Economic Activities in the European Community, Rev. 2.1 (NACE Rev. 2.1)
scope note: the content of the NACE Rev 2.1 class is fully covered in the corresponding NACE Rev 2 class
top concept of: Statistical Classification of Economic Activities in the European Community, Rev. 2.1 (NACE Rev. 2.1)
Mapping Cardinality: 1 1

Activities auxiliary to financial services and insurance activities
type: Concept
CoreContentNote: This division includes the provision of services involved in or supporting financial transactions in financial assets and liabilities, without taking ownership of the financial assets and liabilities being transacted. These services can be provided via/in different media/ways, including over the internet.
broader: FINANCIAL AND INSURANCE ACTIVITIES
in scheme: Statistical Classification of Economic Activities in the European Community, Rev. 2.1 (NACE Rev. 2.1)
Notation: 66
top concept of: Statistical Classification of Economic Activities in the European Community, Rev. 2.1 (NACE Rev. 2.1)

Growing of cereals, other than rice, leguminous crops and oil seeds
type: Concept
CoreContentNote: This class includes all forms of growing of cereals, leguminous crops and oil seeds. Further included is the growing of these plants for the purpose of seed production. The growing of these crops is often combined within agricultural units. This class includes: - growing of cereals, e.g.: • wheat • grain maize • sorghum • barley • rye • oats • millet • pseudocereals, in other words, fruits or seeds used as cereals, e.g.: • quinoa • amaranth • chia - growing of leguminous crops, e.g.: • beans • broad beans • chickpeas • cowpeas • lentils • lupines • peas • pigeon peas - growing of oil seeds, e.g.: • soya beans • groundnuts • castor beans • linseed • mustard seed • niger seed • rapeseed • safflower seed • sesame seed • sunflower seed
Exclusion Note: This class excludes: - growing of rice, see 01.12 - growing of sweetcorn, see 01.13 - growing of maize, lupines or kale for fodder, see 01.19 - growing of oleaginous fruits, see 01.26
broader: Growing of non-perennial crops
in scheme: Statistical Classification of Economic Activities in the European Community, Rev. 2.1 (NACE Rev. 2.1)
Notation: 01.11
top concept of: Statistical Classification of Economic Activities in the European Community, Rev. 2.1 (NACE Rev. 2.1)

Manufacture of motorcycles
type: Concept
CoreContentNote: This class includes: - manufacture of motorcycles and mopeds - manufacture of engines for motorcycles - manufacture of sidecars for motorcycles - manufacture of parts and accessories for motorcycles (e.g. brakes, gearboxes, clutches, road wheels, silencers and exhaust pipes, and parts thereof) - manufacture of pistons, piston rings and carburettors for motorcycles
Exclusion Note: This class excludes: - manufacture of pneumatic tyres of rubber, of a kind used for motorcycles, see 22.11 - manufacture of bicycles, see 30.92 - manufacture of cycles with an electric motor for propulsion, see 30.92 - manufacture of carriages for disabled persons, see 30.92 - manufacture of personal transporters (e.g. electric skateboards and kickscooters), see 30.92
broader: Manufacture of transport equipment n.e.c.
in scheme: Statistical Classification of Economic Activities in the European Community, Rev. 2.1 (NACE Rev. 2.1)
Notation: 30.91
top concept of: Statistical Classification of Economic Activities in the European Community, Rev. 2.1 (NACE Rev. 2.1)

ConceptNoneRandom0.5221393397813374
type: ConceptAssociation
description: NACE Rev. 2.1 class 81.23 is mapped to NACE Rev. 2 class 81.29
Type: 1:1
Source Concept: Other cleaning activities
Target Concept: http://data.europa.eu/ux2/nace2/8129
in scheme: Statistical Classification of Economic Activities in the European Community, Rev. 2.1 (NACE Rev. 2.1)
scope note: the content of the NACE Rev 2.1 class is fully covered in the corresponding NACE Rev 2 class
top concept of: Statistical Classification of Economic Activities in the European Community, Rev. 2.1 (NACE Rev. 2.1)
Mapping Cardinality: 1 1

ConceptNoneRandom0.46814218860926327
type: ConceptAssociation
description: NACE Rev. 2.1 class 27.32 is mapped to NACE Rev. 2 class 27.32
Type: 1:1
Source Concept: Manufacture of other electronic and electric wires and cables
Target Concept: http://data.europa.eu/ux2/nace2/2732
in scheme: Statistical Classification of Economic Activities in the European Community, Rev. 2.1 (NACE Rev. 2.1)
scope note: the content of the NACE Rev 2.1 class is fully covered in the corresponding NACE Rev 2 class
top concept of: Statistical Classification of Economic Activities in the European Community, Rev. 2.1 (NACE Rev. 2.1)
Mapping Cardinality: 1 1

ConceptNoneRandom0.5294726130896602
type: ConceptAssociation
description: NACE Rev. 2.1 class 86.92 is mapped to NACE Rev. 2 class 86.90
Type: 7:1
Source Concept: Patient transportation by ambulance
Target Concept: http://data.europa.eu/ux2/nace2/8690
in scheme: Statistical Classification of Economic Activities in the European Community, Rev. 2.1 (NACE Rev. 2.1)
scope note: the content of the NACE Rev 2.1 class is fully covered in the corresponding NACE Rev 2 class
top concept of: Statistical Classification of Economic Activities in the European Community, Rev. 2.1 (NACE Rev. 2.1)
Mapping Cardinality: n 1

ConceptNoneRandom0.4564350299027674
type: ConceptAssociation
description: NACE Rev. 2.1 class 49.11 is mapped to NACE Rev. 2 class 49.10
Type: 6:3
Source Concept: Passenger heavy rail transport
Target Concept: http://data.europa.eu/ux2/nace2/4910
in scheme: Statistical Classification of Economic Activities in the European Community, Rev. 2.1 (NACE Rev. 2.1)
scope note: the content of the NACE Rev 2.1 class is fully covered in the corresponding NACE Rev 2 class
top concept of: Statistical Classification of Economic Activities in the European Community, Rev. 2.1 (NACE Rev. 2.1)
Mapping Cardinality: n m

ConceptNoneRandom0.9669801378188736
type: ConceptAssociation
description: NACE Rev. 2.1 group 73.2 is mapped to NACE Rev. 2 group 73.2
Type: 1:1
Source Concept: Market research and public opinion polling
Target Concept: http://data.europa.eu/ux2/nace2/732
in scheme: Statistical Classification of Economic Activities in the European Community, Rev. 2.1 (NACE Rev. 2.1)
top concept of: Statistical Classification of Economic Activities in the European Community, Rev. 2.1 (NACE Rev. 2.1)
Mapping Cardinality: 1 1

Repair and maintenance of military fighting vehicles, ships, boats, air and spacecraft
type: Concept
CoreContentNote: This class includes the repair and maintenance of military fighting vehicles, ships, boats, air and spacecraft. This class includes: - repair and maintenance of military air and spacecraft - repair and maintenance of military fighting vehicles - repair and maintenance of military ships, boats and floating structures - repair and maintenance of engines for military fighting vehicles, vessels, ships, boats, air and spacecraft
Exclusion Note: This class excludes: - factory overhaul of military ship and boat engines, see 28.11 - factory overhaul and rebuilding of military fighting vehicles, ships, boats, floating structures, air and spacecraft, see 30.13, 30.32, 30.40 - factory overhaul and conversion of military aircraft or aircraft engines, see 30.32 - maintenance and repair of civilian boats, ships, aircraft and spacecraft, and other craft, see 33.15, 33.16
broader: Repair and maintenance of fabricated metal products, machinery and equipment
in scheme: Statistical Classification of Economic Activities in the European Community, Rev. 2.1 (NACE Rev. 2.1)
Notation: 33.18
top concept of: Statistical Classification of Economic Activities in the European Community, Rev. 2.1 (NACE Rev. 2.1)

Retail sale of food, beverages and tobacco
type: Concept
Exclusion Note: This group excludes food and beverage processing and manufacturing activities, see divisions 10 and 11.
broader: Retail trade
in scheme: Statistical Classification of Economic Activities in the European Community, Rev. 2.1 (NACE Rev. 2.1)
Notation: 47.2
top concept of: Statistical Classification of Economic Activities in the European Community, Rev. 2.1 (NACE Rev. 2.1)

Forging and shaping metal and powder metallurgy
type: Concept
broader: Manufacture of fabricated metal products, except machinery and equipment
in scheme: Statistical Classification of Economic Activities in the European Community, Rev. 2.1 (NACE Rev. 2.1)
Notation: 25.4
top concept of: Statistical Classification of Economic Activities in the European Community, Rev. 2.1 (NACE Rev. 2.1)

ConceptNoneRandom0.27903867303333674
type: ConceptAssociation
description: NACE Rev. 2.1 class 93.21 is mapped to NACE Rev. 2 class 93.21
Type: 7:7
Source Concept: Activities of amusement parks and theme parks
Target Concept: http://data.europa.eu/ux2/nace2/9321
in scheme: Statistical Classification of Economic Activities in the European Community, Rev. 2.1 (NACE Rev. 2.1)
scope note: the content of the NACE Rev 2.1 class is fully covered in the corresponding NACE Rev 2 class
top concept of: Statistical Classification of Economic Activities in the European Community, Rev. 2.1 (NACE Rev. 2.1)
Mapping Cardinality: n m

Construction of other civil engineering projects n.e.c.
type: Concept
CoreContentNote: This class includes: - construction of industrial facilities, except buildings, e.g.: • mining facilities (e.g. shafts, towers, tunnels) • refineries • chemical plants • grain storage systems - construction of other facilities, except buildings, e.g.: • outdoor sports facilities - construction of playgrounds - construction of non-prefabricated swimming pools
Exclusion Note: This class excludes: - installation of industrial machinery and equipment, see 33.20 - construction of buildings used for indoor sports, see 41.00 - subdividing and improving of self-owned land for later sale, see 68.12 - project management activities related to civil engineering works, see 71.12
broader: Construction of other civil engineering projects
in scheme: Statistical Classification of Economic Activities in the European Community, Rev. 2.1 (NACE Rev. 2.1)
Notation: 42.99
top concept of: Statistical Classification of Economic Activities in the European Community, Rev. 2.1 (NACE Rev. 2.1)

Computer programming activities
type: Concept
Additional Content Note: This class also includes: - development of applications
CoreContentNote: This class includes: - designing the structure and content of, the writing, modifying (including updates and patches), testing and maintaining of software and applications, including: • systems software • video game software and applications / gaming applications • video game middleware • business and finance software applications • machine learning applications • artificial intelligence / machine vision applications • cybersecurity applications • distributed ledger applications • databases and web pages - customising of software, i.e. modifying and configuring an existing application so that it is functional within the clients’ information system environment
Exclusion Note: This class excludes: - publishing of software or gaming on demand services, cloud-based software and gaming applications, see 58.2 - development of software associated with publishing, see 58.2 - translation or adaptation of non-customised software for a particular market on own account, see 58.29 - operation of online gaming / video game sites, see 60.39 - planning and designing computer systems that integrate computer hardware, software and communication technologies, even though providing software might be an integral part, see 62.20 - data processing activities (e.g. by using blockchain / distributed ledger technology (DLT)), see 63.10 - operation of gambling sites, see 92.00 - repair and maintenance of computers and communication equipment, see 95.10
broader: Computer programming activities
in scheme: Statistical Classification of Economic Activities in the European Community, Rev. 2.1 (NACE Rev. 2.1)
Notation: 62.10
top concept of: Statistical Classification of Economic Activities in the European Community, Rev. 2.1 (NACE Rev. 2.1)

Manufacture of consumer electronics
type: Concept
CoreContentNote: This class includes the manufacture of electronic audio and video equipment for home entertainment, motor vehicle, public address systems and musical instrument amplification. This class includes: - manufacture of video recorders and duplicating equipment - manufacture of televisions - manufacture of television monitors and displays - manufacture of audio recording and duplicating equipment - manufacture of multimedia projectors suitable for use only or principally with transmission and reception apparatus for television broadcasting - manufacture of stereo equipment - manufacture of radio receivers - manufacture of speaker systems - manufacture of household-type video cameras - manufacture of jukeboxes - manufacture of amplifiers for musical instruments and public address systems - manufacture of microphones - manufacture of optical media players with optical reading systems - manufacture of karaoke machines - manufacture of headphones (e.g. for radio, stereo, computer) - manufacture of video game consoles - manufacture of personal audio and video headsets, including virtual reality headsets - manufacture of home theatre audio and video equipment
Exclusion Note: This class excludes: - reproduction of recorded media (computer media, sound, video, etc.), see 18.20 - manufacture of computer peripheral devices and computer monitors, see 26.20 - manufacture of telephone answering machines, see 26.30 - manufacture of pagers, see 26.30 - manufacture of remote-controlled devices (radio and infra-red), see 26.30 - manufacture of broadcast and studio equipment (e.g. reproduction equipment, transmitting and receiving antennas, commercial video cameras), see 26.30 - manufacture of antennas, see 26.30 - manufacture of digital cameras, see 26.70 - manufacture of electronic games with fixed (non-replaceable) software, see 32.40
broader: Manufacture of consumer electronics
in scheme: Statistical Classification of Economic Activities in the European Community, Rev. 2.1 (NACE Rev. 2.1)
Notation: 26.40
top concept of: Statistical Classification of Economic Activities in the European Community, Rev. 2.1 (NACE Rev. 2.1)

ConceptNoneRandom0.10224819623698844
type: ConceptAssociation
description: NACE Rev. 2.1 group 42.9 is mapped to NACE Rev. 2 groups 42.9, 43.9
Type: 26:18
Source Concept: Construction of other civil engineering projects
Target Concept: http://data.europa.eu/ux2/nace2/429
Target Concept: http://data.europa.eu/ux2/nace2/439
in scheme: Statistical Classification of Economic Activities in the European Community, Rev. 2.1 (NACE Rev. 2.1)
top concept of: Statistical Classification of Economic Activities in the European Community, Rev. 2.1 (NACE Rev. 2.1)
Mapping Cardinality: n m

Growing of rice
type: Concept
CoreContentNote: This class includes: - growing of rice
broader: Growing of non-perennial crops
in scheme: Statistical Classification of Economic Activities in the European Community, Rev. 2.1 (NACE Rev. 2.1)
Notation: 01.12
top concept of: Statistical Classification of Economic Activities in the European Community, Rev. 2.1 (NACE Rev. 2.1)

Support activities for fishing and aquaculture
type: Concept
Additional Content Note: This class also includes: - fishery (fishery guard) and aquaculture control
CoreContentNote: This class includes: - service activities incidental to marine or freshwater fishery or aquaculture, e.g.: • diving services for aquaculture • remotely operated underwater vehicles (ROV) services for aquaculture • repair and maintenance services for fish cages • other support activities on fishing and aquaculture n.e.c.
Exclusion Note: This class excludes: - fishing and aquaculture activities, see 03.1, 03.2 - processing of fish and aquaculture products on factory ships or in factories ashore, see 10.20 - processing of fish, crustaceans and molluscs, see 10.20 - activities related to the servicing of equipment and/or vessels, see division 33 - distribution of fisheries and aquaculture products, see divisions 46, 47, 52 - fishing practiced for sport or recreation and related services, see 93.19 - operation of sport fishing preserves, see 93.19
broader: Support activities for fishing and aquaculture
in scheme: Statistical Classification of Economic Activities in the European Community, Rev. 2.1 (NACE Rev. 2.1)
Notation: 03.30
top concept of: Statistical Classification of Economic Activities in the European Community, Rev. 2.1 (NACE Rev. 2.1)

Additional Content Note

ConceptNoneRandom0.9543907651137035
type: ConceptAssociation
description: NACE Rev. 2.1 class 86.93 is mapped to NACE Rev. 2 class 86.90
Type: 7:1
Source Concept: Activities of psychologists and psychotherapists, except medical doctors
Target Concept: http://data.europa.eu/ux2/nace2/8690
in scheme: Statistical Classification of Economic Activities in the European Community, Rev. 2.1 (NACE Rev. 2.1)
scope note: the content of the NACE Rev 2.1 class is fully covered in the corresponding NACE Rev 2 class
top concept of: Statistical Classification of Economic Activities in the European Community, Rev. 2.1 (NACE Rev. 2.1)
Mapping Cardinality: n 1

Preparation and spinning of textile fibres
type: Concept
Additional Content Note: This class also includes: - manufacture of paper yarn
CoreContentNote: This class includes preparatory operations on textile fibres and the spinning of textile fibres. This can be done from varying raw materials, whether new or recycled textile materials (for example, silk, cotton, wool, vegetable or man-made fibres and paper cellulose-based fibres, such as wood or straw). This class includes: - preparatory operations on textile fibres: • reeling and washing of silk • wool scouring, i.e. degreasing and carbonising of wool and dyeing of wool fleece • carding and combing of all kinds of animal, vegetable and man-made fibres - spinning and manufacture of yarn or thread for weaving or sewing, for trade or for further processing • scutching of flax • texturising, twisting, folding, cabling and dipping of synthetic or artificial filament yarns - spinning of recycled fibres from secondary raw materials
Exclusion Note: This class excludes: - preparatory operations carried out in combination with agriculture, see division 01 - retting of plants bearing vegetable textile fibres (jute, flax, coir, etc.), not associated with the growing of vegetable textile fibres, see 01.63 - cotton ginning, see 01.63 - manufacture of synthetic or artificial fibres and tows, manufacture of single yarns (including high-tenacity yarn and yarn for carpets) of synthetic or artificial fibres, see 20.60 - manufacture of glass fibres, see 23.14 - processing of textile waste into secondary raw materials, see 38.21
broader: Preparation and spinning of textile fibres
in scheme: Statistical Classification of Economic Activities in the European Community, Rev. 2.1 (NACE Rev. 2.1)
Notation: 13.10
top concept of: Statistical Classification of Economic Activities in the European Community, Rev. 2.1 (NACE Rev. 2.1)

ConceptNoneRandom0.70776383598308
type: ConceptAssociation
description: NACE Rev. 2.1 class 01.16 is mapped to NACE Rev. 2 class 01.16
Type: 1:1
Source Concept: Growing of fibre crops
Target Concept: http://data.europa.eu/ux2/nace2/0116
in scheme: Statistical Classification of Economic Activities in the European Community, Rev. 2.1 (NACE Rev. 2.1)
scope note: the content of the NACE Rev 2.1 class is fully covered in the corresponding NACE Rev 2 class
top concept of: Statistical Classification of Economic Activities in the European Community, Rev. 2.1 (NACE Rev. 2.1)
Mapping Cardinality: 1 1

ConceptNoneRandom0.9556230087699418
type: ConceptAssociation
description: NACE Rev. 2.1 class 27.33 is mapped to NACE Rev. 2 class 27.33
Type: 1:1
Source Concept: Manufacture of wiring devices
Target Concept: http://data.europa.eu/ux2/nace2/2733
in scheme: Statistical Classification of Economic Activities in the European Community, Rev. 2.1 (NACE Rev. 2.1)
scope note: the content of the NACE Rev 2.1 class is fully covered in the corresponding NACE Rev 2 class
top concept of: Statistical Classification of Economic Activities in the European Community, Rev. 2.1 (NACE Rev. 2.1)
Mapping Cardinality: 1 1

Intermediation service activities for freight transportation
type: Concept
CoreContentNote: This class includes the intermediation of freight transport, by bringing clients and service providers together for a fee or commission, without the intermediary providing the freight transport services that are intermediated. These intermediation activities can be carried out on digital platforms or through non-digital channels (including face-to-face, door-to-door, telephone, mail, and so on). The fee or commission can be received from either the client or the provider of the freight transport service. Revenue for the intermediation activities can include other sources of income (for example, revenues from the sale of advertising space). This class includes: - rail, road, ship and aircraft freight brokerage - operation of platforms for intermediation of freight transport services
Exclusion Note: This class excludes: - freight transport, see divisions 49, 50 and 51 - brokerage of passenger seats in ships and aircraft space, see 52.32
broader: Intermediation service activities for transportation
in scheme: Statistical Classification of Economic Activities in the European Community, Rev. 2.1 (NACE Rev. 2.1)
Notation: 52.31
top concept of: Statistical Classification of Economic Activities in the European Community, Rev. 2.1 (NACE Rev. 2.1)

Educational support activities n.e.c.
type: Concept
CoreContentNote: This class includes: - provision of non-instructional activities that support educational processes or systems: • educational consulting • vocational and career-related counselling activities • educational guidance counselling activities • educational testing evaluation activities • educational testing activities • organisation of student exchange programmes • examination and testing of regulated professions (e.g. pilots) • development of curricula • expert and rehabilitation activities examining learning ability
Exclusion Note: This class excludes: - research and experimental development on social sciences and humanities, see 72.20
broader: Educational support activities
in scheme: Statistical Classification of Economic Activities in the European Community, Rev. 2.1 (NACE Rev. 2.1)
Notation: 85.69
top concept of: Statistical Classification of Economic Activities in the European Community, Rev. 2.1 (NACE Rev. 2.1)

Activities of money market and non-money market investments funds
type: Concept
CoreContentNote: This class includes activities of money market and non-money market investment funds, in other words, collective investment schemes that raise funds by issuing shares or units to the public, of which the proceeds are invested primarily in financial assets (including short-term assets). This class includes: - open-end investment funds - closed-end investment funds - unit and investment trusts
Exclusion Note: This class excludes: - activities of holding companies, see 64.21 - activities of non-majority shareholding companies, not owning controlling levels of equity, see 64.32 - trusts, estate and agency accounts not acting as collective investment schemes, see 64.32 - activities of venture capital companies, see 64.99 - pension funding, see 65.30 - management of funds, see 66.30
broader: Activities of trusts, funds and similar financial entities
in scheme: Statistical Classification of Economic Activities in the European Community, Rev. 2.1 (NACE Rev. 2.1)
Notation: 64.31
top concept of: Statistical Classification of Economic Activities in the European Community, Rev. 2.1 (NACE Rev. 2.1)

ConceptNoneRandom0.42731027781731445
type: ConceptAssociation
description: NACE Rev. 2.1 group 51.1 is mapped to NACE Rev. 2 group 51.1
Type: 1:1
Source Concept: Passenger air transport
Target Concept: http://data.europa.eu/ux2/nace2/511
in scheme: Statistical Classification of Economic Activities in the European Community, Rev. 2.1 (NACE Rev. 2.1)
top concept of: Statistical Classification of Economic Activities in the European Community, Rev. 2.1 (NACE Rev. 2.1)
Mapping Cardinality: 1 1

ConceptNoneRandom0.9863833847052151
type: ConceptAssociation
description: NACE Rev. 2.1 class 09.90 is mapped to NACE Rev. 2 class 09.90
Type: 1:1
Source Concept: Support activities for other mining and quarrying
Target Concept: http://data.europa.eu/ux2/nace2/0990
in scheme: Statistical Classification of Economic Activities in the European Community, Rev. 2.1 (NACE Rev. 2.1)
scope note: the content of the NACE Rev 2.1 class is fully covered in the corresponding NACE Rev 2 class
top concept of: Statistical Classification of Economic Activities in the European Community, Rev. 2.1 (NACE Rev. 2.1)
Mapping Cardinality: 1 1

ConceptNoneRandom0.4539503034906903
type: ConceptAssociation
description: NACE Rev. 2.1 group 86.2 is mapped to NACE Rev. 2 group 86.2
Type: 1:1
Source Concept: Medical and dental practice activities
Target Concept: http://data.europa.eu/ux2/nace2/862
in scheme: Statistical Classification of Economic Activities in the European Community, Rev. 2.1 (NACE Rev. 2.1)
top concept of: Statistical Classification of Economic Activities in the European Community, Rev. 2.1 (NACE Rev. 2.1)
Mapping Cardinality: 1 1

Repair and maintenance of other civilian transport equipment
type: Concept
CoreContentNote: This class includes the repair and maintenance of other transport equipment of division 30. This class includes: - repair and maintenance of locomotives and the conversion of railway cars - repair of animal-drawn buggies and wagons - repair and maintenance of vehicles for the disabled - repair of hand-propelled or animal-drawn vehicles - repair and maintenance of shopping carts
Exclusion Note: This class excludes: - factory overhaul and rebuilding of locomotives and railway cars, see 30.20 - repair and maintenance of railway engines, see 33.12 - repair and maintenance of military fighting vehicles, see 33.18 - repair of bicycles, see 95.29 - repair and maintenance of motorcycles, see 95.32
broader: Repair and maintenance of fabricated metal products, machinery and equipment
in scheme: Statistical Classification of Economic Activities in the European Community, Rev. 2.1 (NACE Rev. 2.1)
Notation: 33.17
top concept of: Statistical Classification of Economic Activities in the European Community, Rev. 2.1 (NACE Rev. 2.1)

ConceptNoneRandom0.7953104277607195
type: ConceptAssociation
description: NACE Rev. 2.1 division 81 is mapped to NACE Rev. 2 divisions 43, 81
Type: 48:49
Source Concept: Services to buildings and landscape activities
Target Concept: http://data.europa.eu/ux2/nace2/81
Target Concept: http://data.europa.eu/ux2/nace2/43
in scheme: Statistical Classification of Economic Activities in the European Community, Rev. 2.1 (NACE Rev. 2.1)
top concept of: Statistical Classification of Economic Activities in the European Community, Rev. 2.1 (NACE Rev. 2.1)
Mapping Cardinality: n m

ConceptNoneRandom0.6736742906621379
type: ConceptAssociation
description: NACE Rev. 2.1 group 55.9 is mapped to NACE Rev. 2 groups 55.9, 68.2
Type: 2:2
Source Concept: Other accommodation
Target Concept: http://data.europa.eu/ux2/nace2/559
Target Concept: http://data.europa.eu/ux2/nace2/682
in scheme: Statistical Classification of Economic Activities in the European Community, Rev. 2.1 (NACE Rev. 2.1)
top concept of: Statistical Classification of Economic Activities in the European Community, Rev. 2.1 (NACE Rev. 2.1)
Mapping Cardinality: n m

Support activities for fishing and aquaculture
type: Concept
broader: Fishing and aquaculture
in scheme: Statistical Classification of Economic Activities in the European Community, Rev. 2.1 (NACE Rev. 2.1)
Notation: 03.3
top concept of: Statistical Classification of Economic Activities in the European Community, Rev. 2.1 (NACE Rev. 2.1)

Botanical and zoological garden and nature reserve activities
type: Concept
broader: Libraries, archives, museums and other cultural activities
in scheme: Statistical Classification of Economic Activities in the European Community, Rev. 2.1 (NACE Rev. 2.1)
Notation: 91.4
top concept of: Statistical Classification of Economic Activities in the European Community, Rev. 2.1 (NACE Rev. 2.1)

Manufacture of structural metal products
type: Concept
CoreContentNote: This group includes the manufacture of structural metal products (for example, metal frameworks or metal parts for parts of structures).
broader: Manufacture of fabricated metal products, except machinery and equipment
in scheme: Statistical Classification of Economic Activities in the European Community, Rev. 2.1 (NACE Rev. 2.1)
Notation: 25.1
top concept of: Statistical Classification of Economic Activities in the European Community, Rev. 2.1 (NACE Rev. 2.1)

Intermediation service activities for passenger transportation
type: Concept
Additional Content Note: This class also includes: - intermediation of transport by radio taxi services, without providing transport - fee-based reservation services for passenger transport
CoreContentNote: This class includes the intermediation of passenger transport, by bringing clients and service providers together for a fee or commission, without the intermediary providing the passenger transport services that are intermediated. These intermediation activities can be carried out on digital platforms or through non-digital channels (including face-to-face, door-to-door, telephone, mail, and so on). The fee or commission can be received from either the client or the provider of the passenger transport service. Revenue for the intermediation activities can include other sources of income (for example, revenues from the sale of advertising space). This class includes: - operation of online ride-sharing platforms that allow passengers to book a ride - provision of intermediation services for the purchase of land, water or air transport for passengers - brokerage of passenger seats in ships and aircraft space
Exclusion Note: This class excludes: - taxi operation and other passenger road transport, see 49.3 - rail, ship and aircraft freight brokerage, see 52.31 - operation of online platforms for the rental of vehicles (cars, motorcycles, etc.) without a driver, see 77.51 - units that provide reservation services alongside additional travel advice or expertise, see 79.11 - combined activities of accommodation, travel and food, i.e. travel agencies and tour operators, see 79.11, 79.12
broader: Intermediation service activities for transportation
in scheme: Statistical Classification of Economic Activities in the European Community, Rev. 2.1 (NACE Rev. 2.1)
Notation: 52.32
top concept of: Statistical Classification of Economic Activities in the European Community, Rev. 2.1 (NACE Rev. 2.1)

ConceptNoneRandom0.19443053807365918
type: ConceptAssociation
description: NACE Rev. 2.1 class 61.20 is mapped to NACE Rev. 2 classes 61.90, 82.99
Type: 78:65
Source Concept: Telecommunication reselling activities and intermediation service activities for telecommunication
Target Concept: http://data.europa.eu/ux2/nace2/6190
Target Concept: http://data.europa.eu/ux2/nace2/8299
in scheme: Statistical Classification of Economic Activities in the European Community, Rev. 2.1 (NACE Rev. 2.1)
scope note: 61.90: - reselling of wired, wireless, and satellite telecommunication (i.e. purchasing and reselling network capacity), including activities of telecommunication brokers and resellers of pre-paid calling cards and services
top concept of: Statistical Classification of Economic Activities in the European Community, Rev. 2.1 (NACE Rev. 2.1)
Mapping Cardinality: n m

Industrial product and fashion design activities
type: Concept
CoreContentNote: This class includes: - fashion design related to textiles, wearing apparel, shoes, jewellery, furniture and other interior decoration, and other fashion goods, as well as other personal or household goods - industrial design, carried out also through specialised software, i.e. creating and developing designs and specifications that optimise the use, value, package and appearance of products, including the determination of the materials, mechanism, shape, colour and surface finishes of the product, taking into consideration human characteristics and needs, safety, market appeal in distribution, use and maintenance
Exclusion Note: This class excludes: - engineering design, i.e. applying physical laws and principles of engineering in the design of machines, materials, instruments, structures, processes and systems, see 71.12 - design of computer plans for 3D printing, see 71.12
broader: Specialised design activities
in scheme: Statistical Classification of Economic Activities in the European Community, Rev. 2.1 (NACE Rev. 2.1)
Notation: 74.11
top concept of: Statistical Classification of Economic Activities in the European Community, Rev. 2.1 (NACE Rev. 2.1)

Real estate activities
type: Concept
broader: REAL ESTATE ACTIVITIES
in scheme: Statistical Classification of Economic Activities in the European Community, Rev. 2.1 (NACE Rev. 2.1)
Notation: 68
top concept of: Statistical Classification of Economic Activities in the European Community, Rev. 2.1 (NACE Rev. 2.1)

Manufacture of chemicals and chemical products
type: Concept
Additional Content Note: This division also includes: - manufacture of liquid biofuels
CoreContentNote: This division includes the transformation of organic and inorganic raw materials by a chemical process and the formation of products. It distinguishes the production of basic chemicals that constitute the first industry group from the production of intermediate and end-products produced by further processing of basic chemicals that make up the remaining industry classes.
broader: MANUFACTURING
in scheme: Statistical Classification of Economic Activities in the European Community, Rev. 2.1 (NACE Rev. 2.1)
Notation: 20
top concept of: Statistical Classification of Economic Activities in the European Community, Rev. 2.1 (NACE Rev. 2.1)

ConceptNoneRandom0.9977770947602775
type: ConceptAssociation
description: NACE Rev. 2.1 class 01.19 is mapped to NACE Rev. 2 class 01.19
Type: 3:3
Source Concept: Growing of other non-perennial crops
Target Concept: http://data.europa.eu/ux2/nace2/0119
in scheme: Statistical Classification of Economic Activities in the European Community, Rev. 2.1 (NACE Rev. 2.1)
scope note: the content of the NACE Rev 2.1 class is fully covered in the corresponding NACE Rev 2 class
top concept of: Statistical Classification of Economic Activities in the European Community, Rev. 2.1 (NACE Rev. 2.1)
Mapping Cardinality: n m

Member

ConceptNoneRandom0.8175875973803106
type: ConceptAssociation
description: NACE Rev. 2.1 class 85.61 is mapped to NACE Rev. 2 class 82.99
Type: 78:65
Source Concept: Intermediation service activities for courses and tutors
Target Concept: http://data.europa.eu/ux2/nace2/8299
in scheme: Statistical Classification of Economic Activities in the European Community, Rev. 2.1 (NACE Rev. 2.1)
scope note: the content of the NACE Rev 2.1 class is fully covered in the corresponding NACE Rev 2 class
top concept of: Statistical Classification of Economic Activities in the European Community, Rev. 2.1 (NACE Rev. 2.1)
Mapping Cardinality: n m

ConceptNoneRandom0.3872931487521416
type: ConceptAssociation
description: NACE Rev. 2.1 class 82.10 is mapped to NACE Rev. 2 classes 82.11, 82.19
Type: 4:5
Source Concept: Office administrative and support activities
Target Concept: http://data.europa.eu/ux2/nace2/8219
Target Concept: http://data.europa.eu/ux2/nace2/8211
in scheme: Statistical Classification of Economic Activities in the European Community, Rev. 2.1 (NACE Rev. 2.1)
scope note: 82.11: - provision of a combination of day-to-day office administrative services (for example, reception, financial planning, billing and record keeping, personnel, postal and mailing services, and so on) for others on a contract or fee basis 82.19: - document preparation, e.g. editing, proofreading, typing, word processing etc., and pre-archiving - other secretarial support services - transcription of documents - letter or resume writing - provision of a mailbox rental and other postal and mailing services, e.g. pre-sorting, addressing - duplicating - blueprinting - operation of photocopying machines for photocopying as a self-service - digitalisation of files (without any further processing of data) - formatting of e-books
top concept of: Statistical Classification of Economic Activities in the European Community, Rev. 2.1 (NACE Rev. 2.1)
Mapping Cardinality: n m

ConceptNoneRandom0.53176226015714
type: ConceptAssociation
description: NACE Rev. 2.1 class 86.94 is mapped to NACE Rev. 2 class 86.90
Type: 7:1
Source Concept: Nursing and midwifery activities
Target Concept: http://data.europa.eu/ux2/nace2/8690
in scheme: Statistical Classification of Economic Activities in the European Community, Rev. 2.1 (NACE Rev. 2.1)
scope note: the content of the NACE Rev 2.1 class is fully covered in the corresponding NACE Rev 2 class
top concept of: Statistical Classification of Economic Activities in the European Community, Rev. 2.1 (NACE Rev. 2.1)
Mapping Cardinality: n 1

ConceptNoneRandom0.5872466189611076
type: ConceptAssociation
description: NACE Rev. 2.1 class 25.12 is mapped to NACE Rev. 2 class 25.12
Type: 1:1
Source Concept: Manufacture of doors and windows of metal
Target Concept: http://data.europa.eu/ux2/nace2/2512
in scheme: Statistical Classification of Economic Activities in the European Community, Rev. 2.1 (NACE Rev. 2.1)
scope note: the content of the NACE Rev 2.1 class is fully covered in the corresponding NACE Rev 2 class
top concept of: Statistical Classification of Economic Activities in the European Community, Rev. 2.1 (NACE Rev. 2.1)
Mapping Cardinality: 1 1

ConceptNoneRandom0.11150556962743685
type: ConceptAssociation
description: NACE Rev. 2.1 group 51.2 is mapped to NACE Rev. 2 group 51.2
Type: 1:1
Source Concept: Freight air transport and space transport
Target Concept: http://data.europa.eu/ux2/nace2/512
in scheme: Statistical Classification of Economic Activities in the European Community, Rev. 2.1 (NACE Rev. 2.1)
top concept of: Statistical Classification of Economic Activities in the European Community, Rev. 2.1 (NACE Rev. 2.1)
Mapping Cardinality: 1 1

Repair and maintenance of civilian air and spacecraft
type: Concept
CoreContentNote: This class includes the repair and maintenance of civilian aircraft and spacecraft. This class includes: - repair and maintenance of civilian aircraft (except factory conversion, factory overhaul, factory rebuilding) - repair and maintenance of civilian aircraft engines
Exclusion Note: This class excludes: - factory overhaul and rebuilding of civilian aircraft, see 30.31 - factory overhaul of civilian aircraft engines, see 30.31 - repair and maintenance of military fighting vehicles, aircraft and spacecraft, see 33.18
broader: Repair and maintenance of fabricated metal products, machinery and equipment
in scheme: Statistical Classification of Economic Activities in the European Community, Rev. 2.1 (NACE Rev. 2.1)
Notation: 33.16
top concept of: Statistical Classification of Economic Activities in the European Community, Rev. 2.1 (NACE Rev. 2.1)

ConceptNoneRandom0.542949036884757
type: ConceptAssociation
description: NACE Rev. 2.1 division 80 is mapped to NACE Rev. 2 divisions 74, 80
Type: 48:49
Source Concept: Investigation and security activities
Target Concept: http://data.europa.eu/ux2/nace2/80
Target Concept: http://data.europa.eu/ux2/nace2/74
in scheme: Statistical Classification of Economic Activities in the European Community, Rev. 2.1 (NACE Rev. 2.1)
top concept of: Statistical Classification of Economic Activities in the European Community, Rev. 2.1 (NACE Rev. 2.1)
Mapping Cardinality: n m

Manufacture of tanks, reservoirs and containers of metal
type: Concept
CoreContentNote: This group includes the manufacture of metal tanks, central heating radiators, steam or other vapour generating boilers (other than central heating boilers).
broader: Manufacture of fabricated metal products, except machinery and equipment
in scheme: Statistical Classification of Economic Activities in the European Community, Rev. 2.1 (NACE Rev. 2.1)
Notation: 25.2
top concept of: Statistical Classification of Economic Activities in the European Community, Rev. 2.1 (NACE Rev. 2.1)

Machining of metals
type: Concept
CoreContentNote: This class includes: - boring, turning, milling, eroding, planing, lapping, broaching, levelling, sawing, grinding, sharpening, deburring, sandblasting, tumbling, polishing, buffing, welding, splicing, etc., of metalwork pieces - cutting of and engraving or writing on metals by means of laser beams
Exclusion Note: This class excludes: - activities of farriers, see 01.62
broader: Treatment and coating of metals; machining
in scheme: Statistical Classification of Economic Activities in the European Community, Rev. 2.1 (NACE Rev. 2.1)
Notation: 25.53
top concept of: Statistical Classification of Economic Activities in the European Community, Rev. 2.1 (NACE Rev. 2.1)

Manufacture of tubes, pipes, hollow profiles and related fittings, of steel
type: Concept
CoreContentNote: This class includes: - manufacture of seamless tubes and pipes of circular or non-circular cross section and of blanks of circular cross section, for further processing, by hot rolling, hot extrusion or by other hot processes of an intermediate product, which can be a bar or a billet obtained by hot rolling or continuous casting - manufacture of precision and non-precision seamless tubes and pipes from hot-rolled or hot-extruded blanks by further processing, by cold drawing or cold rolling of tubes and pipes of circular cross section and by cold drawing only for tubes and pipes of non-circular cross section and hollow profiles - manufacture of welded tubes and pipes of an external diameter exceeding 406,4 mm, cold formed from hot-rolled flat products and longitudinally or spirally welded - manufacture of welded tubes and pipes of an external diameter of 406,4 mm or less of circular cross section by continuous cold or hot forming of hot- or cold-rolled flat products and longitudinally or spirally welded and of non-circular cross section by hot or cold forming into shape from hot- or cold-rolled strip longitudinally welded - manufacture of welded precision tubes and pipes of an external diameter of 406,4 mm or less by hot or cold forming of hot- or cold-rolled strip and longitudinally welded delivered as welded or further processed, by cold drawing or cold rolling or cold formed into shape for tube and pipe of non-circular cross section - manufacture of flat flanges and flanges with forged collars by processing of hot-rolled flat products of steel - manufacture of butt-welding fittings (e.g. elbows and reductions), by forging of hot-rolled seamless tubes of steel - threaded and other tube or pipe fittings of steel
Exclusion Note: This class excludes: - manufacture of seamless tubes and pipes of steel by centrifugally casting, see 24.52
broader: Manufacture of tubes, pipes, hollow profiles and related fittings, of steel
in scheme: Statistical Classification of Economic Activities in the European Community, Rev. 2.1 (NACE Rev. 2.1)
Notation: 24.20
top concept of: Statistical Classification of Economic Activities in the European Community, Rev. 2.1 (NACE Rev. 2.1)

Legal and accounting activities
type: Concept
Additional Content Note: It also includes the preparation of legal documents (for example, articles of incorporation, partnership agreements or similar documents in connection with company formation, patents and copyrights, preparation of deeds, wills, trusts, and so on) as well as other activities of public notaries, civil law notaries, bailiffs, arbitrators, examiners and referees. It also includes accounting and bookkeeping services (for example, auditing of accounting records, preparing financial statements and bookkeeping).
CoreContentNote: This division includes legal representation of one party’s interest against another party, whether or not before courts or other judicial bodies by, or under the supervision of, persons who are members of the bar (for example, advice and representation in civil cases, advice and representation in criminal actions, advice and representation in connection with labour disputes). The activities of this division may also be provided online.
broader: PROFESSIONAL, SCIENTIFIC AND TECHNICAL ACTIVITIES
in scheme: Statistical Classification of Economic Activities in the European Community, Rev. 2.1 (NACE Rev. 2.1)
Notation: 69
top concept of: Statistical Classification of Economic Activities in the European Community, Rev. 2.1 (NACE Rev. 2.1)

Manufacture of basic pharmaceutical products and pharmaceutical preparations
type: Concept
Additional Content Note: This division also includes the manufacture of medicinal chemical and botanical products.
CoreContentNote: This division includes the manufacture of basic pharmaceutical products and pharmaceutical preparations.
broader: MANUFACTURING
in scheme: Statistical Classification of Economic Activities in the European Community, Rev. 2.1 (NACE Rev. 2.1)
Notation: 21
top concept of: Statistical Classification of Economic Activities in the European Community, Rev. 2.1 (NACE Rev. 2.1)

ConceptNoneRandom0.6665554594155395
type: ConceptAssociation
description: NACE Rev. 2.1 class 27.31 is mapped to NACE Rev. 2 class 27.31
Type: 1:1
Source Concept: Manufacture of fibre optic cables
Target Concept: http://data.europa.eu/ux2/nace2/2731
in scheme: Statistical Classification of Economic Activities in the European Community, Rev. 2.1 (NACE Rev. 2.1)
scope note: the content of the NACE Rev 2.1 class is fully covered in the corresponding NACE Rev 2 class
top concept of: Statistical Classification of Economic Activities in the European Community, Rev. 2.1 (NACE Rev. 2.1)
Mapping Cardinality: 1 1

ConceptNoneRandom0.9126596920168232
type: ConceptAssociation
description: NACE Rev. 2.1 class 86.95 is mapped to NACE Rev. 2 class 86.90
Type: 7:1
Source Concept: Physiotherapy activities
Target Concept: http://data.europa.eu/ux2/nace2/8690
in scheme: Statistical Classification of Economic Activities in the European Community, Rev. 2.1 (NACE Rev. 2.1)
scope note: the content of the NACE Rev 2.1 class is fully covered in the corresponding NACE Rev 2 class
top concept of: Statistical Classification of Economic Activities in the European Community, Rev. 2.1 (NACE Rev. 2.1)
Mapping Cardinality: n 1

ConceptNoneRandom0.09619211829730923
type: ConceptAssociation
description: NACE Rev. 2.1 group 68.2 is mapped to NACE Rev. 2 group 68.2
Type: 2:2
Source Concept: Rental and operating of own or leased real estate
Target Concept: http://data.europa.eu/ux2/nace2/682
in scheme: Statistical Classification of Economic Activities in the European Community, Rev. 2.1 (NACE Rev. 2.1)
top concept of: Statistical Classification of Economic Activities in the European Community, Rev. 2.1 (NACE Rev. 2.1)
Mapping Cardinality: n m

ConceptNoneRandom0.4994368975569333
type: ConceptAssociation
description: NACE Rev. 2.1 group 33.1 is mapped to NACE Rev. 2 groups 30.4, 33.1
Type: 26:18
Source Concept: Repair and maintenance of fabricated metal products, machinery and equipment
Target Concept: http://data.europa.eu/ux2/nace2/331
Target Concept: http://data.europa.eu/ux2/nace2/304
in scheme: Statistical Classification of Economic Activities in the European Community, Rev. 2.1 (NACE Rev. 2.1)
top concept of: Statistical Classification of Economic Activities in the European Community, Rev. 2.1 (NACE Rev. 2.1)
Mapping Cardinality: n m

ConceptNoneRandom0.705146566446431
type: ConceptAssociation
description: NACE Rev. 2.1 group 46.4 is mapped to NACE Rev. 2 groups 46.4, 46.6
Type: 3:3
Source Concept: Wholesale of household goods
Target Concept: http://data.europa.eu/ux2/nace2/466
Target Concept: http://data.europa.eu/ux2/nace2/464
in scheme: Statistical Classification of Economic Activities in the European Community, Rev. 2.1 (NACE Rev. 2.1)
top concept of: Statistical Classification of Economic Activities in the European Community, Rev. 2.1 (NACE Rev. 2.1)
Mapping Cardinality: n m

Other cleaning activities
type: Concept
CoreContentNote: This class includes: - swimming pool cleaning and maintenance activities - cleaning of trains, buses, planes, etc. - cleaning of the inside of road and sea tankers - sanitising, disinfecting and exterminating activities - bottle cleaning - street sweeping and snow and ice removal - other cleaning activities n.e.c.
Exclusion Note: This class excludes: - agricultural pest control, see 01.61 - cleaning of motor vehicles, including car washing, see 95.31
broader: Cleaning activities
in scheme: Statistical Classification of Economic Activities in the European Community, Rev. 2.1 (NACE Rev. 2.1)
Notation: 81.23
top concept of: Statistical Classification of Economic Activities in the European Community, Rev. 2.1 (NACE Rev. 2.1)

Legal activities
type: Concept
Additional Content Note: This class also includes: - legal mediation activities - activities of appointed legal guardians, without provision of residential care
CoreContentNote: This class includes: - legal representation of one party’s interest against another party, whether or not before courts or other judicial bodies by, or under the supervision of, persons who are members of the bar: • advice and representation in civil cases • advice and representation in criminal cases • advice and representation in connection with labour disputes - general counselling and advising, preparation of legal documents: • articles of incorporation, partnership agreements or similar documents in connection with company formation • patents and copyrights • preparation of deeds, wills, trusts, etc. - other activities of public notaries, civil law notaries, bailiffs, arbitrators, examiners and referees
Exclusion Note: This class excludes: - activities of law courts, see 84.23 - social mediation, see 88.99
broader: Legal activities
in scheme: Statistical Classification of Economic Activities in the European Community, Rev. 2.1 (NACE Rev. 2.1)
Notation: 69.10
top concept of: Statistical Classification of Economic Activities in the European Community, Rev. 2.1 (NACE Rev. 2.1)

Museum, collection, historical site and monument activities
type: Concept
CoreContentNote: This group includes the operation, management, care, preservation, exhibition and assessment of cultural heritage: tangible, intangible and digital in a wide variety of types of collections (both private and public). It includes activities pertaining to cultural heritage places as a result of human intervention in its surroundings, from landscapes to gardens, from historical and archaeological sites to buildings.
Exclusion Note: This group excludes: - renovation, renewal, reconstruction and retrofitting of historical and archaeological sites and buildings, see 43.99 - retail sale of paintings and sculptures (activities of commercial art galleries), see 47.69 - architectural activities to support the conservation and restoration of cultural heritage properties, see 71.11 - activities related to conservation and restoration of cultural heritage, see 91.30
broader: Libraries, archives, museums and other cultural activities
in scheme: Statistical Classification of Economic Activities in the European Community, Rev. 2.1 (NACE Rev. 2.1)
Notation: 91.2
top concept of: Statistical Classification of Economic Activities in the European Community, Rev. 2.1 (NACE Rev. 2.1)

Fishing
type: Concept
CoreContentNote: This group includes capture fishery, in other words, the harvesting, collecting and gathering activities directed at removing or collecting live wild aquatic organisms (predominantly fish, molluscs and crustaceans), including plants from the oceanic, coastal or inland waters for human consumption and other purposes by hand or more usually by various types of fishing gear (for example, nets, lines, stationary traps). Such activities can be conducted on the intertidal zones (for example, the collection of molluscs, such as mussels, oysters), coastal waters or offshore waters. These activities also include fishing in restocked water bodies.
broader: Fishing and aquaculture
in scheme: Statistical Classification of Economic Activities in the European Community, Rev. 2.1 (NACE Rev. 2.1)
Notation: 03.1
top concept of: Statistical Classification of Economic Activities in the European Community, Rev. 2.1 (NACE Rev. 2.1)

ConceptNoneRandom0.4715925079601988
type: ConceptAssociation
description: NACE Rev. 2.1 division 43 is mapped to NACE Rev. 2 divisions 41, 42, 43, 82
Type: 48:49
Source Concept: Specialised construction activities
Target Concept: http://data.europa.eu/ux2/nace2/41
Target Concept: http://data.europa.eu/ux2/nace2/82
Target Concept: http://data.europa.eu/ux2/nace2/42
Target Concept: http://data.europa.eu/ux2/nace2/43
in scheme: Statistical Classification of Economic Activities in the European Community, Rev. 2.1 (NACE Rev. 2.1)
top concept of: Statistical Classification of Economic Activities in the European Community, Rev. 2.1 (NACE Rev. 2.1)
Mapping Cardinality: n m

ConceptNoneRandom0.6880740929116069
type: ConceptAssociation
description: NACE Rev. 2.1 class 52.31 is mapped to NACE Rev. 2 class 52.29
Type: 78:65
Source Concept: Intermediation service activities for freight transportation
Target Concept: http://data.europa.eu/ux2/nace2/5229
in scheme: Statistical Classification of Economic Activities in the European Community, Rev. 2.1 (NACE Rev. 2.1)
scope note: the content of the NACE Rev 2.1 class is fully covered in the corresponding NACE Rev 2 class
top concept of: Statistical Classification of Economic Activities in the European Community, Rev. 2.1 (NACE Rev. 2.1)
Mapping Cardinality: n m

ConceptNoneRandom0.08441328085082755
type: ConceptAssociation
description: NACE Rev. 2.1 class 16.22 is mapped to NACE Rev. 2 class 16.22
Type: 17:12
Source Concept: Manufacture of assembled parquet floors
Target Concept: http://data.europa.eu/ux2/nace2/1622
in scheme: Statistical Classification of Economic Activities in the European Community, Rev. 2.1 (NACE Rev. 2.1)
scope note: the content of the NACE Rev 2.1 class is fully covered in the corresponding NACE Rev 2 class
top concept of: Statistical Classification of Economic Activities in the European Community, Rev. 2.1 (NACE Rev. 2.1)
Mapping Cardinality: n m

Patient transportation by ambulance
type: Concept
Additional Content Note: This class also includes: - specialised transport of patients, accompanied by paramedics - primary care given by a paramedic or a doctor during the patient’s transport by ambulance
CoreContentNote: This class includes ambulance transport of patients by any mode of transport, including airplanes. Ambulance vehicles carry paramedics / medical doctors and are usually equipped with lifesaving equipment.
Exclusion Note: This class excludes: - transport of patients in vehicles without paramedical practitioners and equipment for lifesaving, see divisions 49, 50 - transport of patients in airplanes without paramedical practitioners and equipment for lifesaving, see division 51 - transport of blood and body organs/fluids, see 86.99
broader: Other human health activities
in scheme: Statistical Classification of Economic Activities in the European Community, Rev. 2.1 (NACE Rev. 2.1)
Notation: 86.92
top concept of: Statistical Classification of Economic Activities in the European Community, Rev. 2.1 (NACE Rev. 2.1)

Manufacture of power-driven hand tools
type: Concept
CoreContentNote: This class includes: - manufacture of hand tools, with self-contained electric or non-electric motor or pneumatic drive, e.g.: • circular or reciprocating saws • chainsaws • drills and hammer drills • handheld power sanders • pneumatic nailers • buffers • routers • grinders • staplers • pneumatic rivet guns • planers • shears and nibblers • impact wrenches • powder-actuated nailers
Exclusion Note: This class excludes: - manufacture of hand tools and interchangeable parts for pneumatic and power tools, see 25.63 - manufacture of electrical handheld soldering and welding machines and apparatus, see 27.90
broader: Manufacture of other general-purpose machinery
in scheme: Statistical Classification of Economic Activities in the European Community, Rev. 2.1 (NACE Rev. 2.1)
Notation: 28.24
top concept of: Statistical Classification of Economic Activities in the European Community, Rev. 2.1 (NACE Rev. 2.1)

Wholesale of household, office and shop furniture, carpets and lighting equipment
type: Concept
Additional Content Note: This class also includes: - wholesale of furniture for warehouses, churches, medical facilities and hospitals, etc.
CoreContentNote: This class includes: - wholesale of furniture - wholesale of carpets - wholesale of lighting equipment - wholesale of mattresses and box springs
broader: Wholesale of household goods
in scheme: Statistical Classification of Economic Activities in the European Community, Rev. 2.1 (NACE Rev. 2.1)
Notation: 46.47
top concept of: Statistical Classification of Economic Activities in the European Community, Rev. 2.1 (NACE Rev. 2.1)

Waste recovery
type: Concept
CoreContentNote: This group includes waste pretreatment and recovery of both non-hazardous and hazardous waste. Included are materials recovery, energy recovery resulting from thermal treatment of waste and other forms of waste recovery. Treatment prior to recovery of various forms of waste by different means is also included in the group.
Exclusion Note: This group excludes: - treatment and disposal of wastewater, see 37.00 - waste disposal without recovery, see 38.3
broader: Waste collection, recovery and disposal activities
in scheme: Statistical Classification of Economic Activities in the European Community, Rev. 2.1 (NACE Rev. 2.1)
Notation: 38.2
top concept of: Statistical Classification of Economic Activities in the European Community, Rev. 2.1 (NACE Rev. 2.1)

Manufacture of solid fuels from vegetable biomass
type: Concept
CoreContentNote: This class includes: - manufacture of briquettes, fire logs and pellets from agglomerated sawdust, wood waste and scrap, straw or other vegetable biomass
Exclusion Note: This class excludes: - manufacture of animal feed from soybean waste, see 10.9 - slicing, peeling or chipping logs, see 16.11 - manufacture of peat briquettes, see 19.20
broader: Manufacture of products of wood, cork, straw and plaiting materials
in scheme: Statistical Classification of Economic Activities in the European Community, Rev. 2.1 (NACE Rev. 2.1)
Notation: 16.26
top concept of: Statistical Classification of Economic Activities in the European Community, Rev. 2.1 (NACE Rev. 2.1)

ConceptNoneRandom0.5936522956738961
type: ConceptAssociation
description: NACE Rev. 2.1 class 10.91 is mapped to NACE Rev. 2 class 10.91
Type: 1:1
Source Concept: Manufacture of prepared feeds for farm animals
Target Concept: http://data.europa.eu/ux2/nace2/1091
in scheme: Statistical Classification of Economic Activities in the European Community, Rev. 2.1 (NACE Rev. 2.1)
scope note: the content of the NACE Rev 2.1 class is fully covered in the corresponding NACE Rev 2 class
top concept of: Statistical Classification of Economic Activities in the European Community, Rev. 2.1 (NACE Rev. 2.1)
Mapping Cardinality: 1 1

Activities of amusement parks and theme parks
type: Concept
Additional Content Note: This class also includes: - activities of aqua/water parks
CoreContentNote: This class includes the activities of amusement parks and theme parks characterised by a permanent and site-based operation of a variety of attractions (for example, mechanical rides, carousels, games, shooting galleries, shows, theme exhibits, picnic grounds) that are provided under the economic and operational directive of a central operator. These parks are typically located in structurally delimited areas, for which customers must pay admission.
Exclusion Note: This class excludes: - operation of gambling or lottery games, see 92.00 - operation of mechanical rides, games and shows by independent providers (e.g. at fairgrounds, festivals, Christmas markets), see 93.29
broader: Amusement and recreation activities
in scheme: Statistical Classification of Economic Activities in the European Community, Rev. 2.1 (NACE Rev. 2.1)
Notation: 93.21
top concept of: Statistical Classification of Economic Activities in the European Community, Rev. 2.1 (NACE Rev. 2.1)

Manufacture of pulp
type: Concept
CoreContentNote: This class includes: - manufacture of bleached, semi-bleached or unbleached paper pulp by mechanical, chemical (dissolving or non-dissolving) or semi-chemical processes - manufacture of cotton linter pulp - removal of ink and manufacture of pulp from waste paper
broader: Manufacture of pulp, paper and paperboard
in scheme: Statistical Classification of Economic Activities in the European Community, Rev. 2.1 (NACE Rev. 2.1)
Notation: 17.11
top concept of: Statistical Classification of Economic Activities in the European Community, Rev. 2.1 (NACE Rev. 2.1)

ConceptNoneRandom0.9758610455778144
type: ConceptAssociation
description: NACE Rev. 2.1 class 28.21 is mapped to NACE Rev. 2 classes 25.21, 28.21
Type: 8:9
Source Concept: Manufacture of ovens, furnaces and permanent household heating equipment
Target Concept: http://data.europa.eu/ux2/nace2/2521
Target Concept: http://data.europa.eu/ux2/nace2/2821
in scheme: Statistical Classification of Economic Activities in the European Community, Rev. 2.1 (NACE Rev. 2.1)
scope note: 25.21: - manufacture of central heating boilers 28.21: - manufacture of electrical and other industrial and laboratory furnaces and ovens, including incinerators - manufacture of furnace burners - manufacture of solar water heaters and similar equipment - manufacture of household cooling and ventilation equipment - manufacture of mechanical stokers, grates, ash dischargers etc. - manufacture of generally non-reversible heat pumps (only working in one direction), mainly used for space heating or for domestic hot water supply
top concept of: Statistical Classification of Economic Activities in the European Community, Rev. 2.1 (NACE Rev. 2.1)
Mapping Cardinality: n m

ConceptNoneRandom0.5667821617457014
type: ConceptAssociation
description: NACE Rev. 2.1 group 33.2 is mapped to NACE Rev. 2 group 33.2
Type: 1:1
Source Concept: Installation of industrial machinery and equipment
Target Concept: http://data.europa.eu/ux2/nace2/332
in scheme: Statistical Classification of Economic Activities in the European Community, Rev. 2.1 (NACE Rev. 2.1)
top concept of: Statistical Classification of Economic Activities in the European Community, Rev. 2.1 (NACE Rev. 2.1)
Mapping Cardinality: 1 1

ConceptNoneRandom0.5722723050694832
type: ConceptAssociation
description: NACE Rev. 2.1 class 74.11 is mapped to NACE Rev. 2 class 74.10
Type: 4:1
Source Concept: Industrial product and fashion design activities
Target Concept: http://data.europa.eu/ux2/nace2/7410
in scheme: Statistical Classification of Economic Activities in the European Community, Rev. 2.1 (NACE Rev. 2.1)
scope note: the content of the NACE Rev 2.1 class is fully covered in the corresponding NACE Rev 2 class
top concept of: Statistical Classification of Economic Activities in the European Community, Rev. 2.1 (NACE Rev. 2.1)
Mapping Cardinality: n 1

ConceptNoneRandom0.1462101433271158
type: ConceptAssociation
description: NACE Rev. 2.1 group 68.3 is mapped to NACE Rev. 2 group 68.3
Type: 1:1
Source Concept: Real estate activities on a fee or contract basis
Target Concept: http://data.europa.eu/ux2/nace2/683
in scheme: Statistical Classification of Economic Activities in the European Community, Rev. 2.1 (NACE Rev. 2.1)
top concept of: Statistical Classification of Economic Activities in the European Community, Rev. 2.1 (NACE Rev. 2.1)
Mapping Cardinality: 1 1

ConceptNoneRandom0.6869706529771242
type: ConceptAssociation
description: NACE Rev. 2.1 group 46.5 is mapped to NACE Rev. 2 groups 46.5, 46.6
Type: 3:3
Source Concept: Wholesale of information and communication equipment
Target Concept: http://data.europa.eu/ux2/nace2/466
Target Concept: http://data.europa.eu/ux2/nace2/465
in scheme: Statistical Classification of Economic Activities in the European Community, Rev. 2.1 (NACE Rev. 2.1)
top concept of: Statistical Classification of Economic Activities in the European Community, Rev. 2.1 (NACE Rev. 2.1)
Mapping Cardinality: n m

Activities of psychologists and psychotherapists, except medical doctors
type: Concept
Additional Content Note: This class also includes: - music therapy activities performed by psychotherapists/psychologists
CoreContentNote: This class includes: - consultation and treatment activities of psychologists (e.g. clinical psychologists, health psychologists, psychotherapists), except medical doctors
Exclusion Note: This class excludes: - activities of psychiatrists, see 86.22
broader: Other human health activities
in scheme: Statistical Classification of Economic Activities in the European Community, Rev. 2.1 (NACE Rev. 2.1)
Notation: 86.93
top concept of: Statistical Classification of Economic Activities in the European Community, Rev. 2.1 (NACE Rev. 2.1)

Waste disposal without recovery
type: Concept
Additional Content Note: This group also includes burial or ploughing under of refuse; disposal of used goods to eliminate harmful waste.
CoreContentNote: This group includes waste disposal of both non-hazardous and hazardous waste. Included are thermal treatment without energy recovery, landfilling, release in bodies of water and permanent storage of waste. Treatment prior to disposal of various forms of waste by different means (for example, the treatment of organic waste with the aim of disposal; the treatment and disposal of toxic live or dead animals and other contaminated waste; the treatment and disposal of transitional radioactive waste from hospitals, etc.) are also included.
Exclusion Note: This group excludes: - treatment and disposal of wastewater, see 37.00 - waste recovery, see 38.2
broader: Waste collection, recovery and disposal activities
in scheme: Statistical Classification of Economic Activities in the European Community, Rev. 2.1 (NACE Rev. 2.1)
Notation: 38.3
top concept of: Statistical Classification of Economic Activities in the European Community, Rev. 2.1 (NACE Rev. 2.1)

Conservation, restoration and other support activities for cultural heritage
type: Concept
broader: Libraries, archives, museums and other cultural activities
in scheme: Statistical Classification of Economic Activities in the European Community, Rev. 2.1 (NACE Rev. 2.1)
Notation: 91.3
top concept of: Statistical Classification of Economic Activities in the European Community, Rev. 2.1 (NACE Rev. 2.1)

Aquaculture
type: Concept
Additional Content Note: This group also includes: - breeding/farming of fry and adults under artificial conditions
CoreContentNote: This group includes aquaculture (or aquafarming), in other words, the production process involving the culturing or farming (including harvesting) of aquatic organisms (for example, fish, molluscs, crustaceans, plants, amphibians) using techniques designed to increase the production of the organisms in question beyond the natural capacity of the environment (for example, regular stocking, feeding and protection from predators). Aquaculture also encompasses individual, corporate or state ownership of the individual organisms throughout the rearing or culture stage, up to and including harvesting. Culturing/farming refers to the rearing up to their juvenile and/or adult phase under captive conditions of the above organisms.
Exclusion Note: This group excludes: - production of bird skins from ranching operations or skins from farming reptiles (e.g. snakes and turtles), see 01.48 - breeding and raising of reptiles, see 01.48
broader: Fishing and aquaculture
in scheme: Statistical Classification of Economic Activities in the European Community, Rev. 2.1 (NACE Rev. 2.1)
Notation: 03.2
top concept of: Statistical Classification of Economic Activities in the European Community, Rev. 2.1 (NACE Rev. 2.1)

ConceptNoneRandom0.3372243344998588
type: ConceptAssociation
description: NACE Rev. 2.1 division 42 is mapped to NACE Rev. 2 divisions 42, 43
Type: 48:49
Source Concept: Civil engineering
Target Concept: http://data.europa.eu/ux2/nace2/42
Target Concept: http://data.europa.eu/ux2/nace2/43
in scheme: Statistical Classification of Economic Activities in the European Community, Rev. 2.1 (NACE Rev. 2.1)
top concept of: Statistical Classification of Economic Activities in the European Community, Rev. 2.1 (NACE Rev. 2.1)
Mapping Cardinality: n m

ConceptNoneRandom0.7172152971161394
type: ConceptAssociation
description: NACE Rev. 2.1 class 16.21 is mapped to NACE Rev. 2 class 16.21
Type: 17:12
Source Concept: Manufacture of veneer sheets and wood-based panels
Target Concept: http://data.europa.eu/ux2/nace2/1621
in scheme: Statistical Classification of Economic Activities in the European Community, Rev. 2.1 (NACE Rev. 2.1)
scope note: the content of the NACE Rev 2.1 class is fully covered in the corresponding NACE Rev 2 class
top concept of: Statistical Classification of Economic Activities in the European Community, Rev. 2.1 (NACE Rev. 2.1)
Mapping Cardinality: n m

Transport via pipeline
type: Concept
Additional Content Note: This class also includes: - operation of pump stations for transport via pipelines
CoreContentNote: This class includes: - transport of gases, liquids, water, slurry and other commodities via pipelines - pipeline transport of natural gas from processing plants to local distribution systems
Exclusion Note: This class excludes: - distribution of gaseous fuels, steam or water to end users through local or regional network of mains, see 35.22, 35.30, 36.00 - distribution of water by trucks, see 36.00 - retail sale of automotive fuel, see 47.30 - transport of liquids by trucks, see 49.41
broader: Transport via pipeline
in scheme: Statistical Classification of Economic Activities in the European Community, Rev. 2.1 (NACE Rev. 2.1)
Notation: 49.50
top concept of: Statistical Classification of Economic Activities in the European Community, Rev. 2.1 (NACE Rev. 2.1)

Manufacture of office machinery and equipment, except computers and peripheral equipment
type: Concept
CoreContentNote: This class includes: - manufacture of calculating machines - manufacture of cash registers - manufacture of calculators - manufacture of postage meters, mail handling machines (envelope stuffing, sealing and addressing machinery; opening, sorting, scanning) - manufacture of typewriters and stenography machines - manufacture of office-type binding equipment (i.e. plastic or tape binding) - manufacture of coin sorting, coin counting and coin wrapping machines - manufacture of pencil sharpening machines - manufacture of stapling machines - manufacture of voting machines - manufacture of tape dispensers - manufacture of hole punches - manufacture of photocopy machines - manufacture of blackboards; whiteboards and marker boards with writing or drawing surfaces - manufacture of dictating machines
Exclusion Note: This class excludes: - manufacture of pencil sharpeners, see 25.61 - manufacture of computers and peripheral equipment, see 26.20
broader: Manufacture of other general-purpose machinery
in scheme: Statistical Classification of Economic Activities in the European Community, Rev. 2.1 (NACE Rev. 2.1)
Notation: 28.23
top concept of: Statistical Classification of Economic Activities in the European Community, Rev. 2.1 (NACE Rev. 2.1)

Business support service activities n.e.c.
type: Concept
CoreContentNote: This group includes the activities of collection agencies, credit bureaux, business information agencies and all support activities not elsewhere classified. These activities are predominantly provided to businesses.
broader: Office administrative, office support and other business support activities
in scheme: Statistical Classification of Economic Activities in the European Community, Rev. 2.1 (NACE Rev. 2.1)
Notation: 82.9
top concept of: Statistical Classification of Economic Activities in the European Community, Rev. 2.1 (NACE Rev. 2.1)

Wholesale of watches and jewellery
type: Concept
Additional Content Note: This class also includes: - wholesale of processed precious, natural, synthetic or reconstructed stones
Exclusion Note: This class excludes: - wholesale of imitation jewellery, see 46.49 - wholesale of raw precious stones, see 46.86 - wholesale of unworked synthetic or reconstructed precious or semi-precious stones, see 46.86
broader: Wholesale of household goods
in scheme: Statistical Classification of Economic Activities in the European Community, Rev. 2.1 (NACE Rev. 2.1)
Notation: 46.48
top concept of: Statistical Classification of Economic Activities in the European Community, Rev. 2.1 (NACE Rev. 2.1)

ConceptNoneRandom0.4974477003033748
type: ConceptAssociation
description: NACE Rev. 2.1 class 42.99 is mapped to NACE Rev. 2 classes 42.99, 43.99
Type: 23:16
Source Concept: Construction of other civil engineering projects n.e.c.
Target Concept: http://data.europa.eu/ux2/nace2/4399
Target Concept: http://data.europa.eu/ux2/nace2/4299
in scheme: Statistical Classification of Economic Activities in the European Community, Rev. 2.1 (NACE Rev. 2.1)
scope note: 42.99: - construction of industrial facilities, except buildings, e.g.: • mining facilities, e.g. shafts, towers, tunnels • refineries • chemical plants • grain storage systems - construction of other facilities, except buildings, e.g.: • outdoor sports facilities - construction of playgrounds - construction of non-prefabricated swimming pools 43.99: - construction of non-prefabricated swimming pools
top concept of: Statistical Classification of Economic Activities in the European Community, Rev. 2.1 (NACE Rev. 2.1)
Mapping Cardinality: n m

Intermediation service activities for repair and maintenance of computers, personal and household goods, and motor vehicles and motorcycles
type: Concept
CoreContentNote: This class includes intermediation for the repair and maintenance of computers, personal and household goods, motor vehicles and motorcycles by bringing clients and service providers together for a fee or commission, without the intermediary providing the services intermediated. These intermediation activities can be carried out on digital platforms or through non-digital channels (including face-to-face, door-to-door, telephone, telephone, mail, and so on). The fee or commission can be received from either the client or the provider of the repair and maintenance service. Revenue for the intermediation activities can include other sources of income (for example, revenues from the sale of advertising space).
broader: Intermediation service activities for repair and maintenance of computers, personal and household goods, and motor vehicles and motorcycles
in scheme: Statistical Classification of Economic Activities in the European Community, Rev. 2.1 (NACE Rev. 2.1)
Notation: 95.40
top concept of: Statistical Classification of Economic Activities in the European Community, Rev. 2.1 (NACE Rev. 2.1)

Manufacture of doors and windows of wood
type: Concept
CoreContentNote: This class includes: - manufacture of doors and their frames and thresholds of wood - manufacture of windows, shutters and French windows and their frames of wood - manufacture of multi-material doors and windows with the frame made of wood
broader: Manufacture of products of wood, cork, straw and plaiting materials
in scheme: Statistical Classification of Economic Activities in the European Community, Rev. 2.1 (NACE Rev. 2.1)
Notation: 16.25
top concept of: Statistical Classification of Economic Activities in the European Community, Rev. 2.1 (NACE Rev. 2.1)

ConceptNoneRandom0.9391036946715946
type: ConceptAssociation
description: NACE Rev. 2.1 class 28.22 is mapped to NACE Rev. 2 class 28.22
Type: 1:1
Source Concept: Manufacture of lifting and handling equipment
Target Concept: http://data.europa.eu/ux2/nace2/2822
in scheme: Statistical Classification of Economic Activities in the European Community, Rev. 2.1 (NACE Rev. 2.1)
scope note: the content of the NACE Rev 2.1 class is fully covered in the corresponding NACE Rev 2 class
top concept of: Statistical Classification of Economic Activities in the European Community, Rev. 2.1 (NACE Rev. 2.1)
Mapping Cardinality: 1 1

ConceptNoneRandom0.3312613609187922
type: ConceptAssociation
description: NACE Rev. 2.1 class 62.10 is mapped to NACE Rev. 2 class 62.01
Type: 1:1
Source Concept: Computer programming activities
Target Concept: http://data.europa.eu/ux2/nace2/6201
in scheme: Statistical Classification of Economic Activities in the European Community, Rev. 2.1 (NACE Rev. 2.1)
scope note: the content of the NACE Rev 2.1 class is fully covered in the corresponding NACE Rev 2 class
top concept of: Statistical Classification of Economic Activities in the European Community, Rev. 2.1 (NACE Rev. 2.1)
Mapping Cardinality: 1 1

ConceptNoneRandom0.1863187040319475
type: ConceptAssociation
description: NACE Rev. 2.1 group 24.4 is mapped to NACE Rev. 2 group 24.4
Type: 1:1
Source Concept: Manufacture of basic precious and other non-ferrous metals
Target Concept: http://data.europa.eu/ux2/nace2/244
in scheme: Statistical Classification of Economic Activities in the European Community, Rev. 2.1 (NACE Rev. 2.1)
top concept of: Statistical Classification of Economic Activities in the European Community, Rev. 2.1 (NACE Rev. 2.1)
Mapping Cardinality: 1 1

ConceptNoneRandom0.5983699065136424
type: ConceptAssociation
description: NACE Rev. 2.1 class 49.12 is mapped to NACE Rev. 2 classes 49.10, 49.31
Type: 6:3
Source Concept: Other passenger rail transport
Target Concept: http://data.europa.eu/ux2/nace2/4931
Target Concept: http://data.europa.eu/ux2/nace2/4910
in scheme: Statistical Classification of Economic Activities in the European Community, Rev. 2.1 (NACE Rev. 2.1)
scope note: 49.10: - interurban transport of passengers by metro, subway, underground and elevated railway, metropolitan railway and tramway - interurban passenger light rail transport for sightseeing 49.31: - urban and suburban passenger transport by metro, subway, underground and elevated railway, metropolitan railway and tramway - urban and suburban passenger transport by funicular railway
top concept of: Statistical Classification of Economic Activities in the European Community, Rev. 2.1 (NACE Rev. 2.1)
Mapping Cardinality: n m

ConceptNoneRandom0.6815628939464017
type: ConceptAssociation
description: NACE Rev. 2.1 group 46.2 is mapped to NACE Rev. 2 group 46.2
Type: 1:1
Source Concept: Wholesale of agricultural raw materials and live animals
Target Concept: http://data.europa.eu/ux2/nace2/462
in scheme: Statistical Classification of Economic Activities in the European Community, Rev. 2.1 (NACE Rev. 2.1)
top concept of: Statistical Classification of Economic Activities in the European Community, Rev. 2.1 (NACE Rev. 2.1)
Mapping Cardinality: 1 1

ConceptNoneRandom0.12159686591600694
type: ConceptAssociation
description: NACE Rev. 2.1 class 74.12 is mapped to NACE Rev. 2 class 74.10
Type: 4:1
Source Concept: Graphic design and visual communication activities
Target Concept: http://data.europa.eu/ux2/nace2/7410
in scheme: Statistical Classification of Economic Activities in the European Community, Rev. 2.1 (NACE Rev. 2.1)
scope note: the content of the NACE Rev 2.1 class is fully covered in the corresponding NACE Rev 2 class
top concept of: Statistical Classification of Economic Activities in the European Community, Rev. 2.1 (NACE Rev. 2.1)
Mapping Cardinality: n 1

ConceptNoneRandom0.7249348782908384
type: ConceptAssociation
description: NACE Rev. 2.1 class 16.24 is mapped to NACE Rev. 2 class 16.24
Type: 17:12
Source Concept: Manufacture of wooden containers
Target Concept: http://data.europa.eu/ux2/nace2/1624
in scheme: Statistical Classification of Economic Activities in the European Community, Rev. 2.1 (NACE Rev. 2.1)
scope note: the content of the NACE Rev 2.1 class is fully covered in the corresponding NACE Rev 2 class
top concept of: Statistical Classification of Economic Activities in the European Community, Rev. 2.1 (NACE Rev. 2.1)
Mapping Cardinality: n m

General cleaning of buildings
type: Concept
CoreContentNote: This class includes: - general (non-specialised) cleaning of all types of buildings, e.g.: • offices • private dwellings (e.g. houses or apartments) • factories • shops • institutions - general (non-specialised) cleaning of other business and professional premises and multi-unit residential buildings These general cleaning activities are mostly interior cleaning although they may include the cleaning of associated exterior areas (for example, windows, passageways).
Exclusion Note: This class excludes: - specialised cleaning activities (e.g. cleaning of windows, chimneys, fireplaces, boilers, exhaust units), see 81.22
broader: Cleaning activities
in scheme: Statistical Classification of Economic Activities in the European Community, Rev. 2.1 (NACE Rev. 2.1)
Notation: 81.21
top concept of: Statistical Classification of Economic Activities in the European Community, Rev. 2.1 (NACE Rev. 2.1)

Mining of hard coal
type: Concept
Additional Content Note: This class also includes: - recovery of hard coal from culm banks
CoreContentNote: This class includes: - mining of hard coal: underground or surface mining, including mining through liquefaction methods - cleaning, sizing, grading, pulverising, compressing, etc. of coal to classify, improve quality or facilitate transport or storage
Exclusion Note: This class excludes: - lignite mining, see 05.20 - peat digging, see 08.92 - support activities for hard coal mining, see 09.90 - test drilling for coal mining, see 09.90 - coke ovens producing solid fuels, see 19.10 - manufacture of hard coal briquettes, ovoids and similar solid hard coal fuels, see 19.20 - work performed to develop or prepare properties for coal mining, see 43.12
broader: Mining of hard coal
in scheme: Statistical Classification of Economic Activities in the European Community, Rev. 2.1 (NACE Rev. 2.1)
Notation: 05.10
top concept of: Statistical Classification of Economic Activities in the European Community, Rev. 2.1 (NACE Rev. 2.1)

News agency activities
type: Concept
CoreContentNote: This class includes: - news syndicate and news agency activities furnishing news, pictures and features to the media, publishers and broadcasters
Exclusion Note: This class excludes: - retail sale of newspapers, see 47.62 - publishing activities, see 58.1 - broadcasting and audio or video streaming activities (having distribution rights), see 60.10, 60.20 - provision of technical infrastructure related to audio or video streaming services, data processing services and related activities, see 63.10 - activities of independent photojournalists, see 74.20 - activities of independent journalists, see 90.11
broader: News agency and other content distribution activities
in scheme: Statistical Classification of Economic Activities in the European Community, Rev. 2.1 (NACE Rev. 2.1)
Notation: 60.31
top concept of: Statistical Classification of Economic Activities in the European Community, Rev. 2.1 (NACE Rev. 2.1)

Manufacture of lifting and handling equipment
type: Concept
Additional Content Note: This class also includes: - manufacture of automatic lifting and handling equipment for warehouses
CoreContentNote: This class includes: - manufacture of hand-operated or power-driven lifting, handling, loading or unloading machinery, e.g.: • pulley tackle and hoists, winches, capstans and jacks • derricks, cranes, mobile lifting frames, straddle carriers • works trucks, whether or not fitted with lifting or handling equipment, whether or not self-propelled, of the type used in factories (including handcarts and wheelbarrows) • mechanical manipulators and industrial robots specifically designed for lifting, handling, loading or unloading • unmanned and robotic forklifts and pallet loaders/unloaders - manufacture of conveyors, teleferics, etc. - manufacture of lifts, escalators and moving walkways - manufacture of parts suitable for use solely or principally with lifting and handling equipment
Exclusion Note: This class excludes: - manufacture of machinery for vertical farming, see 28.30 - manufacture of continuous-action elevators and conveyors for underground use, see 28.92 - manufacture of mechanical shovels, excavators and shovel loaders, see 28.92 - manufacture of industrial robots for multiple uses, see 28.99 - manufacture of crane lorries, floating cranes and railway cranes, see 29.10, 30.11, 30.20 - installation of lifts and elevators, see 43.24
broader: Manufacture of other general-purpose machinery
in scheme: Statistical Classification of Economic Activities in the European Community, Rev. 2.1 (NACE Rev. 2.1)
Notation: 28.22
top concept of: Statistical Classification of Economic Activities in the European Community, Rev. 2.1 (NACE Rev. 2.1)

ConceptNoneRandom0.8599246350242187
type: ConceptAssociation
description: NACE Rev. 2.1 class 86.10 is mapped to NACE Rev. 2 class 86.10
Type: 1:1
Source Concept: Hospital activities
Target Concept: http://data.europa.eu/ux2/nace2/8610
in scheme: Statistical Classification of Economic Activities in the European Community, Rev. 2.1 (NACE Rev. 2.1)
scope note: the content of the NACE Rev 2.1 class is fully covered in the corresponding NACE Rev 2 class
top concept of: Statistical Classification of Economic Activities in the European Community, Rev. 2.1 (NACE Rev. 2.1)
Mapping Cardinality: 1 1

Manufacture of prepared pet foods
type: Concept
Additional Content Note: This class also includes: - processing of slaughter waste to produce animal feed
CoreContentNote: This class includes: - manufacture of prepared feed for pets, including dogs, cats, birds, fish, etc.
Exclusion Note: This class excludes: - manufacture of meat products, see 10.13 - production of fishmeal for animal feed, see 10.20 - production of oilseed cake, see 10.41 - activities resulting in by-products usable as animal feed without special treatment (e.g. oilseeds (see 10.41), grain milling residues (see 10.61), etc.)
broader: Manufacture of prepared animal feeds
in scheme: Statistical Classification of Economic Activities in the European Community, Rev. 2.1 (NACE Rev. 2.1)
Notation: 10.92
top concept of: Statistical Classification of Economic Activities in the European Community, Rev. 2.1 (NACE Rev. 2.1)

Manufacture of products of wood, cork, straw and plaiting materials
type: Concept
CoreContentNote: This group includes the manufacture of products of wood, cork, straw or plaiting materials, including basic shapes as well as assembled products.
broader: Manufacture of wood and of products of wood and cork, except furniture; manufacture of articles of straw and plaiting materials
in scheme: Statistical Classification of Economic Activities in the European Community, Rev. 2.1 (NACE Rev. 2.1)
Notation: 16.2
top concept of: Statistical Classification of Economic Activities in the European Community, Rev. 2.1 (NACE Rev. 2.1)

ConceptNoneRandom0.6791868721549498
type: ConceptAssociation
description: NACE Rev. 2.1 class 60.39 is mapped to NACE Rev. 2 classes 47.91, 63.11, 63.12
Type: 78:65
Source Concept: Other content distribution activities
Target Concept: http://data.europa.eu/ux2/nace2/4791
Target Concept: http://data.europa.eu/ux2/nace2/6312
Target Concept: http://data.europa.eu/ux2/nace2/6311
in scheme: Statistical Classification of Economic Activities in the European Community, Rev. 2.1 (NACE Rev. 2.1)
scope note: 47.91: - provision of e-books as streaming or downloading services, not associated with publishing - online provision of software, not associated with publishing 63.11: - operation of online gaming/video game sites, independent of publishing of the games - provision of e-books as streaming or downloading service not associated with publishing - online provision of software, not associated with publishing 63.12: - distribution services of content sharing sites, e.g. wiki and social network sites, which publish content produced and edited by users and are not under editorial responsibility and control - content distribution via blogs
top concept of: Statistical Classification of Economic Activities in the European Community, Rev. 2.1 (NACE Rev. 2.1)
Mapping Cardinality: n m

Wholesale of other household goods
type: Concept
Additional Content Note: This class also includes: - wholesale of tents and sleeping bags - wholesale in promotional items - wholesale of saucepans and pans - wholesale of cutlery - wholesale of imitation jewellery
CoreContentNote: This class includes: - wholesale of woodenware, wickerwork and corkware, etc. - wholesale of bicycles, electric bicycles, monowheels, hoverboards, kickscooters, including related parts and accessories - wholesale of stationery, books, magazines and newspapers - wholesale of leather goods, excluding clothing and footwear, and travel accessories - wholesale of musical instruments - wholesale of recorded media - wholesale of games and toys, including party and magic items - wholesale of sports goods, including special sports footwear (e.g. ski boots, football shoes, skates, ballet shoes) - wholesale of recreational boats - wholesale of baby equipment (e.g. baby carriages, pushchairs, baby walkers, baby carriers, baby car seats) - wholesale of medals and sports cups
Exclusion Note: This class excludes: - wholesale of electronic cigarettes (vapes), see 46.35 - wholesale of disguises, see 46.42 - wholesale of weapons and ammunition, see 46.64 - wholesale of e-liquids for electronic cigarettes, see 46.85
broader: Wholesale of household goods
in scheme: Statistical Classification of Economic Activities in the European Community, Rev. 2.1 (NACE Rev. 2.1)
Notation: 46.49
top concept of: Statistical Classification of Economic Activities in the European Community, Rev. 2.1 (NACE Rev. 2.1)

Manufacture of wooden containers
type: Concept
CoreContentNote: This class includes: - manufacture of packing cases, boxes, crates, drums and similar items of wood - manufacture of pallets, box pallets and other load boards of wood - manufacture of barrels, vats, tubs and other coopers’ products of wood - manufacture of wooden cable drums
Exclusion Note: This class excludes: - manufacture of luggage, see 15.12 - manufacture of cases of plaiting material, see 16.28
broader: Manufacture of products of wood, cork, straw and plaiting materials
in scheme: Statistical Classification of Economic Activities in the European Community, Rev. 2.1 (NACE Rev. 2.1)
Notation: 16.24
top concept of: Statistical Classification of Economic Activities in the European Community, Rev. 2.1 (NACE Rev. 2.1)

ConceptNoneRandom0.7386694920503281
type: ConceptAssociation
description: NACE Rev. 2.1 group 46.3 is mapped to NACE Rev. 2 group 46.3
Type: 1:1
Source Concept: Wholesale of food, beverages and tobacco
Target Concept: http://data.europa.eu/ux2/nace2/463
in scheme: Statistical Classification of Economic Activities in the European Community, Rev. 2.1 (NACE Rev. 2.1)
top concept of: Statistical Classification of Economic Activities in the European Community, Rev. 2.1 (NACE Rev. 2.1)
Mapping Cardinality: 1 1

ConceptNoneRandom0.6912225412478273
type: ConceptAssociation
description: NACE Rev. 2.1 class 50.10 is mapped to NACE Rev. 2 class 50.10
Type: 1:1
Source Concept: Sea and coastal passenger water transport
Target Concept: http://data.europa.eu/ux2/nace2/5010
in scheme: Statistical Classification of Economic Activities in the European Community, Rev. 2.1 (NACE Rev. 2.1)
scope note: the content of the NACE Rev 2.1 class is fully covered in the corresponding NACE Rev 2 class
top concept of: Statistical Classification of Economic Activities in the European Community, Rev. 2.1 (NACE Rev. 2.1)
Mapping Cardinality: 1 1

ConceptNoneRandom0.6022174568222131
type: ConceptAssociation
description: NACE Rev. 2.1 group 68.1 is mapped to NACE Rev. 2 groups 41.1, 42.9, 68.1
Type: 26:18
Source Concept: Real estate activities with own property and development of building projects
Target Concept: http://data.europa.eu/ux2/nace2/429
Target Concept: http://data.europa.eu/ux2/nace2/411
Target Concept: http://data.europa.eu/ux2/nace2/681
in scheme: Statistical Classification of Economic Activities in the European Community, Rev. 2.1 (NACE Rev. 2.1)
top concept of: Statistical Classification of Economic Activities in the European Community, Rev. 2.1 (NACE Rev. 2.1)
Mapping Cardinality: n m

ConceptNoneRandom0.3837364686324879
type: ConceptAssociation
description: NACE Rev. 2.1 class 74.13 is mapped to NACE Rev. 2 class 74.10
Type: 4:1
Source Concept: Interior design activities
Target Concept: http://data.europa.eu/ux2/nace2/7410
in scheme: Statistical Classification of Economic Activities in the European Community, Rev. 2.1 (NACE Rev. 2.1)
scope note: the content of the NACE Rev 2.1 class is fully covered in the corresponding NACE Rev 2 class
top concept of: Statistical Classification of Economic Activities in the European Community, Rev. 2.1 (NACE Rev. 2.1)
Mapping Cardinality: n 1

ConceptNoneRandom0.5035271337858871
type: ConceptAssociation
description: NACE Rev. 2.1 group 24.5 is mapped to NACE Rev. 2 group 24.5
Type: 1:1
Source Concept: Casting of metals
Target Concept: http://data.europa.eu/ux2/nace2/245
in scheme: Statistical Classification of Economic Activities in the European Community, Rev. 2.1 (NACE Rev. 2.1)
top concept of: Statistical Classification of Economic Activities in the European Community, Rev. 2.1 (NACE Rev. 2.1)
Mapping Cardinality: 1 1

ConceptNoneRandom0.6219977291782965
type: ConceptAssociation
description: NACE Rev. 2.1 class 30.99 is mapped to NACE Rev. 2 class 30.99
Type: 1:1
Source Concept: Manufacture of other transport equipment n.e.c.
Target Concept: http://data.europa.eu/ux2/nace2/3099
in scheme: Statistical Classification of Economic Activities in the European Community, Rev. 2.1 (NACE Rev. 2.1)
scope note: the content of the NACE Rev 2.1 class is fully covered in the corresponding NACE Rev 2 class
top concept of: Statistical Classification of Economic Activities in the European Community, Rev. 2.1 (NACE Rev. 2.1)
Mapping Cardinality: 1 1

Other building and industrial cleaning activities
type: Concept
CoreContentNote: This class includes: - exterior cleaning of buildings of all types (e.g. offices, factories, shops, schools and other institutions, other business and professional premises, multi-unit residential buildings) - specialised cleaning activities for businesses in food industries, including manufacturing, retail sale, restaurants, etc. - specialised cleaning activities for buildings (e.g. facade and window cleaning, chimney cleaning and cleaning of fireplaces, stoves, furnaces, incinerators, boilers, ventilation ducts and exhaust units) - specialised industrial cleaning (e.g. cleaning of industrial machinery) - cleaning of water supply pipelines - cleaning of aeraulic ducts - other specialised building and industrial cleaning activities n.e.c. - cleaning of new buildings immediately after construction - steam cleaning, sandblasting and similar activities for building exteriors
broader: Cleaning activities
in scheme: Statistical Classification of Economic Activities in the European Community, Rev. 2.1 (NACE Rev. 2.1)
Notation: 81.22
top concept of: Statistical Classification of Economic Activities in the European Community, Rev. 2.1 (NACE Rev. 2.1)

Library and archive activities
type: Concept
CoreContentNote: This group includes activities related to the management, care, preservation and assessment of libraries and archives. This group includes: - documentation and information activities of libraries and archives of all kinds, including reading, listening and viewing rooms, providing library and archive services to the general public or to a specific public (e.g. students, scientists, staff members) - operation of public archives (at governmental, regional or local level) or of private archives (artists’, historians’, writers’ archives, etc.) - organisation of a library collection, whether specialised or not, cataloguing collections - lending and storage of books, maps, periodicals, films, records, tapes, works of art, archives, etc. - retrieval activities in order to comply with information requests, etc.
Exclusion Note: This group excludes: - conservation and restoration of cultural heritage, see 91.30
broader: Libraries, archives, museums and other cultural activities
in scheme: Statistical Classification of Economic Activities in the European Community, Rev. 2.1 (NACE Rev. 2.1)
Notation: 91.1
top concept of: Statistical Classification of Economic Activities in the European Community, Rev. 2.1 (NACE Rev. 2.1)

Diagnostic imaging services and medical laboratory activities
type: Concept
Additional Content Note: This class also includes: - laboratory doping control activities
CoreContentNote: This class includes activities of medical laboratories providing analytic or diagnostic services (without the medical analysis or interpretation itself), including body fluid analysis or genetic testing, directly to outpatients with or without referral from healthcare practitioners, for example: - X-ray laboratories and other diagnostic imaging centres - blood analysis laboratories - DNA sequencing for ruling out or curing a specific disease
Exclusion Note: This class excludes: - non-medical laboratory testing, testing activities in the field of food hygiene, activities of forensic laboratories, see 71.20 - medical analysis and interpretation of diagnostic medical images (X-ray, electrocardiograms, endoscopies, etc.), see 86.22 - activities of genome data centres, blood and organ banks, see 86.99
broader: Other human health activities
in scheme: Statistical Classification of Economic Activities in the European Community, Rev. 2.1 (NACE Rev. 2.1)
Notation: 86.91
top concept of: Statistical Classification of Economic Activities in the European Community, Rev. 2.1 (NACE Rev. 2.1)

ConceptNoneRandom0.6969129840213033
type: ConceptAssociation
description: NACE Rev. 2.1 class 16.23 is mapped to NACE Rev. 2 class 16.23
Type: 17:12
Source Concept: Manufacture of other builders' carpentry and joinery
Target Concept: http://data.europa.eu/ux2/nace2/1623
in scheme: Statistical Classification of Economic Activities in the European Community, Rev. 2.1 (NACE Rev. 2.1)
scope note: the content of the NACE Rev 2.1 class is fully covered in the corresponding NACE Rev 2 class
top concept of: Statistical Classification of Economic Activities in the European Community, Rev. 2.1 (NACE Rev. 2.1)
Mapping Cardinality: n m

Manufacture of ovens, furnaces and permanent household heating equipment
type: Concept
Additional Content Note: This class also includes: - manufacture of mechanical stokers, grates, ash dischargers, etc. - manufacture of generally non-reversible heat pumps (only working in one direction), mainly used for space heating or for domestic hot water supply
CoreContentNote: This class includes: - manufacture of electrical and other industrial and laboratory furnaces and ovens, including incinerators - manufacture of furnace burners - manufacture of central heating boilers, solar water heaters and similar equipment - manufacture of household cooling and ventilation equipment
Exclusion Note: This class excludes: - manufacture of electric ovens for domestic use, see 27.51 - manufacture of table, floor, wall, window, ceiling or roof fans, see 27.51 - manufacture of dryers for agricultural products, see 28.93 - manufacture of baking ovens, see 28.93 - manufacture of dryers for wood, paper pulp, paper or paperboard, see 28.99 - manufacture of medical, surgical or laboratory sterilisers, see 32.50 - manufacture of dental laboratory furnaces, see 32.50
broader: Manufacture of other general-purpose machinery
in scheme: Statistical Classification of Economic Activities in the European Community, Rev. 2.1 (NACE Rev. 2.1)
Notation: 28.21
top concept of: Statistical Classification of Economic Activities in the European Community, Rev. 2.1 (NACE Rev. 2.1)

Waste collection
type: Concept
CoreContentNote: This group includes the collection of waste from households and businesses (for example, by means of bins, containers). It includes collection of non-hazardous and hazardous waste (for example, diapers, used batteries, demolition waste, waste oil from households and ships).
broader: Waste collection, recovery and disposal activities
in scheme: Statistical Classification of Economic Activities in the European Community, Rev. 2.1 (NACE Rev. 2.1)
Notation: 38.1
top concept of: Statistical Classification of Economic Activities in the European Community, Rev. 2.1 (NACE Rev. 2.1)

Activities of head offices
type: Concept
CoreContentNote: This class includes overseeing and managing other units of the enterprise or enterprise group, in other words, acting as a head office; undertaking the strategic or organisational planning and decision-making role of the company or enterprise; exercising operational control and managing the day-to-day operations of their related units. These activities are the same regardless of which activities the managed units perform (financing, manufacturing trade, and so on). This class includes activities of: - centralised administrative offices - corporate offices - district and regional offices - subsidiary management offices
Exclusion Note: This class excludes: - activities of holding companies not engaged in head office activities, see 64.21
broader: Activities of head offices
in scheme: Statistical Classification of Economic Activities in the European Community, Rev. 2.1 (NACE Rev. 2.1)
Notation: 70.10
top concept of: Statistical Classification of Economic Activities in the European Community, Rev. 2.1 (NACE Rev. 2.1)

ConceptNoneRandom0.13378378335715146
type: ConceptAssociation
description: NACE Rev. 2.1 class 05.10 is mapped to NACE Rev. 2 class 05.10
Type: 1:1
Source Concept: Mining of hard coal
Target Concept: http://data.europa.eu/ux2/nace2/0510
in scheme: Statistical Classification of Economic Activities in the European Community, Rev. 2.1 (NACE Rev. 2.1)
scope note: the content of the NACE Rev 2.1 class is fully covered in the corresponding NACE Rev 2 class
top concept of: Statistical Classification of Economic Activities in the European Community, Rev. 2.1 (NACE Rev. 2.1)
Mapping Cardinality: 1 1

ConceptNoneRandom0.03631241328904711
type: ConceptAssociation
description: NACE Rev. 2.1 class 10.92 is mapped to NACE Rev. 2 class 10.92
Type: 1:1
Source Concept: Manufacture of prepared pet foods
Target Concept: http://data.europa.eu/ux2/nace2/1092
in scheme: Statistical Classification of Economic Activities in the European Community, Rev. 2.1 (NACE Rev. 2.1)
scope note: the content of the NACE Rev 2.1 class is fully covered in the corresponding NACE Rev 2 class
top concept of: Statistical Classification of Economic Activities in the European Community, Rev. 2.1 (NACE Rev. 2.1)
Mapping Cardinality: 1 1

Manufacture of other builders' carpentry and joinery
type: Concept
Additional Content Note: This class also includes: - manufacture of wooden stands
CoreContentNote: This class includes: - manufacture of wooden goods intended to be used primarily in the construction industry: • beams, rafters, roof struts • glue-laminated and metal connected, prefabricated wooden roof trusses • stairs, railings • wooden beadings and mouldings, shingles and shakes - manufacture of prefabricated buildings, or elements thereof, predominantly of wood (e.g. saunas) - manufacture of mobile homes and house trailers - manufacture of wood partitions (except free-standing)
Exclusion Note: This class excludes: - doors, windows, shutters and their frames, see 16.25 - manufacture of wood partitions, free-standing, see 31.00 - manufacture of walk-in wardrobes, see 31.00 - installation of doors, windows and stairs, see 43.32 - installation of kitchens, walk-in wardrobes, shopfittings, etc., see 43.32 - erection of roof frames, see 43.41
broader: Manufacture of products of wood, cork, straw and plaiting materials
in scheme: Statistical Classification of Economic Activities in the European Community, Rev. 2.1 (NACE Rev. 2.1)
Notation: 16.23
top concept of: Statistical Classification of Economic Activities in the European Community, Rev. 2.1 (NACE Rev. 2.1)

ConceptNoneRandom0.2852711573265473
type: ConceptAssociation
description: NACE Rev. 2.1 group 77.1 is mapped to NACE Rev. 2 groups 77.1, 77.3
Type: 2:2
Source Concept: Rental and leasing of motor vehicles
Target Concept: http://data.europa.eu/ux2/nace2/773
Target Concept: http://data.europa.eu/ux2/nace2/771
in scheme: Statistical Classification of Economic Activities in the European Community, Rev. 2.1 (NACE Rev. 2.1)
top concept of: Statistical Classification of Economic Activities in the European Community, Rev. 2.1 (NACE Rev. 2.1)
Mapping Cardinality: n m

ConceptNoneRandom0.9200176813037061
type: ConceptAssociation
description: NACE Rev. 2.1 group 46.8 is mapped to NACE Rev. 2 group 46.7
Type: 1:1
Source Concept: Other specialised wholesale
Target Concept: http://data.europa.eu/ux2/nace2/467
in scheme: Statistical Classification of Economic Activities in the European Community, Rev. 2.1 (NACE Rev. 2.1)
top concept of: Statistical Classification of Economic Activities in the European Community, Rev. 2.1 (NACE Rev. 2.1)
Mapping Cardinality: 1 1

ConceptNoneRandom0.09595392058398533
type: ConceptAssociation
description: NACE Rev. 2.1 group 20.2 is mapped to NACE Rev. 2 group 20.2
Type: 1:1
Source Concept: Manufacture of pesticides, disinfectants and other agrochemical products
Target Concept: http://data.europa.eu/ux2/nace2/202
in scheme: Statistical Classification of Economic Activities in the European Community, Rev. 2.1 (NACE Rev. 2.1)
top concept of: Statistical Classification of Economic Activities in the European Community, Rev. 2.1 (NACE Rev. 2.1)
Mapping Cardinality: 1 1

ConceptNoneRandom0.4606104957278454
type: ConceptAssociation
description: NACE Rev. 2.1 group 55.3 is mapped to NACE Rev. 2 group 55.3
Type: 1:1
Source Concept: Camping grounds and recreational vehicle parks
Target Concept: http://data.europa.eu/ux2/nace2/553
in scheme: Statistical Classification of Economic Activities in the European Community, Rev. 2.1 (NACE Rev. 2.1)
top concept of: Statistical Classification of Economic Activities in the European Community, Rev. 2.1 (NACE Rev. 2.1)
Mapping Cardinality: 1 1

ConceptNoneRandom0.02949857302979042
type: ConceptAssociation
description: NACE Rev. 2.1 class 17.11 is mapped to NACE Rev. 2 class 17.11
Type: 1:1
Source Concept: Manufacture of pulp
Target Concept: http://data.europa.eu/ux2/nace2/1711
in scheme: Statistical Classification of Economic Activities in the European Community, Rev. 2.1 (NACE Rev. 2.1)
scope note: the content of the NACE Rev 2.1 class is fully covered in the corresponding NACE Rev 2 class
top concept of: Statistical Classification of Economic Activities in the European Community, Rev. 2.1 (NACE Rev. 2.1)
Mapping Cardinality: 1 1

Compulsory social security activities
type: Concept
CoreContentNote: This class includes: - funding and administration of government-provided social security programmes, e.g.: • sickness, work-accident and unemployment insurance • retirement pensions • covering losses of income due to parental leave, temporary disablement, widowhood / loss of partner
Exclusion Note: This class excludes: - complementary or supplementary health insurance, see 65.12 - provision of retirement income benefits exclusively for the sponsor’s employees or members, see 65.30 - administration of healthcare and social services, see 84.12 - provision of residential care assistance services, see division 87 - provision of welfare services and social work (without accommodation), see 88.10, 88.99
broader: Compulsory social security activities
in scheme: Statistical Classification of Economic Activities in the European Community, Rev. 2.1 (NACE Rev. 2.1)
Notation: 84.30
top concept of: Statistical Classification of Economic Activities in the European Community, Rev. 2.1 (NACE Rev. 2.1)

ConceptNoneRandom0.6403434604230662
type: ConceptAssociation
description: NACE Rev. 2.1 class 16.26 is mapped to NACE Rev. 2 class 16.29
Type: 17:12
Source Concept: Manufacture of solid fuels from vegetable biomass
Target Concept: http://data.europa.eu/ux2/nace2/1629
in scheme: Statistical Classification of Economic Activities in the European Community, Rev. 2.1 (NACE Rev. 2.1)
scope note: the content of the NACE Rev 2.1 class is fully covered in the corresponding NACE Rev 2 class
top concept of: Statistical Classification of Economic Activities in the European Community, Rev. 2.1 (NACE Rev. 2.1)
Mapping Cardinality: n m

Traditional, complementary and alternative medicine activities
type: Concept
Additional Content Note: This class also includes: - activities of healers - hypnotherapy - reflexology activities - remedial therapists Cesar and Mensendieck - naprapathy
CoreContentNote: This class includes the provision of preventive, curative, or rehabilitative healthcare services by health professionals. The health benefits of these services are not based on scientific data for diagnosing and treating diseases and have so far not been fully assessed in ways that can be universally accepted as being evidence-based. This class includes: - provision of traditional medicine services that comprise a range of long-standing and still-evolving practices, developed within various societies before or during the development of modern medicine (e.g. traditional Chinese therapies such as acupuncture and Chinese herbal medicines, Unani, and traditional African medicines) - provision of complementary therapeutic services (e.g. Alexander therapy, aromatherapy, Bach therapy and other flower therapies, body therapy, Ayurvedic, herbal medicine, naturopathy, nutritional therapy) - provision of alternative therapeutic services (e.g. homeopathy, chiropractic treatments, osteopathy, crystal therapy, iridology, kinesiology, radionics)
Exclusion Note: This class excludes: - body treatment techniques (e.g. shiatsu, Thai massage, Watsu, tui na qigong), see 86.99
broader: Other human health activities
in scheme: Statistical Classification of Economic Activities in the European Community, Rev. 2.1 (NACE Rev. 2.1)
Notation: 86.96
top concept of: Statistical Classification of Economic Activities in the European Community, Rev. 2.1 (NACE Rev. 2.1)

Manufacture of electrical equipment
type: Concept
Additional Content Note: Also included is the manufacture of electrical lighting, signalling equipment and electric household appliances.
CoreContentNote: This division includes the manufacture of products that generate, distribute and use electrical power.
Exclusion Note: This division excludes the manufacture of electronic products (see division 26).
broader: MANUFACTURING
in scheme: Statistical Classification of Economic Activities in the European Community, Rev. 2.1 (NACE Rev. 2.1)
Notation: 27
top concept of: Statistical Classification of Economic Activities in the European Community, Rev. 2.1 (NACE Rev. 2.1)

ConceptNoneRandom0.6475994463553751
type: ConceptAssociation
description: NACE Rev. 2.1 division 87 is mapped to NACE Rev. 2 divisions 82, 87
Type: 48:49
Source Concept: Residential care activities
Target Concept: http://data.europa.eu/ux2/nace2/82
Target Concept: http://data.europa.eu/ux2/nace2/87
in scheme: Statistical Classification of Economic Activities in the European Community, Rev. 2.1 (NACE Rev. 2.1)
top concept of: Statistical Classification of Economic Activities in the European Community, Rev. 2.1 (NACE Rev. 2.1)
Mapping Cardinality: n m

Organisation of conventions and trade shows
type: Concept
broader: Office administrative, office support and other business support activities
in scheme: Statistical Classification of Economic Activities in the European Community, Rev. 2.1 (NACE Rev. 2.1)
Notation: 82.3
top concept of: Statistical Classification of Economic Activities in the European Community, Rev. 2.1 (NACE Rev. 2.1)

ConceptNoneRandom0.30193675766814343
type: ConceptAssociation
description: NACE Rev. 2.1 class 53.20 is mapped to NACE Rev. 2 classes 53.20, 96.01
Type: 4:3
Source Concept: Other postal and courier activities
Target Concept: http://data.europa.eu/ux2/nace2/9601
Target Concept: http://data.europa.eu/ux2/nace2/5320
in scheme: Statistical Classification of Economic Activities in the European Community, Rev. 2.1 (NACE Rev. 2.1)
scope note: 53.20: - pickup, sorting, transport and delivery (domestic or international) of letter-post and (mail-type) parcels and packages by firms operating outside the scope of a universal service obligation. One or more modes of transport may be involved and the activity may be carried out with either self-owned (private) transport or via public transport. - home delivery services, including food 96.01: - laundry collection and delivery by a unit not having washing and cleaning textiles as a main activity
top concept of: Statistical Classification of Economic Activities in the European Community, Rev. 2.1 (NACE Rev. 2.1)
Mapping Cardinality: n m

Manufacture of motor vehicle parts and accessories
type: Concept
CoreContentNote: This group includes the manufacture of motor vehicle parts and accessories of all materials.
broader: Manufacture of motor vehicles, trailers and semi-trailers
in scheme: Statistical Classification of Economic Activities in the European Community, Rev. 2.1 (NACE Rev. 2.1)
Notation: 29.3
top concept of: Statistical Classification of Economic Activities in the European Community, Rev. 2.1 (NACE Rev. 2.1)

ConceptNoneRandom0.30199489020100656
type: ConceptAssociation
description: NACE Rev. 2.1 class 46.90 is mapped to NACE Rev. 2 class 46.90
Type: 1:1
Source Concept: Non-specialised wholesale trade
Target Concept: http://data.europa.eu/ux2/nace2/4690
in scheme: Statistical Classification of Economic Activities in the European Community, Rev. 2.1 (NACE Rev. 2.1)
scope note: the content of the NACE Rev 2.1 class is fully covered in the corresponding NACE Rev 2 class
top concept of: Statistical Classification of Economic Activities in the European Community, Rev. 2.1 (NACE Rev. 2.1)
Mapping Cardinality: 1 1

ConceptNoneRandom0.3207908761437315
type: ConceptAssociation
description: NACE Rev. 2.1 class 28.25 is mapped to NACE Rev. 2 classes 28.21, 28.25
Type: 8:9
Source Concept: Manufacture of non-domestic air conditioning equipment
Target Concept: http://data.europa.eu/ux2/nace2/2825
Target Concept: http://data.europa.eu/ux2/nace2/2821
in scheme: Statistical Classification of Economic Activities in the European Community, Rev. 2.1 (NACE Rev. 2.1)
scope note: 28.21: - manufacture of reversible heat pumps that have a motorised fan and devices for changing both the air temperature and humidity 28.25: - manufacture of refrigerating or freezing non-domestic equipment - manufacture of air-conditioning machines, except for motor vehicles - manufacture of non-domestic fans - manufacture of heat exchange units - manufacture of machinery for liquefying air or other gas - manufacture of attic ventilation fans, e.g. gable fans, roof ventilators - manufacture of evaporators and condensers for non-domestic refrigerators
top concept of: Statistical Classification of Economic Activities in the European Community, Rev. 2.1 (NACE Rev. 2.1)
Mapping Cardinality: n m

Manufacture of other transport equipment n.e.c.
type: Concept
CoreContentNote: This class includes: - manufacture of hand-propelled vehicles (e.g. luggage carts, handcarts, sledges, shopping carts) - manufacture of vehicles drawn by animals (e.g. sulkies, donkey-carts, hearses)
Exclusion Note: This class excludes: - manufacture of works trucks, whether or not fitted with lifting or handling equipment, whether or not self-propelled, of the type used in factories (including hand carts and wheelbarrows), see 28.22 - manufacture of decorative restaurant carts (e.g. dessert carts, food wagons), see 31.00
broader: Manufacture of transport equipment n.e.c.
in scheme: Statistical Classification of Economic Activities in the European Community, Rev. 2.1 (NACE Rev. 2.1)
Notation: 30.99
top concept of: Statistical Classification of Economic Activities in the European Community, Rev. 2.1 (NACE Rev. 2.1)

Manufacture of assembled parquet floors
type: Concept
CoreContentNote: This class includes: - manufacture of wooden parquet floor blocks, strips, etc., assembled into panels
Exclusion Note: This class excludes: - manufacture of unassembled wooden flooring, see 16.11
broader: Manufacture of products of wood, cork, straw and plaiting materials
in scheme: Statistical Classification of Economic Activities in the European Community, Rev. 2.1 (NACE Rev. 2.1)
Notation: 16.22
top concept of: Statistical Classification of Economic Activities in the European Community, Rev. 2.1 (NACE Rev. 2.1)

ConceptNoneRandom0.6156846114903173
type: ConceptAssociation
description: NACE Rev. 2.1 class 29.10 is mapped to NACE Rev. 2 classes 27.11, 29.10
Type: 11:11
Source Concept: Manufacture of motor vehicles
Target Concept: http://data.europa.eu/ux2/nace2/2910
Target Concept: http://data.europa.eu/ux2/nace2/2711
in scheme: Statistical Classification of Economic Activities in the European Community, Rev. 2.1 (NACE Rev. 2.1)
scope note: 27.11: - manufacture of motor vehicle engines, including electric motors 29.10: - manufacture of passenger cars - manufacture of commercial vehicles: • vans, lorries, road tractors for semi-trailers etc. - manufacture of buses, trolleybuses and coaches - manufacture of motor vehicle engines, including electric motors - manufacture of other motor vehicles, e.g.: • snowmobiles, golf cars, amphibious motor vehicles • road sweeper trollies - all-terrain vehicles (ATV), go-carts and similar, including racing cars - factory rebuilding of motor vehicle engines - manufacture of chassis fitted with engines
top concept of: Statistical Classification of Economic Activities in the European Community, Rev. 2.1 (NACE Rev. 2.1)
Mapping Cardinality: n m

ConceptNoneRandom0.183608996181024
type: ConceptAssociation
description: NACE Rev. 2.1 group 99.0 is mapped to NACE Rev. 2 group 99.0
Type: 1:1
Source Concept: Activities of extraterritorial organisations and bodies
Target Concept: http://data.europa.eu/ux2/nace2/990
in scheme: Statistical Classification of Economic Activities in the European Community, Rev. 2.1 (NACE Rev. 2.1)
top concept of: Statistical Classification of Economic Activities in the European Community, Rev. 2.1 (NACE Rev. 2.1)
Mapping Cardinality: 1 1

ConceptNoneRandom0.08644414651934673
type: ConceptAssociation
description: NACE Rev. 2.1 class 93.29 is mapped to NACE Rev. 2 classes 82.30, 93.11, 93.19, 93.21, 93.29
Type: 7:7
Source Concept: Amusement and recreation activities n.e.c.
Target Concept: http://data.europa.eu/ux2/nace2/9321
Target Concept: http://data.europa.eu/ux2/nace2/9311
Target Concept: http://data.europa.eu/ux2/nace2/9329
Target Concept: http://data.europa.eu/ux2/nace2/9319
Target Concept: http://data.europa.eu/ux2/nace2/8230
in scheme: Statistical Classification of Economic Activities in the European Community, Rev. 2.1 (NACE Rev. 2.1)
scope note: 82.30: - technical planning, supply, setting up and operation of audiovisual equipment and special effects associated with the organisation of conventions and trade shows 93.11: - operation of bowling halls 93.19: - technical planning, supply, setting up and operation of audiovisual equipment and special effects associated with the organisation of sports events 93.21: - operation of mechanical rides, games and shows by independent providers, e.g. at fairgrounds, folk festivals and Christmas markets 93.29: - operation (exploitation) of coin-operated games - rental of leisure and pleasure equipment as an integral part of recreational facilities - operation of mechanical rides, games and shows by independent providers, e.g. at fairgrounds, folk festivals and Christmas markets - activities of beaches, including rental of facilities (e.g. bathhouses, beach chairs and umbrellas) - activities of independent animators in amusement and recreation facilities - operation of dance floors and ballrooms where beverage serving is not the main activity - operation of computer rooms for playing computer games - operation of self-service amusement devices, e.g. rocking chairs/horses/cars/space ships - operation of airsoft and paintball courts - games/experiences of reality virtual or geolocated - amusement and recreation activities related to the infrastructure of marinas - operation of billiard halls - operation of escape rooms - light and sound shows - activities of guides for underwater excursions - creation and presentation of fireworks - operation of picnic grounds not associated with a nature reserve - operation of laser games - activities of producers or entrepreneurs of live amusement and recreation events, with or without facilities - technical planning, supply, setting up and operation of audiovisual equipment and special effects associated with the organisation of live amusement and recreation events
top concept of: Statistical Classification of Economic Activities in the European Community, Rev. 2.1 (NACE Rev. 2.1)
Mapping Cardinality: n m

ConceptNoneRandom0.7306455802131466
type: ConceptAssociation
description: NACE Rev. 2.1 group 77.2 is mapped to NACE Rev. 2 group 77.2
Type: 1:1
Source Concept: Rental and leasing of personal and household goods
Target Concept: http://data.europa.eu/ux2/nace2/772
in scheme: Statistical Classification of Economic Activities in the European Community, Rev. 2.1 (NACE Rev. 2.1)
top concept of: Statistical Classification of Economic Activities in the European Community, Rev. 2.1 (NACE Rev. 2.1)
Mapping Cardinality: 1 1

Construction of water projects
type: Concept
CoreContentNote: This class includes: - construction and reconstruction of, e.g.: • waterways, harbour basins, rivers, marinas • hydromechanical structures (e.g. locks, lifts, sluices, slipways) • dams and dykes - dredging of waterways (e.g. harbour basins, rivers)
Exclusion Note: This class excludes: - construction of underwater pipelines, see 42.21 - laying of underwater cables, see 42.22 - project management activities related to civil engineering works, see 71.12
broader: Construction of other civil engineering projects
in scheme: Statistical Classification of Economic Activities in the European Community, Rev. 2.1 (NACE Rev. 2.1)
Notation: 42.91
top concept of: Statistical Classification of Economic Activities in the European Community, Rev. 2.1 (NACE Rev. 2.1)

Intermediation service activities for medical, dental and other human health services
type: Concept
Additional Content Note: This class also includes: - appointment reservations for medical, dental and other human health services
CoreContentNote: This class includes the intermediation of medical, dental and other human health services, by bringing clients and service providers together for a fee or commission, without the intermediary providing the medical, dental and other human health services that are intermediated. These intermediation activities can be carried out on digital platforms or through non-digital channels (including face-to-face, door-to-door, telephone, mail, and so on). The fee or commission can be received from either the client or the provider of the medical, dental or other human health service. Revenue for the intermediation activities can include other sources of income (for example, revenues from the sale of advertising space).
Exclusion Note: This class excludes: - intermediation service activities for residential care activities, see 87.91
broader: Other human health activities
in scheme: Statistical Classification of Economic Activities in the European Community, Rev. 2.1 (NACE Rev. 2.1)
Notation: 86.97
top concept of: Statistical Classification of Economic Activities in the European Community, Rev. 2.1 (NACE Rev. 2.1)

ConceptNoneRandom0.8962256246719145
type: ConceptAssociation
description: NACE Rev. 2.1 group 20.3 is mapped to NACE Rev. 2 group 20.3
Type: 1:1
Source Concept: Manufacture of paints, varnishes and similar coatings, printing ink and mastics
Target Concept: http://data.europa.eu/ux2/nace2/203
in scheme: Statistical Classification of Economic Activities in the European Community, Rev. 2.1 (NACE Rev. 2.1)
top concept of: Statistical Classification of Economic Activities in the European Community, Rev. 2.1 (NACE Rev. 2.1)
Mapping Cardinality: 1 1

ConceptNoneRandom0.6401107426670355
type: ConceptAssociation
description: NACE Rev. 2.1 group 42.1 is mapped to NACE Rev. 2 group 42.1
Type: 26:18
Source Concept: Construction of roads and railways
Target Concept: http://data.europa.eu/ux2/nace2/421
in scheme: Statistical Classification of Economic Activities in the European Community, Rev. 2.1 (NACE Rev. 2.1)
top concept of: Statistical Classification of Economic Activities in the European Community, Rev. 2.1 (NACE Rev. 2.1)
Mapping Cardinality: n m

ConceptNoneRandom0.40394496186184925
type: ConceptAssociation
description: NACE Rev. 2.1 group 55.4 is mapped to NACE Rev. 2 groups 79.1, 79.9
Type: 42:34
Source Concept: Intermediation service activities for accommodation
Target Concept: http://data.europa.eu/ux2/nace2/799
Target Concept: http://data.europa.eu/ux2/nace2/791
in scheme: Statistical Classification of Economic Activities in the European Community, Rev. 2.1 (NACE Rev. 2.1)
top concept of: Statistical Classification of Economic Activities in the European Community, Rev. 2.1 (NACE Rev. 2.1)
Mapping Cardinality: n m

ConceptNoneRandom0.815733308426286
type: ConceptAssociation
description: NACE Rev. 2.1 class 16.25 is mapped to NACE Rev. 2 class 16.23
Type: 17:12
Source Concept: Manufacture of doors and windows of wood
Target Concept: http://data.europa.eu/ux2/nace2/1623
in scheme: Statistical Classification of Economic Activities in the European Community, Rev. 2.1 (NACE Rev. 2.1)
scope note: the content of the NACE Rev 2.1 class is fully covered in the corresponding NACE Rev 2 class
top concept of: Statistical Classification of Economic Activities in the European Community, Rev. 2.1 (NACE Rev. 2.1)
Mapping Cardinality: n m

ConceptNoneRandom0.3543632046825461
type: ConceptAssociation
description: NACE Rev. 2.1 group 46.9 is mapped to NACE Rev. 2 group 46.9
Type: 1:1
Source Concept: Non-specialised wholesale trade
Target Concept: http://data.europa.eu/ux2/nace2/469
in scheme: Statistical Classification of Economic Activities in the European Community, Rev. 2.1 (NACE Rev. 2.1)
top concept of: Statistical Classification of Economic Activities in the European Community, Rev. 2.1 (NACE Rev. 2.1)
Mapping Cardinality: 1 1

Intermediation service activities for business support service activities n.e.c.
type: Concept
broader: Office administrative, office support and other business support activities
in scheme: Statistical Classification of Economic Activities in the European Community, Rev. 2.1 (NACE Rev. 2.1)
Notation: 82.4
top concept of: Statistical Classification of Economic Activities in the European Community, Rev. 2.1 (NACE Rev. 2.1)

ConceptNoneRandom0.7595213167784423
type: ConceptAssociation
description: NACE Rev. 2.1 division 86 is mapped to NACE Rev. 2 divisions 82, 86
Type: 48:49
Source Concept: Human health activities
Target Concept: http://data.europa.eu/ux2/nace2/82
Target Concept: http://data.europa.eu/ux2/nace2/86
in scheme: Statistical Classification of Economic Activities in the European Community, Rev. 2.1 (NACE Rev. 2.1)
top concept of: Statistical Classification of Economic Activities in the European Community, Rev. 2.1 (NACE Rev. 2.1)
Mapping Cardinality: n m

Manufacture of machinery and equipment n.e.c.
type: Concept
Additional Content Note: This division also includes the manufacture of other special-purpose machinery, not covered elsewhere in the classification, whether or not used in a manufacturing process (for example, fairground amusement equipment, automatic bowling alley equipment).
CoreContentNote: This division includes the manufacture of machinery and equipment that act independently on materials either mechanically or thermally or perform operations on materials (for example, handling, spraying, weighing or packing), including their mechanical components that produce and apply force, and any specially manufactured primary parts. This includes the manufacture of fixed and mobile or handheld devices, regardless of whether they are designed for industrial, building and civil engineering, agricultural or home use. The manufacture of special equipment for passenger or freight transport within demarcated premises also belongs within this division. This division distinguishes between the manufacture of special-purpose machinery, in other words, machinery for exclusive use in a NACE activity or a small cluster of NACE activities, and general-purpose machinery, in other words, machinery that is being used in a wide range of NACE activities.
Exclusion Note: This division excludes the manufacture of metal products for general use (division 25), associated control devices, computer equipment, measurement and testing equipment, electricity distribution and control apparatus (divisions 26 and 27) and general-purpose motor vehicles (division 29).
broader: MANUFACTURING
in scheme: Statistical Classification of Economic Activities in the European Community, Rev. 2.1 (NACE Rev. 2.1)
Notation: 28
top concept of: Statistical Classification of Economic Activities in the European Community, Rev. 2.1 (NACE Rev. 2.1)

ConceptNoneRandom0.07090641638722095
type: ConceptAssociation
description: NACE Rev. 2.1 class 85.20 is mapped to NACE Rev. 2 class 85.20
Type: 1:1
Source Concept: Primary education
Target Concept: http://data.europa.eu/ux2/nace2/8520
in scheme: Statistical Classification of Economic Activities in the European Community, Rev. 2.1 (NACE Rev. 2.1)
scope note: the content of the NACE Rev 2.1 class is fully covered in the corresponding NACE Rev 2 class
top concept of: Statistical Classification of Economic Activities in the European Community, Rev. 2.1 (NACE Rev. 2.1)
Mapping Cardinality: 1 1

Manufacture of prepared feeds for farm animals
type: Concept
Additional Content Note: This class also includes: - processing of waste products from the food industry into animal feed
CoreContentNote: This class includes: - manufacture of prepared feed for farm animals, including concentrated animal feed and feed supplements - preparation of unmixed (single) feed for farm animals
Exclusion Note: This class excludes: - manufacture of meat products, see 10.13 - manufacture of fishmeal for animal feed, see 10.20 - manufacture of oilseed cake, see 10.41 - activities resulting in by-products usable as animal feed without special treatment (e.g. oilseeds (see 10.41), grain milling residues (see 10.61), etc.)
broader: Manufacture of prepared animal feeds
in scheme: Statistical Classification of Economic Activities in the European Community, Rev. 2.1 (NACE Rev. 2.1)
Notation: 10.91
top concept of: Statistical Classification of Economic Activities in the European Community, Rev. 2.1 (NACE Rev. 2.1)

Sawmilling and planing of wood; processing and finishing of wood
type: Concept
broader: Manufacture of wood and of products of wood and cork, except furniture; manufacture of articles of straw and plaiting materials
in scheme: Statistical Classification of Economic Activities in the European Community, Rev. 2.1 (NACE Rev. 2.1)
Notation: 16.1
top concept of: Statistical Classification of Economic Activities in the European Community, Rev. 2.1 (NACE Rev. 2.1)

Activities of business and employers membership organisations
type: Concept
CoreContentNote: This class includes: - activities of organisations whose members’ interests centre on the development and prosperity of enterprises in a particular line of business or trade (including farming) or on the economic growth and climate of a particular geographical area or political subdivision without regard for the line of business - activities of federations of such associations - activities of chambers of commerce, guilds and similar organisations - dissemination of information, representation before government agencies, public relations and labour negotiations of business and employer organisations
Exclusion Note: This class excludes: - activities of professional membership organisations, see 94.12 - activities of trade unions, see 94.20 - activities of other membership organisations n.e.c., see 94.99 - activities of international organisations of an administrative nature, see 99.00
broader: Activities of business, employers and professional membership organisations
in scheme: Statistical Classification of Economic Activities in the European Community, Rev. 2.1 (NACE Rev. 2.1)
Notation: 94.11
top concept of: Statistical Classification of Economic Activities in the European Community, Rev. 2.1 (NACE Rev. 2.1)

ConceptNoneRandom0.11403275196367701
type: ConceptAssociation
description: NACE Rev. 2.1 class 64.32 is mapped to NACE Rev. 2 class 64.30
Type: 2:1
Source Concept: Activities of trust, estate and agency accounts
Target Concept: http://data.europa.eu/ux2/nace2/6430
in scheme: Statistical Classification of Economic Activities in the European Community, Rev. 2.1 (NACE Rev. 2.1)
scope note: the content of the NACE Rev 2.1 class is fully covered in the corresponding NACE Rev 2 class
top concept of: Statistical Classification of Economic Activities in the European Community, Rev. 2.1 (NACE Rev. 2.1)
Mapping Cardinality: n 1

Manufacture of veneer sheets and wood-based panels
type: Concept
Additional Content Note: This class also includes: - manufacture of insulating fibreboards of wood, or other ligneous materials, whether or not bonded with resins or other organic substances
CoreContentNote: This class includes: - manufacture of veneer sheets thin enough to be used for veneering, making plywood or other purposes: • smoothed, dyed, coated, impregnated, reinforced (with paper or fabric backing) • made in the form of motifs - manufacture of plywood, veneer panels and similar laminated wood boards and sheets - manufacture of oriented strand board (OSB) and other particle board - manufacture of medium density fibreboard (MDF) and other fibreboard - manufacture of densified wood - manufacture of glue-laminated wood, cross-laminated timber (CLT) and laminated veneer wood
broader: Manufacture of products of wood, cork, straw and plaiting materials
in scheme: Statistical Classification of Economic Activities in the European Community, Rev. 2.1 (NACE Rev. 2.1)
Notation: 16.21
top concept of: Statistical Classification of Economic Activities in the European Community, Rev. 2.1 (NACE Rev. 2.1)

ConceptNoneRandom0.6018412488036085
type: ConceptAssociation
description: NACE Rev. 2.1 group 55.1 is mapped to NACE Rev. 2 group 55.1
Type: 1:1
Source Concept: Hotels and similar accommodation
Target Concept: http://data.europa.eu/ux2/nace2/551
in scheme: Statistical Classification of Economic Activities in the European Community, Rev. 2.1 (NACE Rev. 2.1)
top concept of: Statistical Classification of Economic Activities in the European Community, Rev. 2.1 (NACE Rev. 2.1)
Mapping Cardinality: 1 1

News agency and other content distribution activities
type: Concept
CoreContentNote: This group includes the activities of news agencies and content distribution sites (for example, social network sites, wiki sites, online gaming / video game sites).
Exclusion Note: This group excludes: - activities of libraries and archives, see 91.1
broader: Programming, broadcasting, news agency and other content distribution activities
in scheme: Statistical Classification of Economic Activities in the European Community, Rev. 2.1 (NACE Rev. 2.1)
Notation: 60.3
top concept of: Statistical Classification of Economic Activities in the European Community, Rev. 2.1 (NACE Rev. 2.1)

ConceptNoneRandom0.5932750343193857
type: ConceptAssociation
description: NACE Rev. 2.1 class 16.28 is mapped to NACE Rev. 2 class 16.29
Type: 17:12
Source Concept: Manufacture of other products of wood and articles of cork, straw and plaiting materials
Target Concept: http://data.europa.eu/ux2/nace2/1629
in scheme: Statistical Classification of Economic Activities in the European Community, Rev. 2.1 (NACE Rev. 2.1)
scope note: the content of the NACE Rev 2.1 class is fully covered in the corresponding NACE Rev 2 class
top concept of: Statistical Classification of Economic Activities in the European Community, Rev. 2.1 (NACE Rev. 2.1)
Mapping Cardinality: n m

ConceptNoneRandom0.16070479966495088
type: ConceptAssociation
description: NACE Rev. 2.1 group 46.6 is mapped to NACE Rev. 2 groups 46.4, 46.6
Type: 3:3
Source Concept: Wholesale of other machinery, equipment and supplies
Target Concept: http://data.europa.eu/ux2/nace2/466
Target Concept: http://data.europa.eu/ux2/nace2/464
in scheme: Statistical Classification of Economic Activities in the European Community, Rev. 2.1 (NACE Rev. 2.1)
top concept of: Statistical Classification of Economic Activities in the European Community, Rev. 2.1 (NACE Rev. 2.1)
Mapping Cardinality: n m

Nursing and midwifery activities
type: Concept
Additional Content Note: This class also includes: - palliative nursing care activities for outpatients
CoreContentNote: This class includes nursing and midwifery activities not performed by medical doctors, for example: - activities of independent nurses, who work in own consulting rooms or at patients’ homes - activities of maternity facilities, without permanent supervision of medical doctors
Exclusion Note: This class excludes: - maternity wards in hospitals, under the direct supervision of medical doctors, see 86.10 - residential nursing care facilities, see 87.10 - homecare services, see 88.10
broader: Other human health activities
in scheme: Statistical Classification of Economic Activities in the European Community, Rev. 2.1 (NACE Rev. 2.1)
Notation: 86.94
top concept of: Statistical Classification of Economic Activities in the European Community, Rev. 2.1 (NACE Rev. 2.1)

Intermediation service activities for courses and tutors
type: Concept
CoreContentNote: This class includes the intermediation of service activities for courses and tutors by bringing clients and service providers together for a fee or commission, without the intermediary providing the services intermediated. These intermediation activities can be carried out on digital platforms or through non-digital channels (including face-to-face, door-to-door, telephone, mail, and so on). The fee or commission can be received from either the client or the provider of the service activities for courses and tutors. Revenue for the intermediation activities can include other sources of income (for example, revenues from the sale of advertising space).
broader: Educational support activities
in scheme: Statistical Classification of Economic Activities in the European Community, Rev. 2.1 (NACE Rev. 2.1)
Notation: 85.61
top concept of: Statistical Classification of Economic Activities in the European Community, Rev. 2.1 (NACE Rev. 2.1)

ConceptNoneRandom0.8771476890779543
type: ConceptAssociation
description: NACE Rev. 2.1 division 41 is mapped to NACE Rev. 2 division 41
Type: 48:49
Source Concept: Construction of residential and non-residential buildings
Target Concept: http://data.europa.eu/ux2/nace2/41
in scheme: Statistical Classification of Economic Activities in the European Community, Rev. 2.1 (NACE Rev. 2.1)
top concept of: Statistical Classification of Economic Activities in the European Community, Rev. 2.1 (NACE Rev. 2.1)
Mapping Cardinality: n m

Other human health activities
type: Concept
CoreContentNote: This group includes medical, curative, rehabilitative or prevention activities (without the provision of accommodation services) by paramedical practitioners and health professionals other than hospitals or practicing medical doctors.
broader: Human health activities
in scheme: Statistical Classification of Economic Activities in the European Community, Rev. 2.1 (NACE Rev. 2.1)
Notation: 86.9
top concept of: Statistical Classification of Economic Activities in the European Community, Rev. 2.1 (NACE Rev. 2.1)

Office administrative and support activities
type: Concept
Additional Content Note: This class also includes support activities for others on a contract or fee basis that are ongoing routine business support functions that businesses and organisations traditionally do for themselves.
CoreContentNote: This class includes the provision of a combination of day-to-day office administrative services (for example, reception, financial planning, billing and record-keeping, personnel, postal and mailing services, and so on), for others on a contract or fee basis. This class includes: - document preparation (e.g. editing, proofreading, typing, word processing and pre-archiving) - other secretarial support services - transcription of documents - letter or résumé writing - provision of mailbox rental services and other postal and mailing services (e.g. pre-sorting, addressing) - duplicating - blueprinting - operation of photocopying machines for photocopying as a self-service - digitalisation of files (without any further processing of data) - formatting of e-books
Exclusion Note: Units classified in this class do not provide operating staff to carry out the complete administrative operations of a business. Units engaged in one particular aspect of these activities are classified according to that particular activity. This class excludes: - printing of documents (offset printing, quick printing, digital printing, etc.), see 18.12 - pre-press services, see 18.13 - storage of paper files, see 52.10 - courier services, see 53.20 - data processing and digitalisation of files associated with the further processing of data, see 63.10 - storage of data files, see 63.10 - rental of non-equipped offices, co-working spaces and fully-equipped offices, see 68.20 - activities of shared service centres (SSC) with strategic and managerial activities/centralised activities, see 70.10 - developing and organising mail advertising campaigns, see 73.11 - renting of containers to be used as offices, see 77.39 - public stenography services and specialised stenotype services (e.g. court reporting), see 82.99 - archiving of all kinds of documents (in paper or electronic forms), see 91.12
broader: Office administrative and support activities
in scheme: Statistical Classification of Economic Activities in the European Community, Rev. 2.1 (NACE Rev. 2.1)
Notation: 82.10
top concept of: Statistical Classification of Economic Activities in the European Community, Rev. 2.1 (NACE Rev. 2.1)

Intermediation service activities for repair and maintenance of computers, personal and household goods, and motor vehicles and motorcycles
type: Concept
broader: Repair and maintenance of computers, personal and household goods, and motor vehicles and motorcycles
in scheme: Statistical Classification of Economic Activities in the European Community, Rev. 2.1 (NACE Rev. 2.1)
Notation: 95.4
top concept of: Statistical Classification of Economic Activities in the European Community, Rev. 2.1 (NACE Rev. 2.1)

Telecommunication reselling activities and intermediation service activities for telecommunication
type: Concept
CoreContentNote: This class includes: - reselling of wired, wireless and satellite telecommunication (i.e. purchasing and reselling network capacity), including activities of telecommunication brokers and resellers of prepaid calling cards and services - intermediation services for wired, wireless and satellite telecommunication activities, including: • agent activities for telecommunication carriers • selling mobile telephone service plans on an agent basis • wireless telephone service plan sales agent activities, selling on behalf of wireless telecommunication carriers • agent activities for mobile virtual network operators (MVNOs) • provision of telephone and internet access in facilities open to the public
Exclusion Note: This class excludes: - provision of telecommunication services by operators of telecommunication infrastructure, see 61.10
broader: Telecommunication reselling activities and intermediation service activities for telecommunication
in scheme: Statistical Classification of Economic Activities in the European Community, Rev. 2.1 (NACE Rev. 2.1)
Notation: 61.20
top concept of: Statistical Classification of Economic Activities in the European Community, Rev. 2.1 (NACE Rev. 2.1)

Manufacture of motor vehicles, trailers and semi-trailers
type: Concept
CoreContentNote: This division includes the manufacture of motor vehicles for transporting passengers or freight. The manufacture of various parts and accessories, as well as the manufacture of trailers and semi-trailers, is included here. The repair and maintenance of motor vehicles produced in this division are classified in 95.31.
broader: MANUFACTURING
in scheme: Statistical Classification of Economic Activities in the European Community, Rev. 2.1 (NACE Rev. 2.1)
Notation: 29
top concept of: Statistical Classification of Economic Activities in the European Community, Rev. 2.1 (NACE Rev. 2.1)

Office administrative and support activities
type: Concept
broader: Office administrative, office support and other business support activities
in scheme: Statistical Classification of Economic Activities in the European Community, Rev. 2.1 (NACE Rev. 2.1)
Notation: 82.1
top concept of: Statistical Classification of Economic Activities in the European Community, Rev. 2.1 (NACE Rev. 2.1)

Manufacture of wiring devices
type: Concept
CoreContentNote: This class includes the manufacture of current-carrying and non-current-carrying wiring devices for electrical circuits regardless of material. This class includes: - manufacture of bus bars, electrical conductors (except switchgear-type) - manufacture of ground fault circuit interrupters (GFCIs) - manufacture of lamp-holders - manufacture of lightning arrestors and coils - manufacture of switches for electrical wiring (e.g. pressure, push-button, snap, tumbler switches) - manufacture of electrical plugs or sockets - manufacture of boxes for electrical wiring (e.g. junction, outlet, switch boxes) - manufacture of electrical conduit and fitting - manufacture of transmission pole and line hardware - manufacture of plastic non-current-carrying wiring devices, including plastic junction boxes, faceplates and similar, plastic pole line fittings and switch covers
Exclusion Note: This class excludes: - manufacture of ceramic insulators, see 23.43
broader: Manufacture of wiring and wiring devices
in scheme: Statistical Classification of Economic Activities in the European Community, Rev. 2.1 (NACE Rev. 2.1)
Notation: 27.33
top concept of: Statistical Classification of Economic Activities in the European Community, Rev. 2.1 (NACE Rev. 2.1)

All other professional, scientific and technical activities n.e.c.
type: Concept
Additional Content Note: This class also includes: - activities carried out by agents and agencies on behalf of individuals usually involving the obtaining of engagements in motion picture, theatrical production or other entertainment or sports attractions, as well as the placement of books, plays, artworks, photographs, etc., with publishers, producers, etc. - economic services for construction projects (e.g. by construction economists) - supervisory board activities - activities of planning and elaboration of projects in the area of hunting management - activities of estimation of the number of game animals
CoreContentNote: This class includes a great variety of service activities generally delivered to commercial clients. It includes those activities for which more advanced professional, scientific and technical skill levels are required, but excludes ongoing, routine business functions that are generally of short duration. This class includes: - business brokerage activities, i.e. arranging for the purchase and sale of small and medium-sized businesses, including professional practices, but excluding real estate brokerage - appraisal activities other than for real estate and insurance (for antiques, jewellery, etc.) - bill auditing and freight rate information - weather forecasting activities - consulting in the area of occupational safety and health at the workplace - agronomy consulting services - environmental consulting activities - energy-saving advice activities - other technical consulting - activities of quantity surveyors
Exclusion Note: This class excludes: - activities of auctioning houses (wholesale) and online auction activities (wholesale), see 46.1 - activities of auctioning houses (retail sale) and online auction activities (retail sale), see 47.9 - activities of real estate brokers, see 68.31 - bookkeeping activities, see 69.20 - activities of management consultants, see 70.20 - activities of architecture and engineering consultants, see 71.1 - environmental engineering activities, see 71.12 - geodetic surveying activities, see 71.12 - industrial and machinery design, see 71.12, 74.11 - veterinary testing and control in relation to food production, see 71.20 - display of advertisements and other advertising design, see 73.11 - sales promotion service activities, see 73.11 - patent brokerage activities, see 74.91 - management services for rights to industrial property (patents, licences, trademarks, franchises, etc.), see 74.91 - security consultants’ activities, see 80.09 - activities of convention and trade show organisers, see 82.30 - administration of loyalty programmes, see 82.99 - consultation of medical doctors, see 86.2 - consumer credit and debt counselling, see 88.99
broader: Other professional, scientific and technical activities n.e.c.
in scheme: Statistical Classification of Economic Activities in the European Community, Rev. 2.1 (NACE Rev. 2.1)
Notation: 74.99
top concept of: Statistical Classification of Economic Activities in the European Community, Rev. 2.1 (NACE Rev. 2.1)

ConceptNoneRandom0.5991156279480921
type: ConceptAssociation
description: NACE Rev. 2.1 class 85.69 is mapped to NACE Rev. 2 class 85.60
Type: 1:1
Source Concept: Educational support activities n.e.c.
Target Concept: http://data.europa.eu/ux2/nace2/8560
in scheme: Statistical Classification of Economic Activities in the European Community, Rev. 2.1 (NACE Rev. 2.1)
scope note: the content of the NACE Rev 2.1 class is fully covered in the corresponding NACE Rev 2 class
top concept of: Statistical Classification of Economic Activities in the European Community, Rev. 2.1 (NACE Rev. 2.1)
Mapping Cardinality: 1 1

Manufacture of motor vehicles
type: Concept
broader: Manufacture of motor vehicles, trailers and semi-trailers
in scheme: Statistical Classification of Economic Activities in the European Community, Rev. 2.1 (NACE Rev. 2.1)
Notation: 29.1
top concept of: Statistical Classification of Economic Activities in the European Community, Rev. 2.1 (NACE Rev. 2.1)

ConceptNoneRandom0.26459816365210465
type: ConceptAssociation
description: NACE Rev. 2.1 class 28.23 is mapped to NACE Rev. 2 class 28.23
Type: 3:3
Source Concept: Manufacture of office machinery and equipment, except computers and peripheral equipment
Target Concept: http://data.europa.eu/ux2/nace2/2823
in scheme: Statistical Classification of Economic Activities in the European Community, Rev. 2.1 (NACE Rev. 2.1)
scope note: the content of the NACE Rev 2.1 class is fully covered in the corresponding NACE Rev 2 class
top concept of: Statistical Classification of Economic Activities in the European Community, Rev. 2.1 (NACE Rev. 2.1)
Mapping Cardinality: n m

ConceptNoneRandom0.3515294769389682
type: ConceptAssociation
description: NACE Rev. 2.1 class 64.31 is mapped to NACE Rev. 2 class 64.30
Type: 2:1
Source Concept: Activities of money market and non-money market investments funds
Target Concept: http://data.europa.eu/ux2/nace2/6430
in scheme: Statistical Classification of Economic Activities in the European Community, Rev. 2.1 (NACE Rev. 2.1)
scope note: the content of the NACE Rev 2.1 class is fully covered in the corresponding NACE Rev 2 class
top concept of: Statistical Classification of Economic Activities in the European Community, Rev. 2.1 (NACE Rev. 2.1)
Mapping Cardinality: n 1

ConceptNoneRandom0.9796932687889305
type: ConceptAssociation
description: NACE Rev. 2.1 group 55.2 is mapped to NACE Rev. 2 group 55.2
Type: 1:1
Source Concept: Holiday and other short-stay accommodation
Target Concept: http://data.europa.eu/ux2/nace2/552
in scheme: Statistical Classification of Economic Activities in the European Community, Rev. 2.1 (NACE Rev. 2.1)
top concept of: Statistical Classification of Economic Activities in the European Community, Rev. 2.1 (NACE Rev. 2.1)
Mapping Cardinality: 1 1

ConceptNoneRandom0.008306991378726591
type: ConceptAssociation
description: NACE Rev. 2.1 group 46.7 is mapped to NACE Rev. 2 groups 45.1, 45.3, 45.4
Type: 42:34
Source Concept: Wholesale of motor vehicles, motorcycles and related parts and accessories
Target Concept: http://data.europa.eu/ux2/nace2/454
Target Concept: http://data.europa.eu/ux2/nace2/453
Target Concept: http://data.europa.eu/ux2/nace2/451
in scheme: Statistical Classification of Economic Activities in the European Community, Rev. 2.1 (NACE Rev. 2.1)
top concept of: Statistical Classification of Economic Activities in the European Community, Rev. 2.1 (NACE Rev. 2.1)
Mapping Cardinality: n m

ConceptNoneRandom0.03045786781493376
type: ConceptAssociation
description: NACE Rev. 2.1 group 20.1 is mapped to NACE Rev. 2 groups 20.1, 38.3
Type: 4:4
Source Concept: Manufacture of basic chemicals, fertilisers and nitrogen compounds, plastics and synthetic rubber in primary forms
Target Concept: http://data.europa.eu/ux2/nace2/383
Target Concept: http://data.europa.eu/ux2/nace2/201
in scheme: Statistical Classification of Economic Activities in the European Community, Rev. 2.1 (NACE Rev. 2.1)
top concept of: Statistical Classification of Economic Activities in the European Community, Rev. 2.1 (NACE Rev. 2.1)
Mapping Cardinality: n m

Physiotherapy activities
type: Concept
Additional Content Note: This class also includes: - activities of medical massage therapists - activities of ergotherapists - activities of occupational therapists
CoreContentNote: This class includes therapies provided by independent professionals to improve mobility, restore function or reduce pain. The therapies provided include physiotherapy, and so on.
Exclusion Note: This class excludes: - activities of osteopaths, see 86.96 - activities of chiropractors, see 86.96 - body treatment techniques (e.g. shiatsu, Thai massage, Watsu, tui na qigong), see 86.99 - activities of massage salons for non-medical massage, see 96.23
broader: Other human health activities
in scheme: Statistical Classification of Economic Activities in the European Community, Rev. 2.1 (NACE Rev. 2.1)
Notation: 86.95
top concept of: Statistical Classification of Economic Activities in the European Community, Rev. 2.1 (NACE Rev. 2.1)

Growing of other non-perennial crops
type: Concept
Additional Content Note: This class also includes: - growing of perennial flowers and other ornamental plants
CoreContentNote: This class includes the growing of all other non-perennial crops, e.g.: - growing of clover, alfalfa, sainfoin, maize, lupines, other grasses, fodder kale and similar forage crops - growing of beet seeds and seeds of forage plants - growing of flowers - cutting of flowers and flower buds - growing of flower seeds
Exclusion Note: This class excludes: - growing of sugar beet seeds, see 01.13 - growing of non-perennial spices and aromatic, drug and pharmaceutical crops, see 01.28
broader: Growing of non-perennial crops
in scheme: Statistical Classification of Economic Activities in the European Community, Rev. 2.1 (NACE Rev. 2.1)
Notation: 01.19
top concept of: Statistical Classification of Economic Activities in the European Community, Rev. 2.1 (NACE Rev. 2.1)

NACE Rev. 2.1 – NACE Rev. 2 Correspondence Table
type: Correspondence
Compares: nace2
Compares: Statistical Classification of Economic Activities in the European Community, Rev. 2.1 (NACE Rev. 2.1)
Made of: ConceptNoneRandom0.5856690949736906
Made of: ConceptNoneRandom0.5832384261841402
Made of: ConceptNoneRandom0.408508542933557
Made of: ConceptNoneRandom0.12122644535087157
Made of: ConceptNoneRandom0.9152396581113879
Made of: ConceptNoneRandom0.5307026392458309
Made of: ConceptNoneRandom0.08317338882948688
Made of: ConceptNoneRandom0.9463058238024554
Made of: ConceptNoneRandom0.6593574982681666
Made of: ConceptNoneRandom0.9383993829266267
Made of: ConceptNoneRandom0.8278420058266468
Made of: ConceptNoneRandom0.7117100645333494
Made of: ConceptNoneRandom0.3724730471871476
Made of: ConceptNoneRandom0.164907077601395
Made of: ConceptNoneRandom0.04468651872263807
Made of: ConceptNoneRandom0.02260577568165334
Made of: ConceptNoneRandom0.43490657115577647
Made of: ConceptNoneRandom0.6216923293090058
Made of: ConceptNoneRandom0.3008875632711555
Made of: ConceptNoneRandom0.7663473079964093
Made of: ConceptNoneRandom0.5322982347501154
Made of: ConceptNoneRandom0.7462938483168031
Made of: ConceptNoneRandom0.7817171845329173
Made of: ConceptNoneRandom0.2128518011911077
Made of: ConceptNoneRandom0.3395638377441048
Made of: ConceptNoneRandom0.6457161428819177
Made of: ConceptNoneRandom0.7126581628920278
Made of: ConceptNoneRandom0.523425368583103
Made of: ConceptNoneRandom0.42366199714143404
Made of: ConceptNoneRandom0.14293364842550615
Made of: ConceptNoneRandom0.7948352172072674
Made of: ConceptNoneRandom0.5793206655356605
Made of: ConceptNoneRandom0.05730194079899553
Made of: ConceptNoneRandom0.7826106466106114
Made of: ConceptNoneRandom0.2933619334587799
Made of: ConceptNoneRandom0.1671501937003399
Made of: ConceptNoneRandom0.27293782810756584
Made of: ConceptNoneRandom0.646442817019237
Made of: ConceptNoneRandom0.8791213889403646
Made of: ConceptNoneRandom0.7623959989680076
Made of: ConceptNoneRandom0.9814461328268329
Made of: ConceptNoneRandom0.1595831686319944
Made of: ConceptNoneRandom0.010357390645876818
Made of: ConceptNoneRandom0.6546362429877391
Made of: ConceptNoneRandom0.36069656635656633
Made of: ConceptNoneRandom0.21001878210250224
Made of: ConceptNoneRandom0.16711038652748011
Made of: ConceptNoneRandom0.1454202147641046
Made of: ConceptNoneRandom0.7947813304969903
Made of: ConceptNoneRandom0.3603622958020585
Made of: ConceptNoneRandom0.6073698038311155
Made of: ConceptNoneRandom0.9176323697242529
Made of: ConceptNoneRandom0.9346257148819936
Made of: ConceptNoneRandom0.9138462749058965
Made of: ConceptNoneRandom0.46503484364943726
Made of: ConceptNoneRandom0.04007362231905287
Made of: ConceptNoneRandom0.32489456429299024
Made of: ConceptNoneRandom0.9153294268185227
Made of: ConceptNoneRandom0.8994246464165712
Made of: ConceptNoneRandom0.6314155420208467
Made of: ConceptNoneRandom0.3385874753919539
Made of: ConceptNoneRandom0.7528261557018736
Made of: ConceptNoneRandom0.4527828489928125
Made of: ConceptNoneRandom0.45145646306685827
Made of: ConceptNoneRandom0.03159703793962054
Made of: ConceptNoneRandom0.44173761010945867
Made of: ConceptNoneRandom0.2644284777621114
Made of: ConceptNoneRandom0.7900448416920656
Made of: ConceptNoneRandom0.8392095277753767
Made of: ConceptNoneRandom0.2746310312309307
Made of: ConceptNoneRandom0.05024760281881657
Made of: ConceptNoneRandom0.07119462314463032
Made of: ConceptNoneRandom0.9502296257799997
Made of: ConceptNoneRandom0.3377620782730004
Made of: ConceptNoneRandom0.8430024480972659
Made of: ConceptNoneRandom0.6791943948021146

ConceptNoneRandom0.8008519998081921
type: ConceptAssociation
description: NACE Rev. 2.1 class 16.27 is mapped to NACE Rev. 2 classes 16.21, 16.22, 16.23, 16.24, 16.29
Type: 17:12
Source Concept: Finishing of wooden products
Target Concept: http://data.europa.eu/ux2/nace2/1622
Target Concept: http://data.europa.eu/ux2/nace2/1621
Target Concept: http://data.europa.eu/ux2/nace2/1629
Target Concept: http://data.europa.eu/ux2/nace2/1624
Target Concept: http://data.europa.eu/ux2/nace2/1623
in scheme: Statistical Classification of Economic Activities in the European Community, Rev. 2.1 (NACE Rev. 2.1)
scope note: 16.21: - finishing of wooden products 16.22: - finishing of wooden products 16.23: - finishing of wooden products 16.24: - finishing of wooden products 16.29: - process of refining or protecting wooden surfaces - finishing of wooden products
top concept of: Statistical Classification of Economic Activities in the European Community, Rev. 2.1 (NACE Rev. 2.1)
Mapping Cardinality: n m

ConceptNoneRandom0.4202582072818588
type: ConceptAssociation
description: NACE Rev. 2.1 class 52.32 is mapped to NACE Rev. 2 classes 49.32, 52.29, 79.11, 79.90
Type: 78:65
Source Concept: Intermediation service activities for passenger transportation
Target Concept: http://data.europa.eu/ux2/nace2/7911
Target Concept: http://data.europa.eu/ux2/nace2/5229
Target Concept: http://data.europa.eu/ux2/nace2/4932
Target Concept: http://data.europa.eu/ux2/nace2/7990
in scheme: Statistical Classification of Economic Activities in the European Community, Rev. 2.1 (NACE Rev. 2.1)
scope note: 52.29: - brokerage for ship and aircraft space 79.90: - other travel-related reservation services: • reservation services for passenger transportation
top concept of: Statistical Classification of Economic Activities in the European Community, Rev. 2.1 (NACE Rev. 2.1)
Mapping Cardinality: n m

ConceptNoneRandom0.547785941767733
type: ConceptAssociation
description: NACE Rev. 2.1 division 88 is mapped to NACE Rev. 2 division 88
Type: 48:49
Source Concept: Social work activities without accommodation
Target Concept: http://data.europa.eu/ux2/nace2/88
in scheme: Statistical Classification of Economic Activities in the European Community, Rev. 2.1 (NACE Rev. 2.1)
top concept of: Statistical Classification of Economic Activities in the European Community, Rev. 2.1 (NACE Rev. 2.1)
Mapping Cardinality: n m

Activities of call centres
type: Concept
broader: Office administrative, office support and other business support activities
in scheme: Statistical Classification of Economic Activities in the European Community, Rev. 2.1 (NACE Rev. 2.1)
Notation: 82.2
top concept of: Statistical Classification of Economic Activities in the European Community, Rev. 2.1 (NACE Rev. 2.1)

ConceptNoneRandom0.3264038571962731
type: ConceptAssociation
description: NACE Rev. 2.1 class 17.12 is mapped to NACE Rev. 2 class 17.12
Type: 1:1
Source Concept: Manufacture of paper and paperboard
Target Concept: http://data.europa.eu/ux2/nace2/1712
in scheme: Statistical Classification of Economic Activities in the European Community, Rev. 2.1 (NACE Rev. 2.1)
scope note: the content of the NACE Rev 2.1 class is fully covered in the corresponding NACE Rev 2 class
top concept of: Statistical Classification of Economic Activities in the European Community, Rev. 2.1 (NACE Rev. 2.1)
Mapping Cardinality: 1 1

Manufacture of fibre optic cables
type: Concept
CoreContentNote: This class includes: - manufacture of fibre-optic cables for data transmission or live transmission of images, whether or not fitted with connectors
Exclusion Note: This class excludes: - manufacture of glass fibres or strand, see 23.14 - manufacture of connectors for optical fibres, optical fibre bundles and cables, see 27.33 - installation of fibre-optic and other cables for buildings, see 43.21
broader: Manufacture of wiring and wiring devices
in scheme: Statistical Classification of Economic Activities in the European Community, Rev. 2.1 (NACE Rev. 2.1)
Notation: 27.31
top concept of: Statistical Classification of Economic Activities in the European Community, Rev. 2.1 (NACE Rev. 2.1)

Manufacture of other electronic and electric wires and cables
type: Concept
CoreContentNote: This class includes: - manufacture of insulated wire and cable, made of steel, copper, aluminium
Exclusion Note: This class excludes: - manufacture (drawing) of wire, see 24.34, 24.41, 24.42, 24.43, 24.44, 24.45 - manufacture of electrical cord sets with insulated wire and connectors, see 27.90 - manufacture of cable sets, wiring harnesses and similar cable sets or assemblies for automotive applications, see 29.31
broader: Manufacture of wiring and wiring devices
in scheme: Statistical Classification of Economic Activities in the European Community, Rev. 2.1 (NACE Rev. 2.1)
Notation: 27.32
top concept of: Statistical Classification of Economic Activities in the European Community, Rev. 2.1 (NACE Rev. 2.1)

Target Concept

Support activities for other mining and quarrying
type: Concept
CoreContentNote: This class includes: - support services on a fee or contract basis, required for mining activities of divisions 05, 07, 08 • exploration services by using traditional prospecting methods (e.g. taking core samples and making geological observations at prospective sites) • draining and pumping services on a fee or contract basis • test drilling and test hole boring - securing mine shafts and tunnels - demolition and dismantling of underground mining facilities
Exclusion Note: This class excludes: - operating mines or quarries on a contract or fee basis, see divisions 05, 07, 08 - specialised repair and maintenance of mining machinery, see 33.12 - geophysical surveying services, on a contract or fee basis, see 71.12
broader: Support activities for other mining and quarrying
in scheme: Statistical Classification of Economic Activities in the European Community, Rev. 2.1 (NACE Rev. 2.1)
Notation: 09.90
top concept of: Statistical Classification of Economic Activities in the European Community, Rev. 2.1 (NACE Rev. 2.1)

Manufacture of bodies and coachwork for motor vehicles; manufacture of trailers and semi-trailers
type: Concept
broader: Manufacture of motor vehicles, trailers and semi-trailers
in scheme: Statistical Classification of Economic Activities in the European Community, Rev. 2.1 (NACE Rev. 2.1)
Notation: 29.2
top concept of: Statistical Classification of Economic Activities in the European Community, Rev. 2.1 (NACE Rev. 2.1)

ConceptNoneRandom0.8335627270711552
type: ConceptAssociation
description: NACE Rev. 2.1 class 28.24 is mapped to NACE Rev. 2 class 28.24
Type: 1:1
Source Concept: Manufacture of power-driven hand tools
Target Concept: http://data.europa.eu/ux2/nace2/2824
in scheme: Statistical Classification of Economic Activities in the European Community, Rev. 2.1 (NACE Rev. 2.1)
scope note: the content of the NACE Rev 2.1 class is fully covered in the corresponding NACE Rev 2 class
top concept of: Statistical Classification of Economic Activities in the European Community, Rev. 2.1 (NACE Rev. 2.1)
Mapping Cardinality: 1 1

Radio broadcasting and audio distribution activities
type: Concept
broader: Programming, broadcasting, news agency and other content distribution activities
in scheme: Statistical Classification of Economic Activities in the European Community, Rev. 2.1 (NACE Rev. 2.1)
Notation: 60.1
top concept of: Statistical Classification of Economic Activities in the European Community, Rev. 2.1 (NACE Rev. 2.1)

Administration of financial markets
type: Concept
CoreContentNote: This class includes the operation and supervision of financial markets other than by central banks and public authorities, for example: - commodity contracts exchanges - futures commodity contracts exchanges - securities exchanges - stock exchanges - stock or commodity options exchanges - crypto-asset exchanges - administration of financial markets, except insurance and pension funding - financial supervisory authorities of financial service activities, except insurance and pension funding (not by the central bank)
Exclusion Note: This class excludes: - energy exchanges for electricity, transmission or distribution capacities, see division 35 - administration of financial markets for insurance and pension funding, see 66.29 - financial supervisory authorities of insurance and pension funding (not by the central bank), see 66.29 - financial and market regulation relating to the conduct of business and consumer protection and other wider financial regulatory activities, see 84.13
broader: Activities auxiliary to financial services, except insurance and pension funding
in scheme: Statistical Classification of Economic Activities in the European Community, Rev. 2.1 (NACE Rev. 2.1)
Notation: 66.11
top concept of: Statistical Classification of Economic Activities in the European Community, Rev. 2.1 (NACE Rev. 2.1)

ConceptNoneRandom0.5833685004272616
type: ConceptAssociation
description: NACE Rev. 2.1 group 03.2 is mapped to NACE Rev. 2 group 03.2
Type: 26:18
Source Concept: Aquaculture
Target Concept: http://data.europa.eu/ux2/nace2/032
in scheme: Statistical Classification of Economic Activities in the European Community, Rev. 2.1 (NACE Rev. 2.1)
top concept of: Statistical Classification of Economic Activities in the European Community, Rev. 2.1 (NACE Rev. 2.1)
Mapping Cardinality: n m

Other financial service activities, except insurance and pension funding
type: Concept
CoreContentNote: This group includes financial service activities (except insurance and pension funding activities), other than those conducted by monetary institutions, holding companies and financing conduits, trusts, funds and similar entities.
Exclusion Note: This group excludes: - insurance and pension funding activities, see division 65
broader: Financial service activities, except insurance and pension funding
in scheme: Statistical Classification of Economic Activities in the European Community, Rev. 2.1 (NACE Rev. 2.1)
Notation: 64.9
top concept of: Statistical Classification of Economic Activities in the European Community, Rev. 2.1 (NACE Rev. 2.1)

ConceptNoneRandom0.5041007283325903
type: ConceptAssociation
description: NACE Rev. 2.1 class 99.00 is mapped to NACE Rev. 2 class 99.00
Type: 1:1
Source Concept: Activities of extraterritorial organisations and bodies
Target Concept: http://data.europa.eu/ux2/nace2/9900
in scheme: Statistical Classification of Economic Activities in the European Community, Rev. 2.1 (NACE Rev. 2.1)
scope note: the content of the NACE Rev 2.1 class is fully covered in the corresponding NACE Rev 2 class
top concept of: Statistical Classification of Economic Activities in the European Community, Rev. 2.1 (NACE Rev. 2.1)
Mapping Cardinality: 1 1

ConceptNoneRandom0.8719128876302301
type: ConceptAssociation
description: NACE Rev. 2.1 class 32.30 is mapped to NACE Rev. 2 class 32.30
Type: 11:11
Source Concept: Manufacture of sports goods
Target Concept: http://data.europa.eu/ux2/nace2/3230
in scheme: Statistical Classification of Economic Activities in the European Community, Rev. 2.1 (NACE Rev. 2.1)
scope note: the content of the NACE Rev 2.1 class is fully covered in the corresponding NACE Rev 2 class
top concept of: Statistical Classification of Economic Activities in the European Community, Rev. 2.1 (NACE Rev. 2.1)
Mapping Cardinality: n m

ConceptNoneRandom0.5579993685464779
type: ConceptAssociation
description: NACE Rev. 2.1 class 30.12 is mapped to NACE Rev. 2 class 30.12
Type: 1:1
Source Concept: Building of pleasure and sporting boats
Target Concept: http://data.europa.eu/ux2/nace2/3012
in scheme: Statistical Classification of Economic Activities in the European Community, Rev. 2.1 (NACE Rev. 2.1)
scope note: the content of the NACE Rev 2.1 class is fully covered in the corresponding NACE Rev 2 class
top concept of: Statistical Classification of Economic Activities in the European Community, Rev. 2.1 (NACE Rev. 2.1)
Mapping Cardinality: 1 1

Manufacture of pharmaceutical preparations
type: Concept
Additional Content Note: This class also includes: - manufacture of medical impregnated wadding, gauze, bandages, dressings, etc. - preparation of botanical products (grinding, grading, milling) for pharmaceutical use - manufacture of viral vector-based medicines or vaccines - manufacture of pharmaceutical preparations for veterinary medicines
CoreContentNote: This class includes: - manufacture of medicaments: • antisera and other blood fractions • vaccines • diverse medicaments, including homeopathic preparations - manufacture of chemical contraceptive products for external use and hormonal contraceptive medicaments - manufacture of medical diagnostic preparations, including pregnancy tests - manufacture of radioactive in-vivo diagnostic substances - manufacture of cell and gene advance therapy medical products
Exclusion Note: This class excludes: - manufacture of herb infusions (mint, vervain, chamomile, etc.), see 10.83 - manufacture of probiotics, see 21.10 - manufacture of dental fillings and dental cement, see 32.50 - manufacture of bone reconstruction cements, see 32.50 - manufacture of surgical drapes, see 32.50 - wholesale of pharmaceuticals, see 46.46 - retail sale of pharmaceuticals, see 47.73 - research and development for pharmaceuticals and other biotech products, see 72.10 - packaging of pharmaceuticals, see 82.92
broader: Manufacture of pharmaceutical preparations
in scheme: Statistical Classification of Economic Activities in the European Community, Rev. 2.1 (NACE Rev. 2.1)
Notation: 21.20
top concept of: Statistical Classification of Economic Activities in the European Community, Rev. 2.1 (NACE Rev. 2.1)

ConceptNoneRandom0.25716524804514196
type: ConceptAssociation
description: NACE Rev. 2.1 class 77.21 is mapped to NACE Rev. 2 class 77.21
Type: 1:1
Source Concept: Rental and leasing of recreational and sports goods
Target Concept: http://data.europa.eu/ux2/nace2/7721
in scheme: Statistical Classification of Economic Activities in the European Community, Rev. 2.1 (NACE Rev. 2.1)
scope note: the content of the NACE Rev 2.1 class is fully covered in the corresponding NACE Rev 2 class
top concept of: Statistical Classification of Economic Activities in the European Community, Rev. 2.1 (NACE Rev. 2.1)
Mapping Cardinality: 1 1

Wholesale of information and communication equipment
type: Concept
CoreContentNote: This class includes the wholesale of information and communication technology (ICT) equipment. This class includes: - wholesale of computers, computer peripheral equipment and parts - wholesale of smart boards - wholesale of non-customised software, including video games, provided on physical media, with a right to perpetual use - wholesale of electronic valves and tubes - wholesale of semiconductor devices - wholesale of microchips and integrated circuits - wholesale of printed circuits - wholesale of recordable media - wholesale of telephone and communication equipment (e.g. mobile telephones, modems) - wholesale of office machinery and equipment
Exclusion Note: This class excludes: - wholesale of recorded media, see 46.49 - wholesale of machines for additive manufacturing (3D printers, etc.), see 46.64 - publishing activities, see division 58
broader: Wholesale of information and communication equipment
in scheme: Statistical Classification of Economic Activities in the European Community, Rev. 2.1 (NACE Rev. 2.1)
Notation: 46.50
top concept of: Statistical Classification of Economic Activities in the European Community, Rev. 2.1 (NACE Rev. 2.1)

ConceptNoneRandom0.46079984805707097
type: ConceptAssociation
description: NACE Rev. 2.1 group 91.3 is mapped to NACE Rev. 2 groups 33.1, 41.2, 90.0
Type: 26:18
Source Concept: Conservation, restoration and other support activities for cultural heritage
Target Concept: http://data.europa.eu/ux2/nace2/900
Target Concept: http://data.europa.eu/ux2/nace2/331
Target Concept: http://data.europa.eu/ux2/nace2/412
in scheme: Statistical Classification of Economic Activities in the European Community, Rev. 2.1 (NACE Rev. 2.1)
top concept of: Statistical Classification of Economic Activities in the European Community, Rev. 2.1 (NACE Rev. 2.1)
Mapping Cardinality: n m

Retail sale of motorcycles, motorcycle parts and accessories
type: Concept
CoreContentNote: This class includes: - retail sale of new and used motorcycles, including mopeds - retail sale of new and used parts and accessories for motorcycles - retail sale of protective gear for motorcyclists
Exclusion Note: This class excludes: - retail sale of bicycles, electric bicycles, monowheels, hoverboards, kickscooters, and related parts and accessories, see 47.63 - rental of motorcycles, see 77.11 - repair and maintenance of bicycles, electric bicycles, monowheels, hoverboards, kickscooters, see 95.29 - repair and maintenance of motorcycles, see 95.32
broader: Retail sale of motor vehicles, motorcycles and related parts and accessories
in scheme: Statistical Classification of Economic Activities in the European Community, Rev. 2.1 (NACE Rev. 2.1)
Notation: 47.83
top concept of: Statistical Classification of Economic Activities in the European Community, Rev. 2.1 (NACE Rev. 2.1)

Repair and maintenance of personal and household goods
type: Concept
CoreContentNote: This group includes the repair and maintenance of personal and household goods.
broader: Repair and maintenance of computers, personal and household goods, and motor vehicles and motorcycles
in scheme: Statistical Classification of Economic Activities in the European Community, Rev. 2.1 (NACE Rev. 2.1)
Notation: 95.2
top concept of: Statistical Classification of Economic Activities in the European Community, Rev. 2.1 (NACE Rev. 2.1)

ConceptNoneRandom0.4933549102909167
type: ConceptAssociation
description: NACE Rev. 2.1 group 82.9 is mapped to NACE Rev. 2 group 82.9
Type: 42:34
Source Concept: Business support service activities n.e.c.
Target Concept: http://data.europa.eu/ux2/nace2/829
in scheme: Statistical Classification of Economic Activities in the European Community, Rev. 2.1 (NACE Rev. 2.1)
top concept of: Statistical Classification of Economic Activities in the European Community, Rev. 2.1 (NACE Rev. 2.1)
Mapping Cardinality: n m

ConceptNoneRandom0.38256335630270855
type: ConceptAssociation
description: NACE Rev. 2.1 class 10.51 is mapped to NACE Rev. 2 class 10.51
Type: 1:1
Source Concept: Manufacture of dairy products
Target Concept: http://data.europa.eu/ux2/nace2/1051
in scheme: Statistical Classification of Economic Activities in the European Community, Rev. 2.1 (NACE Rev. 2.1)
scope note: the content of the NACE Rev 2.1 class is fully covered in the corresponding NACE Rev 2 class
top concept of: Statistical Classification of Economic Activities in the European Community, Rev. 2.1 (NACE Rev. 2.1)
Mapping Cardinality: 1 1

Mining of iron ores
type: Concept
broader: Mining of metal ores
in scheme: Statistical Classification of Economic Activities in the European Community, Rev. 2.1 (NACE Rev. 2.1)
Notation: 07.1
top concept of: Statistical Classification of Economic Activities in the European Community, Rev. 2.1 (NACE Rev. 2.1)

ConceptNoneRandom0.1480106380067504
type: ConceptAssociation
description: NACE Rev. 2.1 class 28.29 is mapped to NACE Rev. 2 class 28.29
Type: 2:2
Source Concept: Manufacture of other general-purpose machinery n.e.c.
Target Concept: http://data.europa.eu/ux2/nace2/2829
in scheme: Statistical Classification of Economic Activities in the European Community, Rev. 2.1 (NACE Rev. 2.1)
scope note: the content of the NACE Rev 2.1 class is fully covered in the corresponding NACE Rev 2 class
top concept of: Statistical Classification of Economic Activities in the European Community, Rev. 2.1 (NACE Rev. 2.1)
Mapping Cardinality: n m

ConceptNoneRandom0.4256890202064282
type: ConceptAssociation
description: NACE Rev. 2.1 group 38.3 is mapped to NACE Rev. 2 group 38.2
Type: 4:4
Source Concept: Waste disposal without recovery
Target Concept: http://data.europa.eu/ux2/nace2/382
in scheme: Statistical Classification of Economic Activities in the European Community, Rev. 2.1 (NACE Rev. 2.1)
top concept of: Statistical Classification of Economic Activities in the European Community, Rev. 2.1 (NACE Rev. 2.1)
Mapping Cardinality: n m

Beverage serving activities
type: Concept
Additional Content Note: This class also includes: - bar activities aboard a means of transport (e.g. a train or ship), when carried out by separate units
CoreContentNote: This class predominantly includes serving beverages for immediate consumption on the premises. The activities can include the provision of, for example live music and dance activities. This class includes activities of: - bars - cocktail lounges - pubs - coffee houses - tea rooms - fruit juice bars - mobile beverage serving
Exclusion Note: This class excludes: - reselling packaged/prepared beverages, see division 47 - retail sale of beverages through vending machines, see 47.2 - provision of beverage preparation and supply based on contractual arrangements with the customer, for a fixed term, see 56.22 - operation of concert halls and music venues, see 90.31 - operation of dance floors where beverage serving is not the main activity, see 93.29
broader: Beverage serving activities
in scheme: Statistical Classification of Economic Activities in the European Community, Rev. 2.1 (NACE Rev. 2.1)
Notation: 56.30
top concept of: Statistical Classification of Economic Activities in the European Community, Rev. 2.1 (NACE Rev. 2.1)

Manufacture of furniture
type: Concept
Additional Content Note: This class also includes: - manufacture of catering carts - manufacture of built-in components for shop furniture - finishing of furniture (e.g. spraying, painting, polishing, upholstering) - manufacture of walk-in wardrobes
CoreContentNote: This class includes the manufacture of furniture of any material, for any place and for various purposes. It also includes the manufacture of parts of furniture, except of sheets and slabs (whether or not cut to shape) of glass (including mirrors), marble or other stone, concrete or similar material. This class includes: - manufacture of chairs and seats for offices, workrooms, hotels, restaurants and public premises - manufacture of chairs and seats for theatres, cinemas, etc. - manufacture of special furniture for shops: counters, display cases, shelves, etc. - manufacture of office furniture - manufacture of laboratory benches, stools, and other laboratory seating, laboratory furniture (e.g. cabinets and tables) - manufacture of furniture for churches, schools, restaurants - manufacture of kitchen furniture - manufacture of sofas, sofa beds and sofa sets - manufacture of garden chairs and seats - manufacture of furniture for bedrooms, living rooms, gardens, etc. - manufacture of cabinets for sewing machines, televisions, etc. - manufacture of mattresses and of mattress supports
Exclusion Note: This class excludes: - manufacture of pillows, pouffes, cushions, quilts and eiderdowns, see 13.92 - manufacture of wooden mouldings which are not recognisable as integral parts of furniture, see 16.1 - manufacture of builders’ carpentry and joinery, see 16.23 - manufacture of inflatable rubber mattresses, see 22.12 - manufacture of rubber waterbed mattresses, see 22.12 - manufacture of sheets and slabs (whether or not cut to shape) of ceramics, concrete and stone, see 23.42, 23.66, 23.70 - manufacture of light fittings or lamps, see 27.40 - manufacture of blackboards, see 28.23 - manufacture of car seats, see 29.32 - manufacture of baby seat for cars, see 29.32 - manufacture of railway car seats, see 30.20 - manufacture of aircraft seats, see 30.31, 30.32 - manufacture of medical, surgical, dental or veterinary furniture, see 32.50 - installation of modular furniture attachment, partition installation, laboratory equipment furniture installation at construction site, see 43.32 - installation of built-in components for shop furniture, see 43.32 - reupholstering, refinishing and repairing of furniture, see 95.24
broader: Manufacture of furniture
in scheme: Statistical Classification of Economic Activities in the European Community, Rev. 2.1 (NACE Rev. 2.1)
Notation: 31.00
top concept of: Statistical Classification of Economic Activities in the European Community, Rev. 2.1 (NACE Rev. 2.1)

Television programming, broadcasting and video distribution activities
type: Concept
broader: Programming, broadcasting, news agency and other content distribution activities
in scheme: Statistical Classification of Economic Activities in the European Community, Rev. 2.1 (NACE Rev. 2.1)
Notation: 60.2
top concept of: Statistical Classification of Economic Activities in the European Community, Rev. 2.1 (NACE Rev. 2.1)

ConceptNoneRandom0.5165164317045872
type: ConceptAssociation
description: NACE Rev. 2.1 group 03.3 is mapped to NACE Rev. 2 groups 03.1, 03.2, 33.1
Type: 26:18
Source Concept: Support activities for fishing and aquaculture
Target Concept: http://data.europa.eu/ux2/nace2/032
Target Concept: http://data.europa.eu/ux2/nace2/031
Target Concept: http://data.europa.eu/ux2/nace2/331
in scheme: Statistical Classification of Economic Activities in the European Community, Rev. 2.1 (NACE Rev. 2.1)
top concept of: Statistical Classification of Economic Activities in the European Community, Rev. 2.1 (NACE Rev. 2.1)
Mapping Cardinality: n m

ConceptNoneRandom0.6771844017128436
type: ConceptAssociation
description: NACE Rev. 2.1 class 77.22 is mapped to NACE Rev. 2 classes 77.22, 77.29
Type: 1:2
Source Concept: Rental and leasing of other personal and household goods
Target Concept: http://data.europa.eu/ux2/nace2/7722
Target Concept: http://data.europa.eu/ux2/nace2/7729
in scheme: Statistical Classification of Economic Activities in the European Community, Rev. 2.1 (NACE Rev. 2.1)
scope note: 77.22: - rental of video tapes, records, CDs, DVDs etc. 77.29: - rental of all kinds of household or personal goods, to households or industries (except recreational and sports equipment): • textiles, wearing apparel and footwear • furniture, pottery and glass, kitchen and tableware, electrical appliances and house wares • jewellery, musical instruments, scenery and costumes • books, journals and magazines • machinery and equipment used by amateurs or as a hobby e.g. tools for home repairs • flowers and plants • electronic equipment for household use - rental of gazebos and tensile structures without additional services
top concept of: Statistical Classification of Economic Activities in the European Community, Rev. 2.1 (NACE Rev. 2.1)
Mapping Cardinality: 1 m

ConceptNoneRandom0.712032222473968
type: ConceptAssociation
description: NACE Rev. 2.1 group 91.4 is mapped to NACE Rev. 2 group 91.0
Type: 3:1
Source Concept: Botanical and zoological garden and nature reserve activities
Target Concept: http://data.europa.eu/ux2/nace2/910
in scheme: Statistical Classification of Economic Activities in the European Community, Rev. 2.1 (NACE Rev. 2.1)
top concept of: Statistical Classification of Economic Activities in the European Community, Rev. 2.1 (NACE Rev. 2.1)
Mapping Cardinality: n 1

ConceptNoneRandom0.9271286960865464
type: ConceptAssociation
description: NACE Rev. 2.1 class 30.13 is mapped to NACE Rev. 2 class 30.11
Type: 2:1
Source Concept: Building of military ships and vessels
Target Concept: http://data.europa.eu/ux2/nace2/3011
in scheme: Statistical Classification of Economic Activities in the European Community, Rev. 2.1 (NACE Rev. 2.1)
scope note: the content of the NACE Rev 2.1 class is fully covered in the corresponding NACE Rev 2 class
top concept of: Statistical Classification of Economic Activities in the European Community, Rev. 2.1 (NACE Rev. 2.1)
Mapping Cardinality: n 1

Repair and maintenance of motor vehicles and motorcycles
type: Concept
CoreContentNote: This group includes the repair and maintenance of motor vehicles and motorcycles.
broader: Repair and maintenance of computers, personal and household goods, and motor vehicles and motorcycles
in scheme: Statistical Classification of Economic Activities in the European Community, Rev. 2.1 (NACE Rev. 2.1)
Notation: 95.3
top concept of: Statistical Classification of Economic Activities in the European Community, Rev. 2.1 (NACE Rev. 2.1)

ConceptNoneRandom0.8502378164319736
type: ConceptAssociation
description: NACE Rev. 2.1 division 02 is mapped to NACE Rev. 2 division 02
Type: 1:1
Source Concept: Forestry and logging
Target Concept: http://data.europa.eu/ux2/nace2/02
in scheme: Statistical Classification of Economic Activities in the European Community, Rev. 2.1 (NACE Rev. 2.1)
top concept of: Statistical Classification of Economic Activities in the European Community, Rev. 2.1 (NACE Rev. 2.1)
Mapping Cardinality: 1 1

ConceptNoneRandom0.602009559650042
type: ConceptAssociation
description: NACE Rev. 2.1 division 03 is mapped to NACE Rev. 2 divisions 03, 33
Type: 48:49
Source Concept: Fishing and aquaculture
Target Concept: http://data.europa.eu/ux2/nace2/33
Target Concept: http://data.europa.eu/ux2/nace2/03
in scheme: Statistical Classification of Economic Activities in the European Community, Rev. 2.1 (NACE Rev. 2.1)
top concept of: Statistical Classification of Economic Activities in the European Community, Rev. 2.1 (NACE Rev. 2.1)
Mapping Cardinality: n m

Mining of non-ferrous metal ores
type: Concept
CoreContentNote: This group includes the mining of non-ferrous metal ores.
broader: Mining of metal ores
in scheme: Statistical Classification of Economic Activities in the European Community, Rev. 2.1 (NACE Rev. 2.1)
Notation: 07.2
top concept of: Statistical Classification of Economic Activities in the European Community, Rev. 2.1 (NACE Rev. 2.1)

ConceptNoneRandom0.3420306874851681
type: ConceptAssociation
description: NACE Rev. 2.1 class 20.30 is mapped to NACE Rev. 2 class 20.30
Type: 1:1
Source Concept: Manufacture of paints, varnishes and similar coatings, printing ink and mastics
Target Concept: http://data.europa.eu/ux2/nace2/2030
in scheme: Statistical Classification of Economic Activities in the European Community, Rev. 2.1 (NACE Rev. 2.1)
scope note: the content of the NACE Rev 2.1 class is fully covered in the corresponding NACE Rev 2 class
top concept of: Statistical Classification of Economic Activities in the European Community, Rev. 2.1 (NACE Rev. 2.1)
Mapping Cardinality: 1 1

ConceptNoneRandom0.026591026211403634
type: ConceptAssociation
description: NACE Rev. 2.1 class 42.11 is mapped to NACE Rev. 2 class 42.11
Type: 23:16
Source Concept: Construction of roads and motorways
Target Concept: http://data.europa.eu/ux2/nace2/4211
in scheme: Statistical Classification of Economic Activities in the European Community, Rev. 2.1 (NACE Rev. 2.1)
scope note: the content of the NACE Rev 2.1 class is fully covered in the corresponding NACE Rev 2 class
top concept of: Statistical Classification of Economic Activities in the European Community, Rev. 2.1 (NACE Rev. 2.1)
Mapping Cardinality: n m

ConceptNoneRandom0.9401959251058122
type: ConceptAssociation
description: NACE Rev. 2.1 group 25.1 is mapped to NACE Rev. 2 group 25.1
Type: 1:1
Source Concept: Manufacture of structural metal products
Target Concept: http://data.europa.eu/ux2/nace2/251
in scheme: Statistical Classification of Economic Activities in the European Community, Rev. 2.1 (NACE Rev. 2.1)
top concept of: Statistical Classification of Economic Activities in the European Community, Rev. 2.1 (NACE Rev. 2.1)
Mapping Cardinality: 1 1

Market research and public opinion polling
type: Concept
broader: Activities of advertising, market research and public relations
in scheme: Statistical Classification of Economic Activities in the European Community, Rev. 2.1 (NACE Rev. 2.1)
Notation: 73.2
top concept of: Statistical Classification of Economic Activities in the European Community, Rev. 2.1 (NACE Rev. 2.1)

Activities of performing arts
type: Concept
Additional Content Note: This class also includes: - activities of photo models - activities of independent musicians and actors appearing in video and audiovisual content of all kinds - operation of performing arts facilities for own ensemble - activities of influencers appearing in vlogs published by a third party
CoreContentNote: This class includes activities in the performing arts and related activities. It includes: - live stage productions (theatrical presentations, concerts, operas, dances and others): • activities of performing groups, circuses or companies, orchestras or bands • activities of performing artists (e.g. actors (including stand-up comedians), dancers, musicians (including activities of independent musicians), conductors)
Exclusion Note: This class excludes: - publishing texts and photographs and other contents without video by influencers or bloggers, see 58.19 - production of video and audiovisual content, including vlogs, see 59.11 - activities of personal theatrical or artistic agents or agencies, see 74.99 - casting activities, see 78.10 - activities of bloggers not self-publishing their own created content, see 90.11
broader: Activities of performing arts
in scheme: Statistical Classification of Economic Activities in the European Community, Rev. 2.1 (NACE Rev. 2.1)
Notation: 90.20
top concept of: Statistical Classification of Economic Activities in the European Community, Rev. 2.1 (NACE Rev. 2.1)

Construction of other civil engineering projects
type: Concept
broader: Civil engineering
in scheme: Statistical Classification of Economic Activities in the European Community, Rev. 2.1 (NACE Rev. 2.1)
Notation: 42.9
top concept of: Statistical Classification of Economic Activities in the European Community, Rev. 2.1 (NACE Rev. 2.1)

ConceptNoneRandom0.361742368827498
type: ConceptAssociation
description: NACE Rev. 2.1 group 91.1 is mapped to NACE Rev. 2 group 91.0
Type: 3:1
Source Concept: Library and archive activities
Target Concept: http://data.europa.eu/ux2/nace2/910
in scheme: Statistical Classification of Economic Activities in the European Community, Rev. 2.1 (NACE Rev. 2.1)
top concept of: Statistical Classification of Economic Activities in the European Community, Rev. 2.1 (NACE Rev. 2.1)
Mapping Cardinality: n 1

Intermediation service activities for real estate activities
type: Concept
Additional Content Note: This class also includes: - real estate listing services
CoreContentNote: This class includes the intermediation of buying, selling and rental of real estate by bringing clients and sellers or service providers together for a fee or commission. These intermediation activities can be carried out on digital platforms or through non-digital channels (including face-to-face, door-to-door, telephone, mail, and so on). The fee or commission can be received from either the client or the seller of the real estate or the provider of the real estate service. Revenue for the intermediation activities can include other sources of income (for example, revenues from selling advertising space to third parties). This class includes the provision of real estate activities by real estate agencies or independent real estate agents: - intermediation in buying, selling and rental of real estate on a fee or contract basis
Exclusion Note: This class excludes: - activities of real estate escrow agents, see 68.32 - legal activities, see 69.10
broader: Real estate activities on a fee or contract basis
in scheme: Statistical Classification of Economic Activities in the European Community, Rev. 2.1 (NACE Rev. 2.1)
Notation: 68.31
top concept of: Statistical Classification of Economic Activities in the European Community, Rev. 2.1 (NACE Rev. 2.1)

ConceptNoneRandom0.5950232572944029
type: ConceptAssociation
description: NACE Rev. 2.1 class 55.40 is mapped to NACE Rev. 2 classes 79.11, 79.90
Type: 78:65
Source Concept: Intermediation service activities for accommodation
Target Concept: http://data.europa.eu/ux2/nace2/7911
Target Concept: http://data.europa.eu/ux2/nace2/7990
in scheme: Statistical Classification of Economic Activities in the European Community, Rev. 2.1 (NACE Rev. 2.1)
scope note: 79.90: - other travel-related reservation services: • reservation services for accommodation - time-share exchange services
top concept of: Statistical Classification of Economic Activities in the European Community, Rev. 2.1 (NACE Rev. 2.1)
Mapping Cardinality: n m

ConceptNoneRandom0.2622312151961551
type: ConceptAssociation
description: NACE Rev. 2.1 division 06 is mapped to NACE Rev. 2 division 06
Type: 1:1
Source Concept: Extraction of crude petroleum and natural gas
Target Concept: http://data.europa.eu/ux2/nace2/06
in scheme: Statistical Classification of Economic Activities in the European Community, Rev. 2.1 (NACE Rev. 2.1)
top concept of: Statistical Classification of Economic Activities in the European Community, Rev. 2.1 (NACE Rev. 2.1)
Mapping Cardinality: 1 1

ConceptNoneRandom0.6237774638328012
type: ConceptAssociation
description: NACE Rev. 2.1 class 43.41 is mapped to NACE Rev. 2 classes 43.91, 43.99
Type: 23:16
Source Concept: Roofing activities
Target Concept: http://data.europa.eu/ux2/nace2/4391
Target Concept: http://data.europa.eu/ux2/nace2/4399
in scheme: Statistical Classification of Economic Activities in the European Community, Rev. 2.1 (NACE Rev. 2.1)
scope note: 43.91: - roof framing works - installation of roof truss - external insulation of roofs - laying of roof covering - installation of insulation in roofs - installation of drains, eaves gutters and rainwater pipes - installation of rooflights and roofhatches - installation of snowguards on pitched roofs - installation of roof safety equipment 43.99: - waterproofing of roofs
top concept of: Statistical Classification of Economic Activities in the European Community, Rev. 2.1 (NACE Rev. 2.1)
Mapping Cardinality: n m

Manufacture of ice cream and other edible ice
type: Concept
CoreContentNote: This class includes: - manufacture of ice cream and other edible ice (e.g. sorbet)
Exclusion Note: This class excludes: - production of ice from natural water for cooling purposes, see 35.30 - activities of ice cream parlours, see 56.1
broader: Manufacture of dairy products and edible ice
in scheme: Statistical Classification of Economic Activities in the European Community, Rev. 2.1 (NACE Rev. 2.1)
Notation: 10.52
top concept of: Statistical Classification of Economic Activities in the European Community, Rev. 2.1 (NACE Rev. 2.1)

ConceptNoneRandom0.31183774452910096
type: ConceptAssociation
description: NACE Rev. 2.1 class 65.20 is mapped to NACE Rev. 2 class 65.20
Type: 1:1
Source Concept: Reinsurance
Target Concept: http://data.europa.eu/ux2/nace2/6520
in scheme: Statistical Classification of Economic Activities in the European Community, Rev. 2.1 (NACE Rev. 2.1)
scope note: the content of the NACE Rev 2.1 class is fully covered in the corresponding NACE Rev 2 class
top concept of: Statistical Classification of Economic Activities in the European Community, Rev. 2.1 (NACE Rev. 2.1)
Mapping Cardinality: 1 1

Building of military ships and vessels
type: Concept
Additional Content Note: This class also includes: - factory conversion of military ships, vessels and floating structures
CoreContentNote: This class includes the building of military ships and vessels, such as combat ships equipped with various offensive and defensive weapons and with protective devices against shelling, and the building of military floating structures, for example: - aircraft carriers - amphibious warfare and assault ships - cruisers - destroyers - submarines - landing crafts - tugs for transporting ammunition or mines
Exclusion Note: This class excludes: - manufacture of weapons and ammunition (e.g. torpedo tubes, torpedoes), see 25.30 - factory overhaul of military ship and vessel engines, see 28.11 - building of civilian ships and floating structures, see 30.11 - manufacture of inflatable boats or rafts for pleasure and sport, see 30.12
broader: Building of ships and boats
in scheme: Statistical Classification of Economic Activities in the European Community, Rev. 2.1 (NACE Rev. 2.1)
Notation: 30.13
top concept of: Statistical Classification of Economic Activities in the European Community, Rev. 2.1 (NACE Rev. 2.1)

ConceptNoneRandom0.08784961524033807
type: ConceptAssociation
description: NACE Rev. 2.1 group 38.1 is mapped to NACE Rev. 2 group 38.1
Type: 1:1
Source Concept: Waste collection
Target Concept: http://data.europa.eu/ux2/nace2/381
in scheme: Statistical Classification of Economic Activities in the European Community, Rev. 2.1 (NACE Rev. 2.1)
top concept of: Statistical Classification of Economic Activities in the European Community, Rev. 2.1 (NACE Rev. 2.1)
Mapping Cardinality: 1 1

Repair and maintenance of computers and communication equipment
type: Concept
broader: Repair and maintenance of computers, personal and household goods, and motor vehicles and motorcycles
in scheme: Statistical Classification of Economic Activities in the European Community, Rev. 2.1 (NACE Rev. 2.1)
Notation: 95.1
top concept of: Statistical Classification of Economic Activities in the European Community, Rev. 2.1 (NACE Rev. 2.1)

Public relations and communication activities
type: Concept
broader: Activities of advertising, market research and public relations
in scheme: Statistical Classification of Economic Activities in the European Community, Rev. 2.1 (NACE Rev. 2.1)
Notation: 73.3
top concept of: Statistical Classification of Economic Activities in the European Community, Rev. 2.1 (NACE Rev. 2.1)

Security and commodity contracts brokerage
type: Concept
Additional Content Note: This class also includes: - brokerage of securities for investment projects (e.g. wind or solar parks)
CoreContentNote: This class includes: - dealing in financial markets on behalf of others (e.g. stockbroking) and related activities - securities brokerage - brokerage of investment funds shares - brokerage of standardised commodity contracts - currency trading on behalf of others - brokerage of crypto-assets with liabilities that qualify as securities - exchange of currency on a fee basis (e.g. bureaux de change) - equity-based crowdfunding - debt-based crowdfunding offering loans and securities
Exclusion Note: This class excludes: - dealing in financial markets on own account, see division 64 - exchange of currency on own account, see 64.99 - portfolio management on a fee or contract basis, see 66.30 - buying and selling of real estate projects (e.g. wind or solar parks), see division 68 - donation-based fundraising, see 82.99 - trading and brokerage of crypto-assets without liabilities, see 82.99
broader: Activities auxiliary to financial services, except insurance and pension funding
in scheme: Statistical Classification of Economic Activities in the European Community, Rev. 2.1 (NACE Rev. 2.1)
Notation: 66.12
top concept of: Statistical Classification of Economic Activities in the European Community, Rev. 2.1 (NACE Rev. 2.1)

ConceptNoneRandom0.5263878989469899
type: ConceptAssociation
description: NACE Rev. 2.1 class 30.11 is mapped to NACE Rev. 2 class 30.11
Type: 2:1
Source Concept: Building of civilian ships and floating structures
Target Concept: http://data.europa.eu/ux2/nace2/3011
in scheme: Statistical Classification of Economic Activities in the European Community, Rev. 2.1 (NACE Rev. 2.1)
scope note: the content of the NACE Rev 2.1 class is fully covered in the corresponding NACE Rev 2 class
top concept of: Statistical Classification of Economic Activities in the European Community, Rev. 2.1 (NACE Rev. 2.1)
Mapping Cardinality: n 1

ConceptNoneRandom0.10188760085003867
type: ConceptAssociation
description: NACE Rev. 2.1 group 91.2 is mapped to NACE Rev. 2 group 91.0
Type: 3:1
Source Concept: Museum, collection, historical site and monument activities
Target Concept: http://data.europa.eu/ux2/nace2/910
in scheme: Statistical Classification of Economic Activities in the European Community, Rev. 2.1 (NACE Rev. 2.1)
top concept of: Statistical Classification of Economic Activities in the European Community, Rev. 2.1 (NACE Rev. 2.1)
Mapping Cardinality: n 1

ConceptNoneRandom0.4791696012757183
type: ConceptAssociation
description: NACE Rev. 2.1 class 90.20 is mapped to NACE Rev. 2 class 90.01
Type: 1:1
Source Concept: Activities of performing arts
Target Concept: http://data.europa.eu/ux2/nace2/9001
in scheme: Statistical Classification of Economic Activities in the European Community, Rev. 2.1 (NACE Rev. 2.1)
scope note: the content of the NACE Rev 2.1 class is fully covered in the corresponding NACE Rev 2 class
top concept of: Statistical Classification of Economic Activities in the European Community, Rev. 2.1 (NACE Rev. 2.1)
Mapping Cardinality: 1 1

ConceptNoneRandom0.7542610866438526
type: ConceptAssociation
description: NACE Rev. 2.1 division 05 is mapped to NACE Rev. 2 division 05
Type: 1:1
Source Concept: Mining of coal and lignite
Target Concept: http://data.europa.eu/ux2/nace2/05
in scheme: Statistical Classification of Economic Activities in the European Community, Rev. 2.1 (NACE Rev. 2.1)
top concept of: Statistical Classification of Economic Activities in the European Community, Rev. 2.1 (NACE Rev. 2.1)
Mapping Cardinality: 1 1

Activities of employment placement agencies
type: Concept
Additional Content Note: This class also includes: - activities of talent scouts
CoreContentNote: This class includes listing employment vacancies and referring or placing applicants for employment where the individuals referred or placed are not employees of the employment agencies. This class includes: - personnel search, selection referral and placement activities, including executive search and placement activities - activities of casting agencies and bureaux (e.g. theatrical casting and model agencies) - activities of online employment placement agencies
Exclusion Note: This class excludes: - activities of invoicing services, see 69.20 - activities of agents for individual artists, see 74.99 - activities of agencies providing babysitters and au pairs for households, see 78.20
broader: Activities of employment placement agencies
in scheme: Statistical Classification of Economic Activities in the European Community, Rev. 2.1 (NACE Rev. 2.1)
Notation: 78.10
top concept of: Statistical Classification of Economic Activities in the European Community, Rev. 2.1 (NACE Rev. 2.1)

ConceptNoneRandom0.826455940253469
type: ConceptAssociation
description: NACE Rev. 2.1 class 10.52 is mapped to NACE Rev. 2 class 10.52
Type: 1:1
Source Concept: Manufacture of ice cream and other edible ice
Target Concept: http://data.europa.eu/ux2/nace2/1052
in scheme: Statistical Classification of Economic Activities in the European Community, Rev. 2.1 (NACE Rev. 2.1)
scope note: the content of the NACE Rev 2.1 class is fully covered in the corresponding NACE Rev 2 class
top concept of: Statistical Classification of Economic Activities in the European Community, Rev. 2.1 (NACE Rev. 2.1)
Mapping Cardinality: 1 1

ConceptNoneRandom0.6074310585145533
type: ConceptAssociation
description: NACE Rev. 2.1 class 43.42 is mapped to NACE Rev. 2 class 43.99
Type: 23:16
Source Concept: Other specialised construction activities in construction of buildings
Target Concept: http://data.europa.eu/ux2/nace2/4399
in scheme: Statistical Classification of Economic Activities in the European Community, Rev. 2.1 (NACE Rev. 2.1)
scope note: the content of the NACE Rev 2.1 class is fully covered in the corresponding NACE Rev 2 class
top concept of: Statistical Classification of Economic Activities in the European Community, Rev. 2.1 (NACE Rev. 2.1)
Mapping Cardinality: n m

Manufacture of other general-purpose machinery n.e.c.
type: Concept
CoreContentNote: This class includes: - manufacture of weighing machinery (other than sensitive laboratory balances), including weight-operated counting or checking machines (e.g. household and shop scales, platform scales, scales for continuous weighing, weighbridges, weighing machines) - manufacture of filtering or purifying machinery and apparatus for liquids (e.g. for oil, fuel) - manufacture of equipment for projecting, dispersing or spraying liquids or powders: • spray guns, fire extinguishers, sandblasting machines, steam cleaning machines, etc. - manufacture of packing and wrapping machinery: • filling, closing, sealing, capsuling or labelling machines, etc. - manufacture of cleaning machines (including dishwashers) for non-domestic use - manufacture of machinery for cleaning or drying bottles and for aerating beverages - manufacture of distilling or rectifying plant for petroleum refineries, chemical industries, beverage industries, etc. - manufacture of gas generators - manufacture of calendering or other rolling machines and cylinders thereof (except for metal and glass) - manufacture of centrifuges, including centrifugal dryers (except cream separators, clothes/tumble dryers and centrifuges, of a kind used in laboratories) - manufacture of gaskets and similar joints of metal sheeting combined with other materials or of two or more layers of metal - manufacture of automatic goods vending machines - manufacture of levels, tape measures and similar hand tools, machinist’s precision tools (except optical) - manufacture of non-electrical welding and soldering machinery and apparatus - manufacture of cooling towers and similar for direct cooling by means of recirculated water
Exclusion Note: This class excludes: - manufacture of gaskets of vulcanised rubber, see 22.12 - manufacture of sensitive (laboratory-type) balances, see 26.51 - manufacture of domestic refrigerating or freezing equipment, see 27.51 - manufacture of domestic fans, see 27.51 - manufacture of electrical welding and soldering equipment, see 27.90 - manufacture of agricultural or horticultural spraying appliances, see 28.30 - manufacture of metal or glass rolling machinery and cylinders thereof, see 28.91, 28.99 - manufacture of dryers for agricultural products, see 28.93 - manufacture of machinery for filtering or purifying food and beverages, see 28.93 - manufacture of cream separators, see 28.93 - manufacture of commercial clothes/tumble dryers, see 28.94 - manufacture of printing machinery for printing textile materials, see 28.94 - manufacture of centrifuges, of a kind used in laboratories, see 32.50
broader: Manufacture of other general-purpose machinery
in scheme: Statistical Classification of Economic Activities in the European Community, Rev. 2.1 (NACE Rev. 2.1)
Notation: 28.29
top concept of: Statistical Classification of Economic Activities in the European Community, Rev. 2.1 (NACE Rev. 2.1)

ConceptNoneRandom0.880061699825789
type: ConceptAssociation
description: NACE Rev. 2.1 group 03.1 is mapped to NACE Rev. 2 group 03.1
Type: 26:18
Source Concept: Fishing
Target Concept: http://data.europa.eu/ux2/nace2/031
in scheme: Statistical Classification of Economic Activities in the European Community, Rev. 2.1 (NACE Rev. 2.1)
top concept of: Statistical Classification of Economic Activities in the European Community, Rev. 2.1 (NACE Rev. 2.1)
Mapping Cardinality: n m

Manufacture of sports goods
type: Concept
CoreContentNote: This class includes the manufacture of sporting and athletic goods (except apparel and footwear). This class includes: - manufacture of articles and equipment for sports, outdoor and indoor games, of any material, e.g.: • hard, soft and inflatable balls • rackets, bats and clubs • skis, bindings and poles • ski boots, snowboard boots and cross-country ski footwear • sailboards, surfboards and waterskis • requisites for sport fishing, including landing-nets • decoy ‘birds’ and similar requisites for hunting or shooting • articles and equipment for mountain climbing • gloves for use in sport, of leather or composition leather • basins for swimming and padding pools • ice skates, roller skates • bows and crossbows • gymnasium, fitness centre or athletic equipment • metal weights as used for weightlifting
Exclusion Note: This class excludes: - manufacture of boat sails, see 13.96 - manufacture of sports apparel, see 14.29 - manufacture of saddlery and harness, see 15.12 - manufacture of whips and riding crops, see 15.12 - manufacture of sports footwear, see 15.20 - manufacture of rubber wetsuits and diving suits, see 22.12 - manufacture of plastic headgear excluding safety headgear, see 22.26 - manufacture of sporting, hunting or target-shooting weapons and ammunition, see 25.30 - manufacture of sports vehicles other than bobsleighs, toboggans, etc, see divisions 29, 30 - manufacture of boats for sports and recreation, see 30.12 - manufacture of billiard tables, see 32.40 - manufacture of earplugs and noise plugs (e.g. for swimming and noise protection), see 32.99 - manufacture of safety headgear, see 32.99 - repair of sports goods, see 95.29
broader: Manufacture of sports goods
in scheme: Statistical Classification of Economic Activities in the European Community, Rev. 2.1 (NACE Rev. 2.1)
Notation: 32.30
top concept of: Statistical Classification of Economic Activities in the European Community, Rev. 2.1 (NACE Rev. 2.1)

ConceptNoneRandom0.33406697940850805
type: ConceptAssociation
description: NACE Rev. 2.1 group 38.2 is mapped to NACE Rev. 2 groups 38.2, 38.3
Type: 4:4
Source Concept: Waste recovery
Target Concept: http://data.europa.eu/ux2/nace2/382
Target Concept: http://data.europa.eu/ux2/nace2/383
in scheme: Statistical Classification of Economic Activities in the European Community, Rev. 2.1 (NACE Rev. 2.1)
top concept of: Statistical Classification of Economic Activities in the European Community, Rev. 2.1 (NACE Rev. 2.1)
Mapping Cardinality: n m

Building of pleasure and sporting boats
type: Concept
Additional Content Note: This class also includes: - factory conversion of pleasure and sporting boats
CoreContentNote: This class includes: - manufacture of inflatable boats and rafts for sports and recreation - building of sailing boats with or without auxiliary motor - building of motorboats - building of recreation-type hovercraft - building of yachts - manufacture of personal watercraft - manufacture of other pleasure and sporting boats, e.g.: • canoes, kayaks, rowing boats, skiffs
Exclusion Note: This class excludes: - manufacture of parts of pleasure and sporting boats: • manufacture of sails, see 13.96 • manufacture of iron or steel anchors, see 25.99 • manufacture of marine engines, see 28.11 - factory overhaul of engines for sport/recreational ships and boats, see 28.11 - manufacture of sailboards and surfboards, see 32.30 - repair of pleasure boats, see 33.15 - rental of pleasure boats and sailing boats with crew, see 50.10, 50.30 - rental of pleasure boats and yachts without crew, see 77.21
broader: Building of ships and boats
in scheme: Statistical Classification of Economic Activities in the European Community, Rev. 2.1 (NACE Rev. 2.1)
Notation: 30.12
top concept of: Statistical Classification of Economic Activities in the European Community, Rev. 2.1 (NACE Rev. 2.1)

Freight air transport and space transport
type: Concept
broader: Air transport
in scheme: Statistical Classification of Economic Activities in the European Community, Rev. 2.1 (NACE Rev. 2.1)
Notation: 51.2
top concept of: Statistical Classification of Economic Activities in the European Community, Rev. 2.1 (NACE Rev. 2.1)

ConceptNoneRandom0.6793787533760703
type: ConceptAssociation
description: NACE Rev. 2.1 group 25.4 is mapped to NACE Rev. 2 group 25.5
Type: 1:1
Source Concept: Forging and shaping metal and powder metallurgy
Target Concept: http://data.europa.eu/ux2/nace2/255
in scheme: Statistical Classification of Economic Activities in the European Community, Rev. 2.1 (NACE Rev. 2.1)
top concept of: Statistical Classification of Economic Activities in the European Community, Rev. 2.1 (NACE Rev. 2.1)
Mapping Cardinality: 1 1

ConceptNoneRandom0.8746633181085566
type: ConceptAssociation
description: NACE Rev. 2.1 group 47.2 is mapped to NACE Rev. 2 groups 47.2, 47.8, 47.9
Type: 42:34
Source Concept: Retail sale of food, beverages and tobacco
Target Concept: http://data.europa.eu/ux2/nace2/479
Target Concept: http://data.europa.eu/ux2/nace2/478
Target Concept: http://data.europa.eu/ux2/nace2/472
in scheme: Statistical Classification of Economic Activities in the European Community, Rev. 2.1 (NACE Rev. 2.1)
top concept of: Statistical Classification of Economic Activities in the European Community, Rev. 2.1 (NACE Rev. 2.1)
Mapping Cardinality: n m

Library activities
type: Concept
CoreContentNote: This class includes: - documentation and information activities of libraries of all kinds (including digital libraries), reading, listening and viewing rooms: • organisation of a collection, whether specialised or not • cataloguing collections • lending and storage of books, maps, periodicals, films, records, tapes, works of art, etc. • retrieval activities in order to comply with information requests, etc.
Exclusion Note: This class excludes: - conservation and restoration of cultural heritage, see 91.30
broader: Library and archive activities
in scheme: Statistical Classification of Economic Activities in the European Community, Rev. 2.1 (NACE Rev. 2.1)
Notation: 91.11
top concept of: Statistical Classification of Economic Activities in the European Community, Rev. 2.1 (NACE Rev. 2.1)

ConceptNoneRandom0.6224566566159445
type: ConceptAssociation
description: NACE Rev. 2.1 class 74.14 is mapped to NACE Rev. 2 class 74.10
Type: 4:1
Source Concept: Other specialised design activities
Target Concept: http://data.europa.eu/ux2/nace2/7410
in scheme: Statistical Classification of Economic Activities in the European Community, Rev. 2.1 (NACE Rev. 2.1)
scope note: the content of the NACE Rev 2.1 class is fully covered in the corresponding NACE Rev 2 class
top concept of: Statistical Classification of Economic Activities in the European Community, Rev. 2.1 (NACE Rev. 2.1)
Mapping Cardinality: n 1

ConceptNoneRandom0.9195974380673945
type: ConceptAssociation
description: NACE Rev. 2.1 class 66.11 is mapped to NACE Rev. 2 class 66.11
Type: 1:1
Source Concept: Administration of financial markets
Target Concept: http://data.europa.eu/ux2/nace2/6611
in scheme: Statistical Classification of Economic Activities in the European Community, Rev. 2.1 (NACE Rev. 2.1)
scope note: the content of the NACE Rev 2.1 class is fully covered in the corresponding NACE Rev 2 class
top concept of: Statistical Classification of Economic Activities in the European Community, Rev. 2.1 (NACE Rev. 2.1)
Mapping Cardinality: 1 1

ConceptNoneRandom0.40053902103038896
type: ConceptAssociation
description: NACE Rev. 2.1 class 21.20 is mapped to NACE Rev. 2 class 21.20
Type: 1:1
Source Concept: Manufacture of pharmaceutical preparations
Target Concept: http://data.europa.eu/ux2/nace2/2120
in scheme: Statistical Classification of Economic Activities in the European Community, Rev. 2.1 (NACE Rev. 2.1)
scope note: the content of the NACE Rev 2.1 class is fully covered in the corresponding NACE Rev 2 class
top concept of: Statistical Classification of Economic Activities in the European Community, Rev. 2.1 (NACE Rev. 2.1)
Mapping Cardinality: 1 1

ConceptNoneRandom0.8726039995086756
type: ConceptAssociation
description: NACE Rev. 2.1 class 47.83 is mapped to NACE Rev. 2 class 45.40
Type: 78:65
Source Concept: Retail sale of motorcycles, motorcycle parts and accessories
Target Concept: http://data.europa.eu/ux2/nace2/4540
in scheme: Statistical Classification of Economic Activities in the European Community, Rev. 2.1 (NACE Rev. 2.1)
scope note: the content of the NACE Rev 2.1 class is fully covered in the corresponding NACE Rev 2 class
top concept of: Statistical Classification of Economic Activities in the European Community, Rev. 2.1 (NACE Rev. 2.1)
Mapping Cardinality: n m

ConceptNoneRandom0.8807025074908238
type: ConceptAssociation
description: NACE Rev. 2.1 class 46.50 is mapped to NACE Rev. 2 classes 46.51, 46.52, 46.66
Type: 1:3
Source Concept: Wholesale of information and communication equipment
Target Concept: http://data.europa.eu/ux2/nace2/4666
Target Concept: http://data.europa.eu/ux2/nace2/4652
Target Concept: http://data.europa.eu/ux2/nace2/4651
in scheme: Statistical Classification of Economic Activities in the European Community, Rev. 2.1 (NACE Rev. 2.1)
scope note: 46.51: - wholesale of computers, computer peripheral equipment and parts - wholesale of non-customised software, including video games, provided on a physical media, with a right to perpetual use - wholesale of recordable media 46.52: - wholesale of smart boards - wholesale of electronic valves and tubes - wholesale of semi-conductor devices - wholesale of microchips and integrated circuits - wholesale of printed circuits - wholesale of telephone and communication equipment, e.g. mobile phones, modems - wholesale of office machinery and equipment 46.66: - wholesale of office machinery and equipment
top concept of: Statistical Classification of Economic Activities in the European Community, Rev. 2.1 (NACE Rev. 2.1)
Mapping Cardinality: 1 m

Building of civilian ships and floating structures
type: Concept
Additional Content Note: This class also includes: - building of hovercraft (except recreation-type hovercraft) - construction of drilling platforms, floating or submersible - construction of floating structures, e.g.: • floating docks, pontoons, cofferdams, floating landing stages, buoys, floating tanks, barges, lighters, floating cranes, non-recreational inflatable rafts, etc. - manufacture of sections for ships and floating structures - manufacture of submersible drones - factory conversion of ships - installation of technical interiors of boats
CoreContentNote: This class includes the building of civilian ships, except vessels for sports or recreation, and the construction of floating structures. This class includes: - building of commercial vessels: • passenger vessels, ferry boats, cargo ships, tankers, tugs - building of fishing vessels, factory ships and other vessels for processing or preserving fishery products
Exclusion Note: This class excludes: - manufacture of parts of vessels, other than major hull assemblies: • manufacture of sails, see 13.96 • manufacture of ships’ propellers, see 25.99 • manufacture of iron or steel anchors, see 25.99 • manufacture of marine engines, see 28.11 - manufacture of navigational instruments, see 26.51 - manufacture of lighting equipment for ships, see 27.40 - factory overhaul of civilian ship and boat engines, see 28.11 - manufacture of amphibious motor vehicles, see 29.10, 30.40 - manufacture of inflatable boats or rafts for pleasure and sport, see 30.12 - building of yachts, see 30.12 - building of military ships and vessels, see 30.13 - specialised repair and maintenance of civilian ships and floating structures, see 33.15 - ship-breaking, see 38.21 - interior non-technical installation and finishing of boats, see 43.3
broader: Building of ships and boats
in scheme: Statistical Classification of Economic Activities in the European Community, Rev. 2.1 (NACE Rev. 2.1)
Notation: 30.11
top concept of: Statistical Classification of Economic Activities in the European Community, Rev. 2.1 (NACE Rev. 2.1)

ConceptNoneRandom0.663217518697227
type: ConceptAssociation
description: NACE Rev. 2.1 group 25.5 is mapped to NACE Rev. 2 group 25.6
Type: 1:1
Source Concept: Treatment and coating of metals; machining
Target Concept: http://data.europa.eu/ux2/nace2/256
in scheme: Statistical Classification of Economic Activities in the European Community, Rev. 2.1 (NACE Rev. 2.1)
top concept of: Statistical Classification of Economic Activities in the European Community, Rev. 2.1 (NACE Rev. 2.1)
Mapping Cardinality: 1 1

ConceptNoneRandom0.2710710421643384
type: ConceptAssociation
description: NACE Rev. 2.1 class 98.10 is mapped to NACE Rev. 2 class 98.10
Type: 1:1
Source Concept: Undifferentiated goods-producing activities of private households for own use
Target Concept: http://data.europa.eu/ux2/nace2/9810
in scheme: Statistical Classification of Economic Activities in the European Community, Rev. 2.1 (NACE Rev. 2.1)
scope note: the content of the NACE Rev 2.1 class is fully covered in the corresponding NACE Rev 2 class
top concept of: Statistical Classification of Economic Activities in the European Community, Rev. 2.1 (NACE Rev. 2.1)
Mapping Cardinality: 1 1

ConceptNoneRandom0.8162808766297729
type: ConceptAssociation
description: NACE Rev. 2.1 class 75.00 is mapped to NACE Rev. 2 class 75.00
Type: 1:1
Source Concept: Veterinary activities
Target Concept: http://data.europa.eu/ux2/nace2/7500
in scheme: Statistical Classification of Economic Activities in the European Community, Rev. 2.1 (NACE Rev. 2.1)
scope note: the content of the NACE Rev 2.1 class is fully covered in the corresponding NACE Rev 2 class
top concept of: Statistical Classification of Economic Activities in the European Community, Rev. 2.1 (NACE Rev. 2.1)
Mapping Cardinality: 1 1

ConceptNoneRandom0.5257809770217905
type: ConceptAssociation
description: NACE Rev. 2.1 group 47.3 is mapped to NACE Rev. 2 group 47.3
Type: 42:34
Source Concept: Retail sale of automotive fuel
Target Concept: http://data.europa.eu/ux2/nace2/473
in scheme: Statistical Classification of Economic Activities in the European Community, Rev. 2.1 (NACE Rev. 2.1)
top concept of: Statistical Classification of Economic Activities in the European Community, Rev. 2.1 (NACE Rev. 2.1)
Mapping Cardinality: n m

Manufacture of paints, varnishes and similar coatings, printing ink and mastics
type: Concept
CoreContentNote: This class includes: - manufacture of paints and varnishes, enamels or lacquers - manufacture of prepared pigments and dyes, opacifiers and colours - manufacture of vitrifiable enamels and glazes, engobes and similar preparations - manufacture of mastics - manufacture of caulking compounds and similar non-refractory filling or surfacing preparations - manufacture of organic composite solvents and thinners - manufacture of prepared paint or varnish removers - manufacture of printing ink
Exclusion Note: This class excludes: - manufacture of dyes, tuffs and pigments, see 20.12 - manufacture of writing and drawing ink, see 20.59
broader: Manufacture of paints, varnishes and similar coatings, printing ink and mastics
in scheme: Statistical Classification of Economic Activities in the European Community, Rev. 2.1 (NACE Rev. 2.1)
Notation: 20.30
top concept of: Statistical Classification of Economic Activities in the European Community, Rev. 2.1 (NACE Rev. 2.1)

Archive activities
type: Concept
Additional Content Note: This class also includes: - archiving of all kinds of documents (in paper or electronic form)
CoreContentNote: Archive activities include the activities carried out by archival services of all types, with a view to building, storing, classifying, physical or digital archive collections and communicating them to the general public or to a particular category of users. This class includes: - activities of public archives providing a service to the general public or to a special clientele (e.g. students, scientists, staff members) as well as the operation of government archives - activities related to the acquisition or collection of archives - activities related to the identification, stocktaking, description and classification of archives - activities related to the safety and maintenance of archive items (monitoring of the sanitary status and of climatic conditions, safety and security, rehabilitation) - activities related to the communication of archives to the public on site or remotely - digitisation of archival documents for digital archive collections
Exclusion Note: This class excludes: - retail sale of manuscripts, see 47.69 - storage of data files, see 63.10 - digitisation of files (linked to further processing of data), see 63.10 - digitisation of files (without any other related activity), see 82.10 - conservation and restoration of cultural heritage, see 91.30
broader: Library and archive activities
in scheme: Statistical Classification of Economic Activities in the European Community, Rev. 2.1 (NACE Rev. 2.1)
Notation: 91.12
top concept of: Statistical Classification of Economic Activities in the European Community, Rev. 2.1 (NACE Rev. 2.1)

Levels

ConceptNoneRandom0.6547282488297826
type: ConceptAssociation
description: NACE Rev. 2.1 class 56.30 is mapped to NACE Rev. 2 class 56.30
Type: 1:1
Source Concept: Beverage serving activities
Target Concept: http://data.europa.eu/ux2/nace2/5630
in scheme: Statistical Classification of Economic Activities in the European Community, Rev. 2.1 (NACE Rev. 2.1)
scope note: the content of the NACE Rev 2.1 class is fully covered in the corresponding NACE Rev 2 class
top concept of: Statistical Classification of Economic Activities in the European Community, Rev. 2.1 (NACE Rev. 2.1)
Mapping Cardinality: 1 1

ConceptNoneRandom0.44413500315362164
type: ConceptAssociation
description: NACE Rev. 2.1 class 33.20 is mapped to NACE Rev. 2 class 33.20
Type: 1:1
Source Concept: Installation of industrial machinery and equipment
Target Concept: http://data.europa.eu/ux2/nace2/3320
in scheme: Statistical Classification of Economic Activities in the European Community, Rev. 2.1 (NACE Rev. 2.1)
scope note: the content of the NACE Rev 2.1 class is fully covered in the corresponding NACE Rev 2 class
top concept of: Statistical Classification of Economic Activities in the European Community, Rev. 2.1 (NACE Rev. 2.1)
Mapping Cardinality: 1 1

Other real estate activities on a fee or contract basis
type: Concept
CoreContentNote: This class includes: - activities of rent-collecting agencies - management of real estate (e.g. property management of real estate or dwellings in joint ownership (mostly carried out on a fee or contract basis)) - activities of real estate valuation - activities of real estate escrow agents - advisory activities on a fee or contract basis, in connection to buying, selling and rental of real estate
Exclusion Note: This class excludes: - legal activities, see 69.10 - asset management activities as part of financial management consulting, see 70.20 - combined facilities support services; the provision of a combination of support services (e.g. general interior cleaning, maintenance and making minor repairs, waste disposal, guard and security services), see 81.10
broader: Real estate activities on a fee or contract basis
in scheme: Statistical Classification of Economic Activities in the European Community, Rev. 2.1 (NACE Rev. 2.1)
Notation: 68.32
top concept of: Statistical Classification of Economic Activities in the European Community, Rev. 2.1 (NACE Rev. 2.1)

ConceptNoneRandom0.2551694397674523
type: ConceptAssociation
description: NACE Rev. 2.1 division 46 is mapped to NACE Rev. 2 divisions 45, 46, 82
Type: 48:49
Source Concept: Wholesale trade
Target Concept: http://data.europa.eu/ux2/nace2/82
Target Concept: http://data.europa.eu/ux2/nace2/45
Target Concept: http://data.europa.eu/ux2/nace2/46
in scheme: Statistical Classification of Economic Activities in the European Community, Rev. 2.1 (NACE Rev. 2.1)
top concept of: Statistical Classification of Economic Activities in the European Community, Rev. 2.1 (NACE Rev. 2.1)
Mapping Cardinality: n m

Advertising
type: Concept
broader: Activities of advertising, market research and public relations
in scheme: Statistical Classification of Economic Activities in the European Community, Rev. 2.1 (NACE Rev. 2.1)
Notation: 73.1
top concept of: Statistical Classification of Economic Activities in the European Community, Rev. 2.1 (NACE Rev. 2.1)

Retail sale of information and communication equipment
type: Concept
Additional Content Note: This class also includes: - refilling of ink and toner cartridges by retail sellers
CoreContentNote: This class includes the retail sale of information and communication technology (ICT) equipment. This class includes: - retail sale of computers - retail sale of computer peripheral equipment (e.g. printers, photocopiers, interactive whiteboards, videoconferencing equipment) - retail sale of video game consoles - retail sale of non-customised software, including video games, provided on physical media, with a right to perpetual use - retail sale of audio and video equipment - retail sale of radio and television equipment - retail sale of recordable media - retail sale of recording media players and recorders - retail sale of smart telephones, mobile telephones, telephones and their accessories (e.g. chargers, hands-free kits, protective film and cases)
Exclusion Note: This class excludes: - retail sale of photographic, optical and precision equipment (e.g. digital cameras), see 47.78 - second-hand retail sale of information and communication equipment, see 47.79 - distribution of e-books and audiobooks via streaming and downloading by book publishers, see 58.11 - distribution via streaming and downloading by video game publishers, see 58.21 - distribution via streaming and downloading by video/film publishers, see 59.13 - distribution via streaming and downloading by audio publishers, see 59.20
broader: Retail sale of information and communication equipment
in scheme: Statistical Classification of Economic Activities in the European Community, Rev. 2.1 (NACE Rev. 2.1)
Notation: 47.40
top concept of: Statistical Classification of Economic Activities in the European Community, Rev. 2.1 (NACE Rev. 2.1)

ConceptNoneRandom0.23181605784318382
type: ConceptAssociation
description: NACE Rev. 2.1 division 47 is mapped to NACE Rev. 2 divisions 45, 47, 82
Type: 48:49
Source Concept: Retail trade
Target Concept: http://data.europa.eu/ux2/nace2/82
Target Concept: http://data.europa.eu/ux2/nace2/45
Target Concept: http://data.europa.eu/ux2/nace2/47
in scheme: Statistical Classification of Economic Activities in the European Community, Rev. 2.1 (NACE Rev. 2.1)
top concept of: Statistical Classification of Economic Activities in the European Community, Rev. 2.1 (NACE Rev. 2.1)
Mapping Cardinality: n m

Referenced By

Manufacture of dairy products
type: Concept
Additional Content Note: This class also includes: - manufacture of milk kefir - manufacture of lactose and lactose syrup
CoreContentNote: This class includes: - manufacture of fresh liquid milk, pasteurised, sterilised, homogenised and/or ultra-heat treated - manufacture of milk-based drinks - manufacture of cream from fresh liquid milk, pasteurised, sterilised, homogenised - manufacture of dried or concentrated milk, whether or not sweetened - manufacture of milk or cream in solid form - manufacture of butter - manufacture of yoghurt - manufacture of cheese and curd - refining and ageing cheese - manufacture of whey - manufacture of casein - manufacture of lactose-free dairy products
Exclusion Note: This class excludes: - production of raw milk of cattle, see 01.41 - production of raw milk of sheep, goats, horses, asses, camels, etc., see 01.43, 01.44, 01.45 - production of milk-based dietary drinks, see 10.86 - production of dairy-based infant formulae, see 10.86 - manufacture of cheese substitutes, see 10.89 - manufacture of fruit kefir and water kefir, see 11.03 - manufacture of non-dairy milk (e.g. plant-based milk), see 11.07
broader: Manufacture of dairy products and edible ice
in scheme: Statistical Classification of Economic Activities in the European Community, Rev. 2.1 (NACE Rev. 2.1)
Notation: 10.51
top concept of: Statistical Classification of Economic Activities in the European Community, Rev. 2.1 (NACE Rev. 2.1)

ConceptNoneRandom0.5921728165669516
type: ConceptAssociation
description: NACE Rev. 2.1 group 69.1 is mapped to NACE Rev. 2 group 69.1
Type: 1:1
Source Concept: Legal activities
Target Concept: http://data.europa.eu/ux2/nace2/691
in scheme: Statistical Classification of Economic Activities in the European Community, Rev. 2.1 (NACE Rev. 2.1)
top concept of: Statistical Classification of Economic Activities in the European Community, Rev. 2.1 (NACE Rev. 2.1)
Mapping Cardinality: 1 1

Hospital activities
type: Concept
broader: Human health activities
in scheme: Statistical Classification of Economic Activities in the European Community, Rev. 2.1 (NACE Rev. 2.1)
Notation: 86.1
top concept of: Statistical Classification of Economic Activities in the European Community, Rev. 2.1 (NACE Rev. 2.1)

ConceptNoneRandom0.7413848689823208
type: ConceptAssociation
description: NACE Rev. 2.1 group 25.2 is mapped to NACE Rev. 2 groups 25.2, 25.3
Type: 18:19
Source Concept: Manufacture of tanks, reservoirs and containers of metal
Target Concept: http://data.europa.eu/ux2/nace2/252
Target Concept: http://data.europa.eu/ux2/nace2/253
in scheme: Statistical Classification of Economic Activities in the European Community, Rev. 2.1 (NACE Rev. 2.1)
top concept of: Statistical Classification of Economic Activities in the European Community, Rev. 2.1 (NACE Rev. 2.1)
Mapping Cardinality: n m

ConceptNoneRandom0.9213873331851344
type: ConceptAssociation
description: NACE Rev. 2.1 class 01.62 is mapped to NACE Rev. 2 class 01.62
Type: 10:9
Source Concept: Support activities for animal production
Target Concept: http://data.europa.eu/ux2/nace2/0162
in scheme: Statistical Classification of Economic Activities in the European Community, Rev. 2.1 (NACE Rev. 2.1)
scope note: the content of the NACE Rev 2.1 class is fully covered in the corresponding NACE Rev 2 class
top concept of: Statistical Classification of Economic Activities in the European Community, Rev. 2.1 (NACE Rev. 2.1)
Mapping Cardinality: n m

Accounting, bookkeeping and auditing activities; tax consultancy
type: Concept
Additional Content Note: This class also includes: - activities of invoicing services
CoreContentNote: This class includes: - recording of commercial transactions from businesses or others - bookkeeping activities for financial accounting and payroll accounting, etc. - preparation or auditing of financial accounts - examination of accounts and certification of their accuracy - preparation of tax returns for individuals or enterprises - accounting advisory activities and representation on behalf of clients before public administration (e.g. tax authorities and tax courts) - duty and tax tariff calculation service activities
Exclusion Note: This class excludes: - publishing of accounting software, see 58.29 - computer programming of accounting software, see 62.10 - management consultancy on accounting systems, budgetary control procedures, see 70.20 - bill collection, see 82.91
broader: Accounting, bookkeeping and auditing activities; tax consultancy
in scheme: Statistical Classification of Economic Activities in the European Community, Rev. 2.1 (NACE Rev. 2.1)
Notation: 69.20
top concept of: Statistical Classification of Economic Activities in the European Community, Rev. 2.1 (NACE Rev. 2.1)

ConceptNoneRandom0.17103122505239687
type: ConceptAssociation
description: NACE Rev. 2.1 division 01 is mapped to NACE Rev. 2 divisions 01, 03
Type: 48:49
Source Concept: Crop and animal production, hunting and related service activities
Target Concept: http://data.europa.eu/ux2/nace2/01
Target Concept: http://data.europa.eu/ux2/nace2/03
in scheme: Statistical Classification of Economic Activities in the European Community, Rev. 2.1 (NACE Rev. 2.1)
top concept of: Statistical Classification of Economic Activities in the European Community, Rev. 2.1 (NACE Rev. 2.1)
Mapping Cardinality: n m

Activities of trusts, funds and similar financial entities
type: Concept
CoreContentNote: This group includes legal entities organised to pool securities or other financial assets, without managing or administrating them, on behalf of shareholders or beneficiaries. The portfolios are customised to achieve specific investment characteristics (for example, diversification, risk, rate of return, price volatility). These entities earn interest, dividends and other property income, but have little or no employment and no revenue from the sale of services.
Exclusion Note: This group excludes: - activities of entities that earn revenue from the sale of goods or services. These types of entities are therefore classified according to their principal activity in other parts of NACE (like in division 66 for fund management, division 68 for rental and operating of real estate, or in division 77 for rental and leasing of ships or airplanes) - carrying out securitisation transactions by issuing of financial instruments, see 64.92 - securitisation transactions of assets other than loans by issuing financial instruments, see 64.99 - trust, estate and agency accounts that earn revenue from the sale of goods or services, see relevant NACE classes according to their principal activity
broader: Financial service activities, except insurance and pension funding
in scheme: Statistical Classification of Economic Activities in the European Community, Rev. 2.1 (NACE Rev. 2.1)
Notation: 64.3
top concept of: Statistical Classification of Economic Activities in the European Community, Rev. 2.1 (NACE Rev. 2.1)

Manufacture of other products of wood and articles of cork, straw and plaiting materials
type: Concept
CoreContentNote: This class includes: - manufacture of various wood products: • wooden handles and bodies for tools, brooms, brushes • wooden boot- or shoe-lasts and trees, clothes-hangers • household utensils, tableware and kitchenware of wood • wooden statuettes and ornaments, wood marquetry, inlaid wood • wooden cases for jewellery, cutlery and similar articles • wooden spools, cops, bobbins, sewing thread reels and similar articles of turned wood • other articles of wood - manufacture of wooden frames for artists’ canvases - natural cork processing, manufacture of agglomerated cork - manufacture of cork for bottles - manufacture of articles of natural or agglomerated cork, including floor coverings - manufacture of plaits and products of plaiting materials: mats, matting, screens, cases, etc. - manufacture of basket-ware and wickerwork - manufacture of wooden mirror and picture frames - manufacture of handles for umbrellas, canes and similar - manufacture of blocks for the manufacture of smoking pipes
Exclusion Note: This class excludes: - manufacture of mats or matting of textile materials, see 13.93 - manufacture of luggage, see 15.12 - manufacture of wooden footwear or wooden parts of footwear, see 15.20 - manufacture of matches, see 20.59 - manufacture of clock cases, see 26.52 - manufacture of wooden spools and bobbins that are part of textile machinery, see 28.94 - manufacture of furniture, see 31.00 - manufacture of wooden toys, see 32.40 - manufacture of brooms and brushes, see 32.91 - manufacture of coffins, see 32.99 - manufacture of cork life preservers, see 32.99
broader: Manufacture of products of wood, cork, straw and plaiting materials
in scheme: Statistical Classification of Economic Activities in the European Community, Rev. 2.1 (NACE Rev. 2.1)
Notation: 16.28
top concept of: Statistical Classification of Economic Activities in the European Community, Rev. 2.1 (NACE Rev. 2.1)

ConceptNoneRandom0.6314256304659812
type: ConceptAssociation
description: NACE Rev. 2.1 class 47.81 is mapped to NACE Rev. 2 classes 45.11, 45.19
Type: 78:65
Source Concept: Retail sale of motor vehicles
Target Concept: http://data.europa.eu/ux2/nace2/4519
Target Concept: http://data.europa.eu/ux2/nace2/4511
in scheme: Statistical Classification of Economic Activities in the European Community, Rev. 2.1 (NACE Rev. 2.1)
scope note: 45.11: - retail sale of new and used motor vehicles, including electrical vehicles: • passenger motor vehicles - retail sale of off-road motor vehicles 45.19: - retail sale of new and used motor vehicles including electrical vehicles: • camping vehicles, e.g. caravans, motorhomes - retail sale of trailers for motor vehicles
top concept of: Statistical Classification of Economic Activities in the European Community, Rev. 2.1 (NACE Rev. 2.1)
Mapping Cardinality: n m

ConceptNoneRandom0.3016708657250009
type: ConceptAssociation
description: NACE Rev. 2.1 class 42.12 is mapped to NACE Rev. 2 class 42.12
Type: 1:1
Source Concept: Construction of railways and underground railways
Target Concept: http://data.europa.eu/ux2/nace2/4212
in scheme: Statistical Classification of Economic Activities in the European Community, Rev. 2.1 (NACE Rev. 2.1)
scope note: the content of the NACE Rev 2.1 class is fully covered in the corresponding NACE Rev 2 class
top concept of: Statistical Classification of Economic Activities in the European Community, Rev. 2.1 (NACE Rev. 2.1)
Mapping Cardinality: 1 1

Medical and dental practice activities
type: Concept
Additional Content Note: This group also includes: - private consultants’ services to inpatients
CoreContentNote: This group includes medical consultation and treatment, performed by general medical practitioners and medical specialists (for example, medical doctors, dentists), legally recognised to treat patients. These activities can be carried out in private practice, group practices, hospital outpatient clinics and in clinics attached to businesses, schools, homes for older persons, labour organisations and fraternal organisations, as well as in patients’ homes.
broader: Human health activities
in scheme: Statistical Classification of Economic Activities in the European Community, Rev. 2.1 (NACE Rev. 2.1)
Notation: 86.2
top concept of: Statistical Classification of Economic Activities in the European Community, Rev. 2.1 (NACE Rev. 2.1)

ConceptNoneRandom0.36106869284682575
type: ConceptAssociation
description: NACE Rev. 2.1 group 25.3 is mapped to NACE Rev. 2 group 25.4
Type: 1:1
Source Concept: Manufacture of weapons and ammunition
Target Concept: http://data.europa.eu/ux2/nace2/254
in scheme: Statistical Classification of Economic Activities in the European Community, Rev. 2.1 (NACE Rev. 2.1)
top concept of: Statistical Classification of Economic Activities in the European Community, Rev. 2.1 (NACE Rev. 2.1)
Mapping Cardinality: 1 1

Other accommodation
type: Concept
broader: Accommodation
in scheme: Statistical Classification of Economic Activities in the European Community, Rev. 2.1 (NACE Rev. 2.1)
Notation: 55.9
top concept of: Statistical Classification of Economic Activities in the European Community, Rev. 2.1 (NACE Rev. 2.1)

ConceptNoneRandom0.07884102117403291
type: ConceptAssociation
description: NACE Rev. 2.1 group 12.0 is mapped to NACE Rev. 2 group 12.0
Type: 1:1
Source Concept: Manufacture of tobacco products
Target Concept: http://data.europa.eu/ux2/nace2/120
in scheme: Statistical Classification of Economic Activities in the European Community, Rev. 2.1 (NACE Rev. 2.1)
top concept of: Statistical Classification of Economic Activities in the European Community, Rev. 2.1 (NACE Rev. 2.1)
Mapping Cardinality: 1 1

ConceptNoneRandom0.43932495857065423
type: ConceptAssociation
description: NACE Rev. 2.1 class 01.61 is mapped to NACE Rev. 2 class 01.61
Type: 1:1
Source Concept: Support activities for crop production
Target Concept: http://data.europa.eu/ux2/nace2/0161
in scheme: Statistical Classification of Economic Activities in the European Community, Rev. 2.1 (NACE Rev. 2.1)
scope note: the content of the NACE Rev 2.1 class is fully covered in the corresponding NACE Rev 2 class
top concept of: Statistical Classification of Economic Activities in the European Community, Rev. 2.1 (NACE Rev. 2.1)
Mapping Cardinality: 1 1

ConceptNoneRandom0.41020360690308966
type: ConceptAssociation
description: NACE Rev. 2.1 class 31.00 is mapped to NACE Rev. 2 classes 23.42, 31.01, 31.02, 31.03, 31.09
Type: 2:5
Source Concept: Manufacture of furniture
Target Concept: http://data.europa.eu/ux2/nace2/3109
Target Concept: http://data.europa.eu/ux2/nace2/2342
Target Concept: http://data.europa.eu/ux2/nace2/3102
Target Concept: http://data.europa.eu/ux2/nace2/3103
Target Concept: http://data.europa.eu/ux2/nace2/3101
in scheme: Statistical Classification of Economic Activities in the European Community, Rev. 2.1 (NACE Rev. 2.1)
scope note: 23.42: - manufacture of ceramic furniture 31.01: - manufacture of chairs and seats for offices, workrooms, hotels, restaurants and public premises - manufacture of chairs and seats for theatres, cinemas, etc. - manufacture of special furniture for shops: counters, display cases, shelves etc. - manufacture of office furniture - manufacture of laboratory benches, stools, and other laboratory seating, laboratory furniture (e.g. cabinets and tables) - manufacture of furniture for churches, schools, restaurants - manufacture of catering carts - manufacture of built-in components for shop furniture - finishing of furniture, e.g. spraying, painting, polishing, upholstering 31.02: - manufacture of kitchen furniture 31.03: - manufacture of mattresses and of mattress supports 31.09: - manufacture of sofas, sofa beds and sofa sets - manufacture of garden chairs and seats - manufacture of furniture for bedrooms, living rooms, gardens etc. - manufacture of cabinets for sewing machines, televisions etc. - manufacture of walk-in wardrobes
top concept of: Statistical Classification of Economic Activities in the European Community, Rev. 2.1 (NACE Rev. 2.1)
Mapping Cardinality: n m

Landscape service activities
type: Concept
Additional Content Note: This class also includes: - restoration of natural environments (e.g. plant engineering, renaturation of ecosystems) - erosion control activities in mountain environments, spawning grounds and riverbanks - creation and relocation of species habitats (e.g. nesting boxes, shelters, hibernacula) - prevention, control and response activities against the introduction and spread of invasive species in fauna or flora - environmental management (e.g. performing protection and maintenance measures for dunes, moors, wetlands or other sensitive areas; eco-grazing)
CoreContentNote: This class includes: - planting, care and maintenance of parks and gardens for: • private and public housing • public and semi-public buildings (schools, hospitals, administrative buildings, church buildings, etc.) • municipal grounds (parks, green areas, cemeteries, etc.) • highway greenery (roads, train lines and tramlines, waterways, ports) • industrial and commercial buildings - planting, care and maintenance of greenery for: • buildings (roof gardens, facade greenery, indoor gardens, etc.) • sports grounds (football fields, golf courses, etc.), playgrounds, lawns for sunbathing and other recreational parks • stationary and flowing water (basins, alternating wet areas, ponds, swimming pools, ditches, watercourses, plant sewage systems) - planting of vegetation for protection against noise, wind, erosion, visibility - protection and restoring landscape (e.g. for parks, gardens) - ecological engineering works for the purpose of ecological preservation of sites
Exclusion Note: This class excludes: - protection or restoration activities of agricultural and forestry land, see divisions 01 and 02 - commercial growing and planting for commercial growing of plants, trees, see divisions 01 and 02 - tree nurseries and forest tree nurseries, see 01.30, 02.10 - keeping the land in good environmental condition for agricultural use, see 01.61 - restoration of marine ecosystems, see 03.30 - construction activities for landscaping purposes, see section F - landscape design and architectural activities, see 71.11 - operation of national parks, nature reserves, etc., including conservation and maintenance, see 91.42
broader: Landscape service activities
in scheme: Statistical Classification of Economic Activities in the European Community, Rev. 2.1 (NACE Rev. 2.1)
Notation: 81.30
top concept of: Statistical Classification of Economic Activities in the European Community, Rev. 2.1 (NACE Rev. 2.1)

Manufacture of motor vehicles
type: Concept
Additional Content Note: This class also includes: - factory rebuilding of motor vehicle engines - manufacture of chassis fitted with engines
CoreContentNote: This class includes the manufacture of electric, combustion and hybrid engine vehicles, and of autonomous vehicles. This class includes: - manufacture of passenger cars - manufacture of commercial vehicles: • vans, lorries, road tractors for semi-trailers, etc. - manufacture of buses, trolleybuses and coaches - manufacture of motor vehicle engines, including electric motors - manufacture of other motor vehicles, e.g.: • snowmobiles, golf carts, amphibious motor vehicles • road sweeper trollies - all-terrain vehicles (ATV), go-carts and similar, including racing cars
Exclusion Note: This class excludes: - manufacture of lamps for motor vehicles, see 27.40 - manufacture of pistons, piston rings and carburettors not for motor vehicles or motorcycles, see 28.11 - manufacture of works trucks fitted with a crane, see 28.22 - manufacture of agricultural and forestry tractors, see 28.30 - manufacture of track-laying tractors, see 28.30 - manufacture of off-road dumper trucks, see 28.92 - manufacture of bodies for motor vehicles (e.g. fire engines, travelling libraries, concrete mixer lorries), see 29.20 - manufacture of bodies for armoured vehicles, see 29.20 - manufacture of electrical parts for motor vehicles, see 29.31 - manufacture of parts and accessories for motor vehicles, see 29.32 - manufacture of tanks and other military fighting vehicles, see 30.40 - repair and maintenance of motor vehicles, see 95.31
broader: Manufacture of motor vehicles
in scheme: Statistical Classification of Economic Activities in the European Community, Rev. 2.1 (NACE Rev. 2.1)
Notation: 29.10
top concept of: Statistical Classification of Economic Activities in the European Community, Rev. 2.1 (NACE Rev. 2.1)

Passenger air transport
type: Concept
broader: Air transport
in scheme: Statistical Classification of Economic Activities in the European Community, Rev. 2.1 (NACE Rev. 2.1)
Notation: 51.1
top concept of: Statistical Classification of Economic Activities in the European Community, Rev. 2.1 (NACE Rev. 2.1)

ConceptNoneRandom0.7267024027680353
type: ConceptAssociation
description: NACE Rev. 2.1 division 49 is mapped to NACE Rev. 2 division 49
Type: 48:49
Source Concept: Land transport and transport via pipelines
Target Concept: http://data.europa.eu/ux2/nace2/49
in scheme: Statistical Classification of Economic Activities in the European Community, Rev. 2.1 (NACE Rev. 2.1)
top concept of: Statistical Classification of Economic Activities in the European Community, Rev. 2.1 (NACE Rev. 2.1)
Mapping Cardinality: n m

Manufacture of non-domestic air conditioning equipment
type: Concept
Additional Content Note: This class also includes: - manufacture of reversible heat pumps that have a motorised fan and devices for changing both the air temperature and humidity
CoreContentNote: This class includes: - manufacture of non-domestic refrigerating or freezing equipment - manufacture of air-conditioning machines, except for motor vehicles - manufacture of non-domestic fans - manufacture of heat exchange units - manufacture of machinery for liquefying air or other gas - manufacture of attic ventilation fans (e.g. gable fans, roof ventilators) - manufacture of evaporators and condensers for non-domestic refrigerators
Exclusion Note: This class excludes: - manufacture of domestic refrigerating or freezing equipment, see 27.51 - manufacture of domestic fans, see 27.51 - manufacture of household cooling equipment, see 28.21 - manufacture of air-conditioning machines for motor vehicles, see 29.32
broader: Manufacture of other general-purpose machinery
in scheme: Statistical Classification of Economic Activities in the European Community, Rev. 2.1 (NACE Rev. 2.1)
Notation: 28.25
top concept of: Statistical Classification of Economic Activities in the European Community, Rev. 2.1 (NACE Rev. 2.1)

Finishing of wooden products
type: Concept
CoreContentNote: This class includes: - process of refining or protecting wooden surfaces (for example, coating, impregnating, finishing, polishing, buffing, oiling, waxing, bleaching, staining, painting or varnishing of wooden products)
Exclusion Note: This class excludes: - reupholstering, refinishing and repairing of furniture, see 95.24
broader: Manufacture of products of wood, cork, straw and plaiting materials
in scheme: Statistical Classification of Economic Activities in the European Community, Rev. 2.1 (NACE Rev. 2.1)
Notation: 16.27
top concept of: Statistical Classification of Economic Activities in the European Community, Rev. 2.1 (NACE Rev. 2.1)

ConceptNoneRandom0.9186817721663725
type: ConceptAssociation
description: NACE Rev. 2.1 class 47.82 is mapped to NACE Rev. 2 class 45.32
Type: 78:65
Source Concept: Retail sale of motor vehicle parts and accessories
Target Concept: http://data.europa.eu/ux2/nace2/4532
in scheme: Statistical Classification of Economic Activities in the European Community, Rev. 2.1 (NACE Rev. 2.1)
scope note: the content of the NACE Rev 2.1 class is fully covered in the corresponding NACE Rev 2 class
top concept of: Statistical Classification of Economic Activities in the European Community, Rev. 2.1 (NACE Rev. 2.1)
Mapping Cardinality: n m

Manufacture of paper and paperboard
type: Concept
Additional Content Note: This class also includes: - further processing of paper and paperboard: • colouring, coating, covering and impregnation of paper and paperboard • manufacture of crêpe or crinkled paper • manufacture of laminates and foils, if laminated with paper or paperboard - manufacture of handmade paper - manufacture of newsprint and other printing or writing paper - manufacture of cellulose wadding and webs of cellulose fibres - manufacture of carbon paper or stencil paper in rolls or large sheets
CoreContentNote: This class includes: - manufacture of paper and paperboard intended for further industrial processing
Exclusion Note: This class excludes: - manufacture of corrugated paper and paperboard, see 17.21 - manufacture of further-processed articles of paper, paperboard or pulp, see 17.22 to 17.25 - printing and service activities related to printing, see 18.1 - manufacture of abrasive paper, see 23.91 - publishing of books, newspapers and other publishing activities, except software publishing, see 58.1 - manufacture of coated or impregnated paper where the coating or impregnation is the main ingredient, see class in which the manufacture of the coating or impregnation is classified
broader: Manufacture of pulp, paper and paperboard
in scheme: Statistical Classification of Economic Activities in the European Community, Rev. 2.1 (NACE Rev. 2.1)
Notation: 17.12
top concept of: Statistical Classification of Economic Activities in the European Community, Rev. 2.1 (NACE Rev. 2.1)

ConceptNoneRandom0.8182176847451996
type: ConceptAssociation
description: NACE Rev. 2.1 group 47.1 is mapped to NACE Rev. 2 groups 47.1, 47.8, 47.9
Type: 42:34
Source Concept: Non-specialised retail sale
Target Concept: http://data.europa.eu/ux2/nace2/479
Target Concept: http://data.europa.eu/ux2/nace2/478
Target Concept: http://data.europa.eu/ux2/nace2/471
in scheme: Statistical Classification of Economic Activities in the European Community, Rev. 2.1 (NACE Rev. 2.1)
top concept of: Statistical Classification of Economic Activities in the European Community, Rev. 2.1 (NACE Rev. 2.1)
Mapping Cardinality: n m

ConceptNoneRandom0.6783225052714722
type: ConceptAssociation
description: NACE Rev. 2.1 class 09.10 is mapped to NACE Rev. 2 class 09.10
Type: 1:1
Source Concept: Support activities for petroleum and natural gas extraction
Target Concept: http://data.europa.eu/ux2/nace2/0910
in scheme: Statistical Classification of Economic Activities in the European Community, Rev. 2.1 (NACE Rev. 2.1)
scope note: the content of the NACE Rev 2.1 class is fully covered in the corresponding NACE Rev 2 class
top concept of: Statistical Classification of Economic Activities in the European Community, Rev. 2.1 (NACE Rev. 2.1)
Mapping Cardinality: 1 1

ConceptNoneRandom0.40234951234099947
type: ConceptAssociation
description: NACE Rev. 2.1 class 42.13 is mapped to NACE Rev. 2 class 42.13
Type: 1:1
Source Concept: Construction of bridges and tunnels
Target Concept: http://data.europa.eu/ux2/nace2/4213
in scheme: Statistical Classification of Economic Activities in the European Community, Rev. 2.1 (NACE Rev. 2.1)
scope note: the content of the NACE Rev 2.1 class is fully covered in the corresponding NACE Rev 2 class
top concept of: Statistical Classification of Economic Activities in the European Community, Rev. 2.1 (NACE Rev. 2.1)
Mapping Cardinality: 1 1

Non-specialised wholesale trade
type: Concept
CoreContentNote: This class includes: - wholesale of a variety of goods without any particular specialisation
Exclusion Note: This class excludes: - activities of wholesalers who do not assume ownership of the goods they trade, see 46.1
broader: Non-specialised wholesale trade
in scheme: Statistical Classification of Economic Activities in the European Community, Rev. 2.1 (NACE Rev. 2.1)
Notation: 46.90
top concept of: Statistical Classification of Economic Activities in the European Community, Rev. 2.1 (NACE Rev. 2.1)

ConceptNoneRandom0.5080853477871166
type: ConceptAssociation
description: NACE Rev. 2.1 class 23.43 is mapped to NACE Rev. 2 class 23.43
Type: 1:1
Source Concept: Manufacture of ceramic insulators and insulating fittings
Target Concept: http://data.europa.eu/ux2/nace2/2343
in scheme: Statistical Classification of Economic Activities in the European Community, Rev. 2.1 (NACE Rev. 2.1)
scope note: the content of the NACE Rev 2.1 class is fully covered in the corresponding NACE Rev 2 class
top concept of: Statistical Classification of Economic Activities in the European Community, Rev. 2.1 (NACE Rev. 2.1)
Mapping Cardinality: 1 1

Manufacture of other chemical products
type: Concept
CoreContentNote: This group includes the manufacture of liquid biofuels and chemical products n.e.c. (for example, explosives and pyrotechnic products, glues, essential oils, composite diagnostic preparations).
broader: Manufacture of chemicals and chemical products
in scheme: Statistical Classification of Economic Activities in the European Community, Rev. 2.1 (NACE Rev. 2.1)
Notation: 20.5
top concept of: Statistical Classification of Economic Activities in the European Community, Rev. 2.1 (NACE Rev. 2.1)

NACE - Level 4 - Classes
type: Collection
type: ClassificationLevel
comment: Level 4: 651 classes identified by four-digit numerical codes (01.11 to 99.00)
Depth: 4
Notation Pattern: [0-9]{2}\.[0-9]{2}
Organized By: generic class
in scheme: Statistical Classification of Economic Activities in the European Community, Rev. 2.1 (NACE Rev. 2.1)
Member: Manufacture of workwear
Member: Other software publishing
Member: Manufacture of footwear
Member: Landfilling or permanent storage
Member: Defence activities
Member: Masonry and bricklaying activities
Member: Motion picture projection activities
Member: General secondary education
Member: Growing of spices, aromatic, drug and pharmaceutical crops
Member: Wired, wireless, and satellite telecommunication activities
Member: Growing of fibre crops
Member: Marine aquaculture
Member: Passenger transport by cableways and ski lifts
Member: Amusement and recreation activities n.e.c.
Member: Activities of agents involved in non-specialised wholesale
Member: Repair and maintenance of footwear and leather goods
Member: Market research and public opinion polling
Member: Sea and coastal freight water transport
Member: Incineration without energy recovery
Member: Manufacture of knitted and crocheted apparel
Member: Manufacture of underwear
Member: Storage of electricity
Member: Manufacture of leather clothes and fur apparel
Member: Justice and judicial activities
Member: Vocational secondary education
Member: General public administration activities
Member: Primary education
Member: Growing of other perennial crops
Member: Manufacture of metal structures and parts of structures
Member: Manufacture of computers and peripheral equipment
Member: Mining of chemical and fertiliser minerals
Member: Freshwater aquaculture
Member: Manufacture of doors and windows of metal
Member: Passenger heavy rail transport
Member: Manufacture of other special-purpose machinery n.e.c.
Member: Other accommodation
Member: Repair and maintenance of furniture and home furnishings
Member: Hairdressing and barber activities
Member: Research and experimental development on natural sciences and engineering
Member: Water collection, treatment and supply
Member: Other publishing activities, except software publishing
Member: Trade of electricity
Member: Other financial service activities, except insurance and pension funding n.e.c.
Member: Manufacture of malt
Member: Other content distribution activities
Member: Driving school activities
Member: Manufacture of lighting equipment
Member: Manufacture of non-electric domestic appliances
Member: Growing of oleaginous fruits
Member: Manufacture of other tanks, reservoirs and containers of metal
Member: Growing of sugar cane
Member: Growing of vegetables and melons, roots and tubers
Member: Other passenger rail transport
Member: Silviculture and other forestry activities
Member: Activities of professional membership organisations
Member: Repair and maintenance of consumer electronics
Member: Funeral and related activities
Member: Sea and coastal passenger water transport
Member: Security activities n.e.c.
Member: Manufacture of soft drinks and bottled waters
Member: Distribution of electricity
Member: Other human health activities n.e.c.
Member: Foreign affairs
Member: Manufacture of communication equipment
Member: Computer consultancy and computer facilities management activities
Member: Manufacture of electric domestic appliances
Member: Growing of beverage crops
Member: Growing of tobacco
Member: Manufacture of central heating radiators, steam generators and boilers
Member: Manufacture of plastics and rubber machinery
Member: Manufacture of additive manufacturing machinery
Member: Manufacture of bicycles and invalid carriages

ConceptNoneRandom0.12134475309952664
type: ConceptAssociation
description: NACE Rev. 2.1 class 25.61 is mapped to NACE Rev. 2 class 25.71
Type: 1:1
Source Concept: Manufacture of cutlery
Target Concept: http://data.europa.eu/ux2/nace2/2571
in scheme: Statistical Classification of Economic Activities in the European Community, Rev. 2.1 (NACE Rev. 2.1)
scope note: the content of the NACE Rev 2.1 class is fully covered in the corresponding NACE Rev 2 class
top concept of: Statistical Classification of Economic Activities in the European Community, Rev. 2.1 (NACE Rev. 2.1)
Mapping Cardinality: 1 1

ConceptNoneRandom0.8744880963504305
type: ConceptAssociation
description: NACE Rev. 2.1 group 60.2 is mapped to NACE Rev. 2 groups 60.2, 63.1
Type: 42:34
Source Concept: Television programming, broadcasting and video distribution activities
Target Concept: http://data.europa.eu/ux2/nace2/602
Target Concept: http://data.europa.eu/ux2/nace2/631
in scheme: Statistical Classification of Economic Activities in the European Community, Rev. 2.1 (NACE Rev. 2.1)
top concept of: Statistical Classification of Economic Activities in the European Community, Rev. 2.1 (NACE Rev. 2.1)
Mapping Cardinality: n m

ConceptNoneRandom0.5824536908090611
type: ConceptAssociation
description: NACE Rev. 2.1 group 95.3 is mapped to NACE Rev. 2 groups 45.2, 45.4
Type: 42:34
Source Concept: Repair and maintenance of motor vehicles and motorcycles
Target Concept: http://data.europa.eu/ux2/nace2/454
Target Concept: http://data.europa.eu/ux2/nace2/452
in scheme: Statistical Classification of Economic Activities in the European Community, Rev. 2.1 (NACE Rev. 2.1)
top concept of: Statistical Classification of Economic Activities in the European Community, Rev. 2.1 (NACE Rev. 2.1)
Mapping Cardinality: n m

ConceptNoneRandom0.3859455666836984
type: ConceptAssociation
description: NACE Rev. 2.1 class 91.12 is mapped to NACE Rev. 2 class 91.01
Type: 2:1
Source Concept: Archive activities
Target Concept: http://data.europa.eu/ux2/nace2/9101
in scheme: Statistical Classification of Economic Activities in the European Community, Rev. 2.1 (NACE Rev. 2.1)
scope note: the content of the NACE Rev 2.1 class is fully covered in the corresponding NACE Rev 2 class
top concept of: Statistical Classification of Economic Activities in the European Community, Rev. 2.1 (NACE Rev. 2.1)
Mapping Cardinality: n 1

Monetary intermediation
type: Concept
CoreContentNote: This group includes obtaining and providing funds in the form of transferable deposits or close substitutes, in other words, funds that are fixed in money terms, obtained on a day-to-day basis and distributing these funds.
broader: Financial service activities, except insurance and pension funding
in scheme: Statistical Classification of Economic Activities in the European Community, Rev. 2.1 (NACE Rev. 2.1)
Notation: 64.1
top concept of: Statistical Classification of Economic Activities in the European Community, Rev. 2.1 (NACE Rev. 2.1)

Leasing of intellectual property and similar products, except copyrighted works
type: Concept
broader: Rental and leasing activities
in scheme: Statistical Classification of Economic Activities in the European Community, Rev. 2.1 (NACE Rev. 2.1)
Notation: 77.4
top concept of: Statistical Classification of Economic Activities in the European Community, Rev. 2.1 (NACE Rev. 2.1)

Cold drawing of bars
type: Concept
CoreContentNote: This class includes: - manufacture of steel bars, rods, and solid sections of steel by cold drawing, grinding or cold-finishing
Exclusion Note: This class excludes: - cold drawing of wire, see 24.34
broader: Manufacture of other products of first processing of steel
in scheme: Statistical Classification of Economic Activities in the European Community, Rev. 2.1 (NACE Rev. 2.1)
Notation: 24.31
top concept of: Statistical Classification of Economic Activities in the European Community, Rev. 2.1 (NACE Rev. 2.1)

Interior design activities
type: Concept
CoreContentNote: This class includes: - activities of interior decorators - interior design services (e.g. the planning and designing of interior spaces to meet the aesthetic and functional needs of people focusing mainly on finishes, furniture and colour palettes) - drafting designs for interior decoration
Exclusion Note: This class excludes: - architectural design activities, see 71.11
broader: Specialised design activities
in scheme: Statistical Classification of Economic Activities in the European Community, Rev. 2.1 (NACE Rev. 2.1)
Notation: 74.13
top concept of: Statistical Classification of Economic Activities in the European Community, Rev. 2.1 (NACE Rev. 2.1)

ConceptNoneRandom0.6430337962454454
type: ConceptAssociation
description: NACE Rev. 2.1 class 10.11 is mapped to NACE Rev. 2 class 10.11
Type: 1:1
Source Concept: Processing and preserving of meat, except of poultry meat
Target Concept: http://data.europa.eu/ux2/nace2/1011
in scheme: Statistical Classification of Economic Activities in the European Community, Rev. 2.1 (NACE Rev. 2.1)
scope note: the content of the NACE Rev 2.1 class is fully covered in the corresponding NACE Rev 2 class
top concept of: Statistical Classification of Economic Activities in the European Community, Rev. 2.1 (NACE Rev. 2.1)
Mapping Cardinality: 1 1

Computer programming, consultancy and related activities
type: Concept
CoreContentNote: This division includes: - activities of providing expertise in the field of information technologies, designing the structure and content of, and/or writing, modifying, customising, testing and supporting software and applications - planning and designing computer systems that integrate computer hardware, software and communication technologies - on-site management and operation of clients’ computer systems and/or data processing facilities - computer hardware, software and systems consultancy services
Exclusion Note: This division excludes: - software publishing, see division 58 - provision of online gaming / video game sites not associated with its publishing, see division 60 - provision of computing infrastructure, data processing and hosting, see division 63 - provision of financial and insurance services using published financial and insurance technologies software, see section L - activities of gambling sites, see 92.00 - repair and maintenance of computers and communication equipment, see 95.10
broader: TELECOMMUNICATION, COMPUTER PROGRAMMING, CONSULTING, COMPUTING INFRASTRUCTURE AND OTHER INFORMATION SERVICE ACTIVITIES
in scheme: Statistical Classification of Economic Activities in the European Community, Rev. 2.1 (NACE Rev. 2.1)
Notation: 62
top concept of: Statistical Classification of Economic Activities in the European Community, Rev. 2.1 (NACE Rev. 2.1)

Undifferentiated goods-producing activities of private households for own use
type: Concept
CoreContentNote: This class includes the undifferentiated subsistence goods-producing activities of households, in other words, the activities of households that are engaged in a variety of activities that produce goods for their own subsistence. These activities include hunting and gathering, farming, and the production of shelter, clothing and other goods by the household for its own subsistence.
Exclusion Note: If households are also engaged in the production of marketed goods, they are classified to the appropriate goods-producing industry of NACE. If they are principally engaged in a specific goods-producing subsistence activity, they are classified to the appropriate goods-producing industry of NACE.
broader: Undifferentiated goods-producing activities of private households for own use
in scheme: Statistical Classification of Economic Activities in the European Community, Rev. 2.1 (NACE Rev. 2.1)
Notation: 98.10
top concept of: Statistical Classification of Economic Activities in the European Community, Rev. 2.1 (NACE Rev. 2.1)

ConceptNoneRandom0.11240962795046294
type: ConceptAssociation
description: NACE Rev. 2.1 group 07.2 is mapped to NACE Rev. 2 group 07.2
Type: 1:1
Source Concept: Mining of non-ferrous metal ores
Target Concept: http://data.europa.eu/ux2/nace2/072
in scheme: Statistical Classification of Economic Activities in the European Community, Rev. 2.1 (NACE Rev. 2.1)
top concept of: Statistical Classification of Economic Activities in the European Community, Rev. 2.1 (NACE Rev. 2.1)
Mapping Cardinality: 1 1

Manufacture of man-made fibres
type: Concept
broader: Manufacture of chemicals and chemical products
in scheme: Statistical Classification of Economic Activities in the European Community, Rev. 2.1 (NACE Rev. 2.1)
Notation: 20.6
top concept of: Statistical Classification of Economic Activities in the European Community, Rev. 2.1 (NACE Rev. 2.1)

Activities of trust, estate and agency accounts
type: Concept
Additional Content Note: This class also includes: - activities of shareholding companies, not owning controlling levels of equity - venture capital companies where the only financing is by shares and no fee is received
CoreContentNote: This class includes legal entities, not acting as collective investment schemes, organised to pool securities, estates and other financial assets, without managing, on behalf of shareholders or beneficiaries. The portfolios are customised to achieve specific investment characteristics (for example, diversification, risk, rate of return, price volatility). These entities earn interest, dividends and other property income but have little or no employment and no revenue from the sale of services. This class includes: - trusts, estates and agency accounts, administered on behalf of multiple beneficiaries under the terms of a trust agreement, will or agency agreement
Exclusion Note: This class excludes: - raising funds by issuing shares or units and acting as collective investment schemes, see 64.31
broader: Activities of trusts, funds and similar financial entities
in scheme: Statistical Classification of Economic Activities in the European Community, Rev. 2.1 (NACE Rev. 2.1)
Notation: 64.32
top concept of: Statistical Classification of Economic Activities in the European Community, Rev. 2.1 (NACE Rev. 2.1)

ConceptNoneRandom0.1701296589193495
type: ConceptAssociation
description: NACE Rev. 2.1 class 23.44 is mapped to NACE Rev. 2 class 23.44
Type: 1:1
Source Concept: Manufacture of other technical ceramic products
Target Concept: http://data.europa.eu/ux2/nace2/2344
in scheme: Statistical Classification of Economic Activities in the European Community, Rev. 2.1 (NACE Rev. 2.1)
scope note: the content of the NACE Rev 2.1 class is fully covered in the corresponding NACE Rev 2 class
top concept of: Statistical Classification of Economic Activities in the European Community, Rev. 2.1 (NACE Rev. 2.1)
Mapping Cardinality: 1 1

ConceptNoneRandom0.797740200600909
type: ConceptAssociation
description: NACE Rev. 2.1 class 22.11 is mapped to NACE Rev. 2 class 22.11
Type: 1:1
Source Concept: Manufacture, retreading and rebuilding of rubber tyres and manufacture of tubes
Target Concept: http://data.europa.eu/ux2/nace2/2211
in scheme: Statistical Classification of Economic Activities in the European Community, Rev. 2.1 (NACE Rev. 2.1)
scope note: the content of the NACE Rev 2.1 class is fully covered in the corresponding NACE Rev 2 class
top concept of: Statistical Classification of Economic Activities in the European Community, Rev. 2.1 (NACE Rev. 2.1)
Mapping Cardinality: 1 1

ConceptNoneRandom0.17483975333965585
type: ConceptAssociation
description: NACE Rev. 2.1 class 25.62 is mapped to NACE Rev. 2 class 25.72
Type: 1:1
Source Concept: Manufacture of locks and hinges
Target Concept: http://data.europa.eu/ux2/nace2/2572
in scheme: Statistical Classification of Economic Activities in the European Community, Rev. 2.1 (NACE Rev. 2.1)
scope note: the content of the NACE Rev 2.1 class is fully covered in the corresponding NACE Rev 2 class
top concept of: Statistical Classification of Economic Activities in the European Community, Rev. 2.1 (NACE Rev. 2.1)
Mapping Cardinality: 1 1

ConceptNoneRandom0.31726140234196865
type: ConceptAssociation
description: NACE Rev. 2.1 class 01.63 is mapped to NACE Rev. 2 classes 01.63, 01.64
Type: 1:2
Source Concept: Post-harvest crop activities and seed processing for propagation
Target Concept: http://data.europa.eu/ux2/nace2/0163
Target Concept: http://data.europa.eu/ux2/nace2/0164
in scheme: Statistical Classification of Economic Activities in the European Community, Rev. 2.1 (NACE Rev. 2.1)
scope note: 01.63: - preparation of crops for primary markets, e.g. cleaning, trimming, grading, disinfecting - cotton ginning - preparation of tobacco leaves, e.g. sun drying - preparation of cocoa beans, e.g. peeling - waxing of fruit - drying of fruit, vegetable, herbs, spices, medicinal herbs and tobacco 01.64: - sorting, cleaning and cutting of medicinal herbs - grain drying - post-harvest activities aimed at improving the propagation quality of seed, e.g. by the removal of non-seed materials, damaged or immature seeds, as well as reducing the seed moisture to a safe level for storage - retting of plants bearing vegetable textile fibres (such as jute, flax or coir), not associated with the growing of vegetable textile fibres - artificial ripening of fruits as a service, e.g. banana ripening
top concept of: Statistical Classification of Economic Activities in the European Community, Rev. 2.1 (NACE Rev. 2.1)
Mapping Cardinality: 1 m

ConceptNoneRandom0.31385048027559914
type: ConceptAssociation
description: NACE Rev. 2.1 group 82.1 is mapped to NACE Rev. 2 group 82.1
Type: 4:4
Source Concept: Office administrative and support activities
Target Concept: http://data.europa.eu/ux2/nace2/821
in scheme: Statistical Classification of Economic Activities in the European Community, Rev. 2.1 (NACE Rev. 2.1)
top concept of: Statistical Classification of Economic Activities in the European Community, Rev. 2.1 (NACE Rev. 2.1)
Mapping Cardinality: n m

ConceptNoneRandom0.7919099179280153
type: ConceptAssociation
description: NACE Rev. 2.1 class 91.11 is mapped to NACE Rev. 2 class 91.01
Type: 2:1
Source Concept: Library activities
Target Concept: http://data.europa.eu/ux2/nace2/9101
in scheme: Statistical Classification of Economic Activities in the European Community, Rev. 2.1 (NACE Rev. 2.1)
scope note: the content of the NACE Rev 2.1 class is fully covered in the corresponding NACE Rev 2 class
top concept of: Statistical Classification of Economic Activities in the European Community, Rev. 2.1 (NACE Rev. 2.1)
Mapping Cardinality: n 1

ConceptNoneRandom0.9679642604512142
type: ConceptAssociation
description: NACE Rev. 2.1 group 95.4 is mapped to NACE Rev. 2 group 82.9
Type: 42:34
Source Concept: Intermediation service activities for repair and maintenance of computers, personal and household goods, and motor vehicles and motorcycles
Target Concept: http://data.europa.eu/ux2/nace2/829
in scheme: Statistical Classification of Economic Activities in the European Community, Rev. 2.1 (NACE Rev. 2.1)
top concept of: Statistical Classification of Economic Activities in the European Community, Rev. 2.1 (NACE Rev. 2.1)
Mapping Cardinality: n m

ConceptNoneRandom0.4640746701218975
type: ConceptAssociation
description: NACE Rev. 2.1 group 60.3 is mapped to NACE Rev. 2 groups 47.9, 63.1, 63.9
Type: 42:34
Source Concept: News agency and other content distribution activities
Target Concept: http://data.europa.eu/ux2/nace2/479
Target Concept: http://data.europa.eu/ux2/nace2/631
Target Concept: http://data.europa.eu/ux2/nace2/639
in scheme: Statistical Classification of Economic Activities in the European Community, Rev. 2.1 (NACE Rev. 2.1)
top concept of: Statistical Classification of Economic Activities in the European Community, Rev. 2.1 (NACE Rev. 2.1)
Mapping Cardinality: n m

Manufacture of other ceramic products
type: Concept
CoreContentNote: This class includes: - manufacture of ceramic pots, jars and similar articles, of a kind used for conveyance or packing of goods - manufacture of ceramic troughs, tubs and similar receptacles, of a kind used in agriculture - manufacture of ceramic products n.e.c.
Exclusion Note: This class excludes: - manufacture of ceramic sanitary fixtures, see 23.42 - manufacture of artificial teeth, see 32.50
broader: Manufacture of other porcelain and ceramic products
in scheme: Statistical Classification of Economic Activities in the European Community, Rev. 2.1 (NACE Rev. 2.1)
Notation: 23.45
top concept of: Statistical Classification of Economic Activities in the European Community, Rev. 2.1 (NACE Rev. 2.1)

ConceptNoneRandom0.24022142571786897
type: ConceptAssociation
description: NACE Rev. 2.1 group 86.9 is mapped to NACE Rev. 2 groups 82.9, 86.9
Type: 42:34
Source Concept: Other human health activities
Target Concept: http://data.europa.eu/ux2/nace2/869
Target Concept: http://data.europa.eu/ux2/nace2/829
in scheme: Statistical Classification of Economic Activities in the European Community, Rev. 2.1 (NACE Rev. 2.1)
top concept of: Statistical Classification of Economic Activities in the European Community, Rev. 2.1 (NACE Rev. 2.1)
Mapping Cardinality: n m

Manufacture of tools
type: Concept
CoreContentNote: This class includes: - manufacture of knives and cutting blades for machines or for mechanical appliances - manufacture of hand tools (e.g. pliers, screwdrivers) - manufacture of non-power-driven agricultural hand tools - manufacture of saws and saw blades, including circular saw blades and chainsaw blades - manufacture of interchangeable tools for hand tools, whether or not power-operated, or for machine tools (e.g. drills, punches, milling cutters) - manufacture of press tools - manufacture of blacksmiths’ tools (e.g. forges, anvils) - manufacture of moulding boxes and moulds (except ingot moulds) - manufacture of vices, clamps
Exclusion Note: This class excludes: - manufacture of power-driven hand tools, see 28.24 - manufacture of ingot moulds, see 28.91
broader: Manufacture of cutlery, tools and general hardware
in scheme: Statistical Classification of Economic Activities in the European Community, Rev. 2.1 (NACE Rev. 2.1)
Notation: 25.63
top concept of: Statistical Classification of Economic Activities in the European Community, Rev. 2.1 (NACE Rev. 2.1)

Manufacture of other rubber products
type: Concept
Additional Content Note: This class also includes: - manufacture of rubber repair materials - manufacture of textile fabric impregnated, coated, covered or laminated with rubber - manufacture of rubber waterbed mattresses - manufacture of rubber bathing caps and aprons - manufacture of rubber wetsuits and diving suits - manufacture of rubber sex articles - manufacture of apparel made of latex
CoreContentNote: This class includes: - manufacture of other products of natural or synthetic rubber, unvulcanised, vulcanised or hardened: • rubber plates, sheets, strip, rods, profile shapes • tubes, pipes and hoses • rubber conveyor or transmission belts or belting • rubber hygienic articles: sheath contraceptives, teats, hot-water bottles, etc. • rubber articles of apparel • rubber thread and rope • rubberised yarn and fabrics • rubber rings, fittings and seals • rubber roller coverings • inflatable rubber mattresses • inflatable balloons - manufacture of rubber brushes - manufacture of hard rubber pipe stems - manufacture of hard rubber combs, hairpins, hair rollers, and similar - manufacture of rubber expansion joints for the construction industry - manufacture of cellular rubber latex - manufacture of rubber floor coverings
Exclusion Note: This class excludes: - manufacture of tyre cord fabrics, see 13.96 - manufacture of apparel of elastic fabrics, see 14.22, 14.29 - rubber sole and other rubber parts of footwear, see 15.20 - manufacture of glues and adhesives based on rubber, see 20.59 - manufacture of camelback strips, see 22.11 - manufacture of inflatable rafts and boats, see 30.11, 30.12, 30.13 - manufacture of mattresses of uncovered cellular rubber, see 31.00 - manufacture of rubber sports requisites (e.g. swimming and paddling pools), except apparel, see 32.30 - manufacture of rubber games and toys (including children’s wading pools, inflatable children’s rubber boats, inflatable rubber animals, balls, etc.), see 32.40 - reclaiming of rubber, see 38.21
broader: Manufacture of rubber products
in scheme: Statistical Classification of Economic Activities in the European Community, Rev. 2.1 (NACE Rev. 2.1)
Notation: 22.12
top concept of: Statistical Classification of Economic Activities in the European Community, Rev. 2.1 (NACE Rev. 2.1)

Activities of holding companies and financing conduits
type: Concept
CoreContentNote: This group includes the activities of holding companies and financing conduits. These are corporate groups’ captive financial entities, in other words, units created by a financial or non-financial group to fulfil specific financial activities and whose main activity is, respectively, to own the group or to act as a vehicle to arrange and channel funds within the group.
Exclusion Note: This group excludes: - captive factoring and invoicing companies, see 64.92 - own account investment activities (e.g. by venture capital companies, private equity firms), see 64.99 - active management of companies and enterprises, strategic planning and decision-making of the company, see 70.10 - other activities of corporate groups’ captive financial entities, which are captured under the relevant activity classes
broader: Financial service activities, except insurance and pension funding
in scheme: Statistical Classification of Economic Activities in the European Community, Rev. 2.1 (NACE Rev. 2.1)
Notation: 64.2
top concept of: Statistical Classification of Economic Activities in the European Community, Rev. 2.1 (NACE Rev. 2.1)

Intermediation service activities for rental and leasing of tangible goods and non-financial intangible assets
type: Concept
broader: Rental and leasing activities
in scheme: Statistical Classification of Economic Activities in the European Community, Rev. 2.1 (NACE Rev. 2.1)
Notation: 77.5
top concept of: Statistical Classification of Economic Activities in the European Community, Rev. 2.1 (NACE Rev. 2.1)

Other postal and courier activities
type: Concept
Additional Content Note: This class also includes: - home delivery services, including food
CoreContentNote: This class includes: - pickup, sorting, transport and delivery (domestic (national) or international) of letter post and (mail-type) parcels and packages by businesses operating outside the scope of a universal service obligation. One or more modes of transport may be involved and the activity may be carried out with either self-owned (private) transport or via public transport.
Exclusion Note: This class excludes: - transport of freight, see (according to mode of transport) 49.20, 49.41, 50.20, 50.40, 51.21, 51.22 - delivery of furniture, can include unpacking or installation, see 49.41 - home delivery of prepared meals, if performed by the same unit which prepares the meals, see division 56
broader: Other postal and courier activities
in scheme: Statistical Classification of Economic Activities in the European Community, Rev. 2.1 (NACE Rev. 2.1)
Notation: 53.20
top concept of: Statistical Classification of Economic Activities in the European Community, Rev. 2.1 (NACE Rev. 2.1)

Graphic design and visual communication activities
type: Concept
CoreContentNote: This class includes: - activities of graphic designers - graphic design of web pages - activities of communication designers - activities specialised in the design of messages and information, taking into account the characteristics and needs of people, corporate objectives, market attractiveness and dissemination media - design and consulting in the content and external appearance of campaigns and communication content; conception and design of visual images (corporate design) and media of corporate communication; brand design and brand updating; determination of visual language (form, colour, typography of publications, didactic illustration of complex and abstract contexts)
Exclusion Note: This class excludes: - design of computer-produced graphics for animations, see 59.11 - designing the structure of web pages applying principles of software engineering, see 62.10 - web design in combination with programming of web pages, see 62.10
broader: Specialised design activities
in scheme: Statistical Classification of Economic Activities in the European Community, Rev. 2.1 (NACE Rev. 2.1)
Notation: 74.12
top concept of: Statistical Classification of Economic Activities in the European Community, Rev. 2.1 (NACE Rev. 2.1)

Computing infrastructure, data processing, hosting and other information service activities
type: Concept
CoreContentNote: This division includes the provision of computing infrastructure, data processing and hosting activities, as well as activities of web search portals and other activities that primarily supply information.
Exclusion Note: This division excludes: - software publishing, see division 58 - news agency activities and provision of online gaming / video game sites, not associated with publishing, see division 60 - telecommunication activities, see division 61 - computer programming, computer systems design and computer facilities management activities, see division 62 - activities of gambling sites, see 92.00 - repair and maintenance of computers and communication equipment, see 95.10
broader: TELECOMMUNICATION, COMPUTER PROGRAMMING, CONSULTING, COMPUTING INFRASTRUCTURE AND OTHER INFORMATION SERVICE ACTIVITIES
in scheme: Statistical Classification of Economic Activities in the European Community, Rev. 2.1 (NACE Rev. 2.1)
Notation: 63
top concept of: Statistical Classification of Economic Activities in the European Community, Rev. 2.1 (NACE Rev. 2.1)

ConceptNoneRandom0.8646143525506399
type: ConceptAssociation
description: NACE Rev. 2.1 group 29.1 is mapped to NACE Rev. 2 groups 27.1, 29.1
Type: 18:19
Source Concept: Manufacture of motor vehicles
Target Concept: http://data.europa.eu/ux2/nace2/271
Target Concept: http://data.europa.eu/ux2/nace2/291
in scheme: Statistical Classification of Economic Activities in the European Community, Rev. 2.1 (NACE Rev. 2.1)
top concept of: Statistical Classification of Economic Activities in the European Community, Rev. 2.1 (NACE Rev. 2.1)
Mapping Cardinality: n m

ConceptNoneRandom0.16756049439334486
type: ConceptAssociation
description: NACE Rev. 2.1 class 68.32 is mapped to NACE Rev. 2 classes 68.31, 68.32
Type: 2:2
Source Concept: Other real estate activities on a fee or contract basis
Target Concept: http://data.europa.eu/ux2/nace2/6831
Target Concept: http://data.europa.eu/ux2/nace2/6832
in scheme: Statistical Classification of Economic Activities in the European Community, Rev. 2.1 (NACE Rev. 2.1)
scope note: 68.31: - activities of valuation of real estate - activities of real estate escrow agents - advisory activities on a fee or contract basis, in connection to buying, selling and rental of real estate 68.32: - activities of rent-collecting agencies - management of real estate, e.g. property management of real estate or dwellings in joint ownership (mostly done on a fee or contract basis)
top concept of: Statistical Classification of Economic Activities in the European Community, Rev. 2.1 (NACE Rev. 2.1)
Mapping Cardinality: n m

ConceptNoneRandom0.9610046690270808
type: ConceptAssociation
description: NACE Rev. 2.1 class 47.40 is mapped to NACE Rev. 2 classes 47.41, 47.42, 47.43, 47.89, 47.91, 47.99
Type: 78:65
Source Concept: Retail sale of information and communication equipment
Target Concept: http://data.europa.eu/ux2/nace2/4791
Target Concept: http://data.europa.eu/ux2/nace2/4799
Target Concept: http://data.europa.eu/ux2/nace2/4743
Target Concept: http://data.europa.eu/ux2/nace2/4789
Target Concept: http://data.europa.eu/ux2/nace2/4742
Target Concept: http://data.europa.eu/ux2/nace2/4741
in scheme: Statistical Classification of Economic Activities in the European Community, Rev. 2.1 (NACE Rev. 2.1)
scope note: 47.41: - retail sale of computers - retail sale of computer peripheral equipment, e.g. printers, photocopiers, interactive whiteboards, videoconferencing equipment - retail sale of video game consoles - retail sale of non-customised software, including video games, provided on a physical media, with a right to perpetual use 47.42: - retail sale of smart telephones, mobile telephones and telephones and their accessories, e.g. chargers, hands-free kits, protective film and cases 47.43: - retail sale of audio and video equipment - retail sale of radio and television equipment - retail sale of recordable media - retail sale of recording media players and recorders 47.89: Retail sale via stalls and markets of: - computers - computer peripheral equipment, e.g. printers, photocopiers, interactive whiteboards, videoconferencing equipment - video game consoles - non-customised software, including video games, provided on a physical media, with a right to perpetual use - audio and video equipment - radio and television equipment - recordable media - recording media players and recorders - smart telephones, mobile telephones and telephones and their accessories, e.g. chargers, hands-free kits, protective film and cases 47.91: - retail sale via mail order houses or via Internet of computers - retail sale via mail order houses or via Internet of computer peripheral equipment, e.g. printers, photocopiers, interactive whiteboards, videoconferencing equipment - retail sale via mail order houses or via Internet of video game consoles - retail sale via mail order houses or via Internet of non-customised software, including video games, provided on a physical media, with a right to perpetual use - retail sale via mail order houses or via Internet of audio and video equipment - retail sale via mail order houses or via Internet of radio and television equipment - retail sale via mail order houses or via Internet of recordable media - retail sale via mail order houses or via Internet of …
top concept of: Statistical Classification of Economic Activities in the European Community, Rev. 2.1 (NACE Rev. 2.1)
Mapping Cardinality: n m

Reinsurance
type: Concept
Additional Content Note: This class also includes: - activities of finite reinsurance
CoreContentNote: This class includes: - activities of assuming all or part of the risk associated with existing insurance policies originally underwritten by other insurance providers
broader: Reinsurance
in scheme: Statistical Classification of Economic Activities in the European Community, Rev. 2.1 (NACE Rev. 2.1)
Notation: 65.20
top concept of: Statistical Classification of Economic Activities in the European Community, Rev. 2.1 (NACE Rev. 2.1)

Non-specialised wholesale trade
type: Concept
Exclusion Note: This group excludes: - activities of wholesalers who do not assume ownership of the goods they trade, see 46.1
broader: Wholesale trade
in scheme: Statistical Classification of Economic Activities in the European Community, Rev. 2.1 (NACE Rev. 2.1)
Notation: 46.9
top concept of: Statistical Classification of Economic Activities in the European Community, Rev. 2.1 (NACE Rev. 2.1)

ConceptNoneRandom0.8708310619618856
type: ConceptAssociation
description: NACE Rev. 2.1 class 23.41 is mapped to NACE Rev. 2 class 23.41
Type: 1:1
Source Concept: Manufacture of ceramic household and ornamental articles
Target Concept: http://data.europa.eu/ux2/nace2/2341
in scheme: Statistical Classification of Economic Activities in the European Community, Rev. 2.1 (NACE Rev. 2.1)
scope note: the content of the NACE Rev 2.1 class is fully covered in the corresponding NACE Rev 2 class
top concept of: Statistical Classification of Economic Activities in the European Community, Rev. 2.1 (NACE Rev. 2.1)
Mapping Cardinality: 1 1

Hospital activities
type: Concept
Additional Content Note: This class also includes: - activities of mental health or psychiatric hospitals, providing diagnostic and medical treatment
CoreContentNote: This class includes activities for human health, performed by hospitals, legally recognised to treat patients. This class includes: - short- or long-term provision of medical, diagnostic and treatment services, including physician, nursing and other health services to inpatients and the specialised accommodation services required by inpatients, as provided by general hospitals and specialised hospitals (e.g. community and regional hospitals, hospitals of non-profit organisations, university hospitals, military and prison hospitals) The activities are chiefly directed to inpatients, are carried out under the direct supervision of medical doctors and include: - activities of medical and paramedical staff - activities of laboratory and technical facilities, including radiologic and anaesthesiologic activities - emergency room activities - provision of operating room services, pharmacy services, food and other hospital services - activities of family planning centres providing medical treatment (e.g. sterilisation, termination of pregnancy), with accommodation
Exclusion Note: This class excludes: - laboratory testing and inspection of all types of materials and products, except medical laboratory testing, see 71.20 - veterinary activities, see 75.00 - health activities for military personnel in the field, see 84.22 - private consultants’ services to inpatients, see 86.2 - dental practice activities of a general or specialised nature (e.g. dentistry, endodontic and paediatric dentistry); oral pathology, orthodontic activities, see 86.23 - diagnostic imaging services and medical laboratory activities, not part of hospital activities, see 86.91 - patient transport by ambulance, see 86.92
broader: Hospital activities
in scheme: Statistical Classification of Economic Activities in the European Community, Rev. 2.1 (NACE Rev. 2.1)
Notation: 86.10
top concept of: Statistical Classification of Economic Activities in the European Community, Rev. 2.1 (NACE Rev. 2.1)

Activities of extraterritorial organisations and bodies
type: Concept
broader: Activities of extraterritorial organisations and bodies
in scheme: Statistical Classification of Economic Activities in the European Community, Rev. 2.1 (NACE Rev. 2.1)
Notation: 99.0
top concept of: Statistical Classification of Economic Activities in the European Community, Rev. 2.1 (NACE Rev. 2.1)

ConceptNoneRandom0.1071539369711264
type: ConceptAssociation
description: NACE Rev. 2.1 group 95.1 is mapped to NACE Rev. 2 group 95.1
Type: 1:1
Source Concept: Repair and maintenance of computers and communication equipment
Target Concept: http://data.europa.eu/ux2/nace2/951
in scheme: Statistical Classification of Economic Activities in the European Community, Rev. 2.1 (NACE Rev. 2.1)
top concept of: Statistical Classification of Economic Activities in the European Community, Rev. 2.1 (NACE Rev. 2.1)
Mapping Cardinality: 1 1

ConceptNoneRandom0.9631130557354141
type: ConceptAssociation
description: NACE Rev. 2.1 group 73.3 is mapped to NACE Rev. 2 group 70.2
Type: 2:1
Source Concept: Public relations and communication activities
Target Concept: http://data.europa.eu/ux2/nace2/702
in scheme: Statistical Classification of Economic Activities in the European Community, Rev. 2.1 (NACE Rev. 2.1)
top concept of: Statistical Classification of Economic Activities in the European Community, Rev. 2.1 (NACE Rev. 2.1)
Mapping Cardinality: n 1

Manufacture of locks and hinges
type: Concept
CoreContentNote: This class includes: - manufacture of hardware, such as padlocks, locks, keys, hinges (e.g. base metal mountings, fittings and similar articles for buildings, furniture, vehicles)
Exclusion Note: This class excludes: - lock repair and provision of key duplication services, see 95.29
broader: Manufacture of cutlery, tools and general hardware
in scheme: Statistical Classification of Economic Activities in the European Community, Rev. 2.1 (NACE Rev. 2.1)
Notation: 25.62
top concept of: Statistical Classification of Economic Activities in the European Community, Rev. 2.1 (NACE Rev. 2.1)

Rental and leasing of personal and household goods
type: Concept
CoreContentNote: This group includes the rental of personal and household goods as well as the rental of recreational and sports equipment and videodiscs. Activities generally include short-term rental of goods, although in some instances the goods may be leased for longer periods of time.
broader: Rental and leasing activities
in scheme: Statistical Classification of Economic Activities in the European Community, Rev. 2.1 (NACE Rev. 2.1)
Notation: 77.2
top concept of: Statistical Classification of Economic Activities in the European Community, Rev. 2.1 (NACE Rev. 2.1)

Construction of roads and railways
type: Concept
broader: Civil engineering
in scheme: Statistical Classification of Economic Activities in the European Community, Rev. 2.1 (NACE Rev. 2.1)
Notation: 42.1
top concept of: Statistical Classification of Economic Activities in the European Community, Rev. 2.1 (NACE Rev. 2.1)

Manufacture of paints, varnishes and similar coatings, printing ink and mastics
type: Concept
broader: Manufacture of chemicals and chemical products
in scheme: Statistical Classification of Economic Activities in the European Community, Rev. 2.1 (NACE Rev. 2.1)
Notation: 20.3
top concept of: Statistical Classification of Economic Activities in the European Community, Rev. 2.1 (NACE Rev. 2.1)

Roofing activities
type: Concept
CoreContentNote: This class includes: - roof framing works - installation of roof trusses - external insulation of roofs - laying of roof coverings - installation of insulation in roofs - waterproofing of roofs - installation of drains, eaves gutters and rainwater pipes - installation of roof lights and roof access hatches - installation of snowguards on pitched roofs - installation of roof safety equipment
Exclusion Note: This class excludes: - internal insulation of roofs, see 43.23
broader: Specialised construction activities in construction of buildings
in scheme: Statistical Classification of Economic Activities in the European Community, Rev. 2.1 (NACE Rev. 2.1)
Notation: 43.41
top concept of: Statistical Classification of Economic Activities in the European Community, Rev. 2.1 (NACE Rev. 2.1)

ConceptNoneRandom0.008074687096481514
type: ConceptAssociation
description: NACE Rev. 2.1 class 70.20 is mapped to NACE Rev. 2 class 70.22
Type: 1:1
Source Concept: Business and other management consultancy activities
Target Concept: http://data.europa.eu/ux2/nace2/7022
in scheme: Statistical Classification of Economic Activities in the European Community, Rev. 2.1 (NACE Rev. 2.1)
scope note: the content of the NACE Rev 2.1 class is fully covered in the corresponding NACE Rev 2 class
top concept of: Statistical Classification of Economic Activities in the European Community, Rev. 2.1 (NACE Rev. 2.1)
Mapping Cardinality: 1 1

Intermediation service activities for accommodation
type: Concept
broader: Accommodation
in scheme: Statistical Classification of Economic Activities in the European Community, Rev. 2.1 (NACE Rev. 2.1)
Notation: 55.4
top concept of: Statistical Classification of Economic Activities in the European Community, Rev. 2.1 (NACE Rev. 2.1)

Manufacture, retreading and rebuilding of rubber tyres and manufacture of tubes
type: Concept
CoreContentNote: This class includes: - manufacture of rubber tyres for vehicles, equipment, mobile machinery, aircraft, toy, furniture and other uses: • pneumatic tyres • solid or cushion tyres - manufacture of inner tubes for tyres - manufacture of interchangeable tyre treads, tyre flaps, camelback strips for retreading tyres, etc. - tyre rebuilding and retreading
Exclusion Note: This class excludes: - manufacture of tube repair materials, see 22.12 - tyre and tube repair, fitting or replacement, see 95.3
broader: Manufacture of rubber products
in scheme: Statistical Classification of Economic Activities in the European Community, Rev. 2.1 (NACE Rev. 2.1)
Notation: 22.11
top concept of: Statistical Classification of Economic Activities in the European Community, Rev. 2.1 (NACE Rev. 2.1)

Manufacture of other technical ceramic products
type: Concept
CoreContentNote: This class includes: - manufacture of permanent magnets and articles intended to become permanent magnets after magnetisation, of materials other than metal (e.g. agglomerated ferrite) - manufacture of ceramic wares for laboratory, chemical or other technical uses
Exclusion Note: This class excludes: - manufacture of refractory ceramic goods, see 23.20 - manufacture of ceramic building materials, see 23.3 - manufacture of artificial stone (e.g. cultured marble), see 23.66
broader: Manufacture of other porcelain and ceramic products
in scheme: Statistical Classification of Economic Activities in the European Community, Rev. 2.1 (NACE Rev. 2.1)
Notation: 23.44
top concept of: Statistical Classification of Economic Activities in the European Community, Rev. 2.1 (NACE Rev. 2.1)

ConceptNoneRandom0.2709305041535113
type: ConceptAssociation
description: NACE Rev. 2.1 class 10.13 is mapped to NACE Rev. 2 class 10.13
Type: 1:1
Source Concept: Production of meat and poultry meat products
Target Concept: http://data.europa.eu/ux2/nace2/1013
in scheme: Statistical Classification of Economic Activities in the European Community, Rev. 2.1 (NACE Rev. 2.1)
scope note: the content of the NACE Rev 2.1 class is fully covered in the corresponding NACE Rev 2 class
top concept of: Statistical Classification of Economic Activities in the European Community, Rev. 2.1 (NACE Rev. 2.1)
Mapping Cardinality: 1 1

Veterinary activities
type: Concept
Additional Content Note: This class also includes: - activities of veterinary assistants or other auxiliary veterinary personnel - clinico-pathological and other diagnostic activities pertaining to animals - animal ambulance activities - activities of animal chiropractors - activities of animal dieticians
CoreContentNote: This class includes: - animal health care and control activities for farm animals - animal health care and control activities for pets These activities are carried out in veterinary hospitals as well as in farms, kennels or homes, in consulting and surgery rooms or elsewhere.
Exclusion Note: This class excludes: - farm animal boarding activities without health care, see 01.62 - sheep shearing, see 01.62 - herd testing , droving and agistment services, poultry caponising, see 01.62 - activities related to artificial insemination, see 01.62 - testing and control of animals before slaughter in relation to food production, see 71.20 - scientific research on animal genetics, see 72.10 - pet boarding activities without health care, see 96.99
broader: Veterinary activities
in scheme: Statistical Classification of Economic Activities in the European Community, Rev. 2.1 (NACE Rev. 2.1)
Notation: 75.00
top concept of: Statistical Classification of Economic Activities in the European Community, Rev. 2.1 (NACE Rev. 2.1)

Financial service activities, except insurance and pension funding
type: Concept
Additional Content Note: This division also includes activities of holding financial assets (such as the activities of holding companies and financing conduits and the activities of trusts, funds and similar financial entities), which are not activities according to the NACE principle in covering economic production. Units classified in groups 64.2 and 64.3 usually do not have any revenue from the sale of products, nor employ any staff (see paragraphs xx–xx of the introductory guidelines); they are integrated in NACE to facilitate the classification of units in statistical business registers.
CoreContentNote: This division includes the activities of obtaining and providing funds other than for the purpose of insurance or pension funding or compulsory social security.
Exclusion Note: This division excludes the activities of promotional institutions for economic development through long-term investments at local, regional and national level provided that they act as the government’s arm for the execution of their public policy mandate, see 84.13.
broader: FINANCIAL AND INSURANCE ACTIVITIES
in scheme: Statistical Classification of Economic Activities in the European Community, Rev. 2.1 (NACE Rev. 2.1)
Notation: 64
top concept of: Statistical Classification of Economic Activities in the European Community, Rev. 2.1 (NACE Rev. 2.1)

ConceptNoneRandom0.8592787062166004
type: ConceptAssociation
description: NACE Rev. 2.1 class 68.31 is mapped to NACE Rev. 2 class 68.31
Type: 2:2
Source Concept: Intermediation service activities for real estate activities
Target Concept: http://data.europa.eu/ux2/nace2/6831
in scheme: Statistical Classification of Economic Activities in the European Community, Rev. 2.1 (NACE Rev. 2.1)
scope note: the content of the NACE Rev 2.1 class is fully covered in the corresponding NACE Rev 2 class
top concept of: Statistical Classification of Economic Activities in the European Community, Rev. 2.1 (NACE Rev. 2.1)
Mapping Cardinality: n m

Processing and preserving of poultry meat
type: Concept
Additional Content Note: This class also includes: - cleaning, disinfecting, treating for preservation, and trimming of feathers and down
CoreContentNote: This class includes: - operation of slaughterhouses engaged in killing, dressing or packing poultry - production of fresh, chilled or frozen meat in individual portions - rendering of edible poultry fats
broader: Processing and preserving of meat and production of meat products
in scheme: Statistical Classification of Economic Activities in the European Community, Rev. 2.1 (NACE Rev. 2.1)
Notation: 10.12
top concept of: Statistical Classification of Economic Activities in the European Community, Rev. 2.1 (NACE Rev. 2.1)

Manufacture of washing, cleaning and polishing preparations
type: Concept
broader: Manufacture of chemicals and chemical products
in scheme: Statistical Classification of Economic Activities in the European Community, Rev. 2.1 (NACE Rev. 2.1)
Notation: 20.4
top concept of: Statistical Classification of Economic Activities in the European Community, Rev. 2.1 (NACE Rev. 2.1)

ConceptNoneRandom0.9219291365307314
type: ConceptAssociation
description: NACE Rev. 2.1 class 23.42 is mapped to NACE Rev. 2 class 23.42
Type: 2:5
Source Concept: Manufacture of ceramic sanitary fixtures
Target Concept: http://data.europa.eu/ux2/nace2/2342
in scheme: Statistical Classification of Economic Activities in the European Community, Rev. 2.1 (NACE Rev. 2.1)
scope note: the content of the NACE Rev 2.1 class is fully covered in the corresponding NACE Rev 2 class
top concept of: Statistical Classification of Economic Activities in the European Community, Rev. 2.1 (NACE Rev. 2.1)
Mapping Cardinality: n m

ConceptNoneRandom0.7547345141110959
type: ConceptAssociation
description: NACE Rev. 2.1 group 95.2 is mapped to NACE Rev. 2 group 95.2
Type: 1:1
Source Concept: Repair and maintenance of personal and household goods
Target Concept: http://data.europa.eu/ux2/nace2/952
in scheme: Statistical Classification of Economic Activities in the European Community, Rev. 2.1 (NACE Rev. 2.1)
top concept of: Statistical Classification of Economic Activities in the European Community, Rev. 2.1 (NACE Rev. 2.1)
Mapping Cardinality: 1 1

ConceptNoneRandom0.358594373575016
type: ConceptAssociation
description: NACE Rev. 2.1 group 60.1 is mapped to NACE Rev. 2 group 60.1
Type: 1:1
Source Concept: Radio broadcasting and audio distribution activities
Target Concept: http://data.europa.eu/ux2/nace2/601
in scheme: Statistical Classification of Economic Activities in the European Community, Rev. 2.1 (NACE Rev. 2.1)
top concept of: Statistical Classification of Economic Activities in the European Community, Rev. 2.1 (NACE Rev. 2.1)
Mapping Cardinality: 1 1

Manufacture of cutlery
type: Concept
CoreContentNote: This class includes: - manufacture of domestic cutlery (e.g. knives, forks, spoons) - manufacture of other articles of cutlery, e.g.: • cleavers and choppers • razors and razor blades • scissors and hair clippers - manufacture of cutlasses, swords, bayonets, etc.
Exclusion Note: This class excludes: - manufacture of knives and cutting blades for industrial machines, see 25.63 - manufacture of hollowware (pots, kettles, etc.), dinnerware (bowls, platters, etc.), or flatware (plates, saucers, etc.), see 25.99 - manufacture of cutlery of precious metal, see 32.12
broader: Manufacture of cutlery, tools and general hardware
in scheme: Statistical Classification of Economic Activities in the European Community, Rev. 2.1 (NACE Rev. 2.1)
Notation: 25.61
top concept of: Statistical Classification of Economic Activities in the European Community, Rev. 2.1 (NACE Rev. 2.1)

ConceptNoneRandom0.024386673074825782
type: ConceptAssociation
description: NACE Rev. 2.1 class 35.40 is mapped to NACE Rev. 2 classes 35.14, 35.23
Type: 3:2
Source Concept: Activities of brokers and agents for electric power and natural gas
Target Concept: http://data.europa.eu/ux2/nace2/3523
Target Concept: http://data.europa.eu/ux2/nace2/3514
in scheme: Statistical Classification of Economic Activities in the European Community, Rev. 2.1 (NACE Rev. 2.1)
scope note: 35.14: - activities of brokers or agents, who arrange the sale of electricity via power distribution systems operated by others - activities of brokers and agents for operation of electricity, distribution and transmission capacity exchanges for electric power 35.23: - activities of gas brokers or agents, who arrange the sale of gaseous fuels via gas distribution systems operated by others - activities of brokers and agents for commodity and distribution capacity exchanges for gaseous fuels
top concept of: Statistical Classification of Economic Activities in the European Community, Rev. 2.1 (NACE Rev. 2.1)
Mapping Cardinality: n m

ConceptNoneRandom0.8926896483324092
type: ConceptAssociation
description: NACE Rev. 2.1 group 64.9 is mapped to NACE Rev. 2 group 64.9
Type: 2:2
Source Concept: Other financial service activities, except insurance and pension funding
Target Concept: http://data.europa.eu/ux2/nace2/649
in scheme: Statistical Classification of Economic Activities in the European Community, Rev. 2.1 (NACE Rev. 2.1)
top concept of: Statistical Classification of Economic Activities in the European Community, Rev. 2.1 (NACE Rev. 2.1)
Mapping Cardinality: n m

Rental and leasing of other machinery, equipment and tangible goods
type: Concept
broader: Rental and leasing activities
in scheme: Statistical Classification of Economic Activities in the European Community, Rev. 2.1 (NACE Rev. 2.1)
Notation: 77.3
top concept of: Statistical Classification of Economic Activities in the European Community, Rev. 2.1 (NACE Rev. 2.1)

Manufacture of ceramic insulators and insulating fittings
type: Concept
CoreContentNote: This class includes: - manufacture of electrical insulators and insulating fittings for electrical purposes, of ceramics
Exclusion Note: This class excludes: - manufacture of refractory ceramic goods, see 23.20
broader: Manufacture of other porcelain and ceramic products
in scheme: Statistical Classification of Economic Activities in the European Community, Rev. 2.1 (NACE Rev. 2.1)
Notation: 23.43
top concept of: Statistical Classification of Economic Activities in the European Community, Rev. 2.1 (NACE Rev. 2.1)

Other specialised construction activities in construction of buildings
type: Concept
CoreContentNote: This class includes: - construction activities specialising in one aspect common to construction of buildings, requiring specialised skills or equipment: • construction of foundations for buildings, including piledriving • de-humidification of buildings • erection of prefabricated, not self-manufactured, structural steel components for buildings • erection of chimneys and industrial ovens
Exclusion Note: This class excludes: - construction or installation of masonry heater stoves, see 43.22
broader: Specialised construction activities in construction of buildings
in scheme: Statistical Classification of Economic Activities in the European Community, Rev. 2.1 (NACE Rev. 2.1)
Notation: 43.42
top concept of: Statistical Classification of Economic Activities in the European Community, Rev. 2.1 (NACE Rev. 2.1)

Construction of utility projects
type: Concept
broader: Civil engineering
in scheme: Statistical Classification of Economic Activities in the European Community, Rev. 2.1 (NACE Rev. 2.1)
Notation: 42.2
top concept of: Statistical Classification of Economic Activities in the European Community, Rev. 2.1 (NACE Rev. 2.1)

ConceptNoneRandom0.9302539878416974
type: ConceptAssociation
description: NACE Rev. 2.1 class 10.12 is mapped to NACE Rev. 2 class 10.12
Type: 1:1
Source Concept: Processing and preserving of poultry meat
Target Concept: http://data.europa.eu/ux2/nace2/1012
in scheme: Statistical Classification of Economic Activities in the European Community, Rev. 2.1 (NACE Rev. 2.1)
scope note: the content of the NACE Rev 2.1 class is fully covered in the corresponding NACE Rev 2 class
top concept of: Statistical Classification of Economic Activities in the European Community, Rev. 2.1 (NACE Rev. 2.1)
Mapping Cardinality: 1 1

Insurance, reinsurance and pension funding, except compulsory social security
type: Concept
CoreContentNote: This division includes underwriting annuities, insurance policies (for example, direct life and non-life insurance) and investing premiums to build up a portfolio of financial assets to be used against future claims. Provision of direct insurance, pension funding and reinsurance are included.
Exclusion Note: This division excludes: - provision of insurance-related services on a fee or contract basis, see division 66
broader: FINANCIAL AND INSURANCE ACTIVITIES
in scheme: Statistical Classification of Economic Activities in the European Community, Rev. 2.1 (NACE Rev. 2.1)
Notation: 65
top concept of: Statistical Classification of Economic Activities in the European Community, Rev. 2.1 (NACE Rev. 2.1)

Other specialised design activities
type: Concept
Exclusion Note: This class excludes: - design of computer-produced graphics for animations, see 59.11
broader: Specialised design activities
in scheme: Statistical Classification of Economic Activities in the European Community, Rev. 2.1 (NACE Rev. 2.1)
Notation: 74.14
top concept of: Statistical Classification of Economic Activities in the European Community, Rev. 2.1 (NACE Rev. 2.1)

ConceptNoneRandom0.12056885505452719
type: ConceptAssociation
description: NACE Rev. 2.1 class 80.01 is mapped to NACE Rev. 2 classes 80.10, 80.30
Type: 1:2
Source Concept: Investigation and private security activities
Target Concept: http://data.europa.eu/ux2/nace2/8030
Target Concept: http://data.europa.eu/ux2/nace2/8010
in scheme: Statistical Classification of Economic Activities in the European Community, Rev. 2.1 (NACE Rev. 2.1)
scope note: 80.10: - guard, patrol or security services - support services to cash collection and deposit services - secure shredding and data destruction services - armoured car services - guard and security service activities, e.g. for shops, trauma centres - luggage and passenger inspection at airports, railway stations and other similar places - activities of security personnel for events, concerts, fairs and exhibitions 80.30: - investigation services in the private, commercial, insurance and legal field
top concept of: Statistical Classification of Economic Activities in the European Community, Rev. 2.1 (NACE Rev. 2.1)
Mapping Cardinality: 1 m

ConceptNoneRandom0.337923318531829
type: ConceptAssociation
description: NACE Rev. 2.1 class 66.12 is mapped to NACE Rev. 2 class 66.12
Type: 1:1
Source Concept: Security and commodity contracts brokerage
Target Concept: http://data.europa.eu/ux2/nace2/6612
in scheme: Statistical Classification of Economic Activities in the European Community, Rev. 2.1 (NACE Rev. 2.1)
scope note: the content of the NACE Rev 2.1 class is fully covered in the corresponding NACE Rev 2 class
top concept of: Statistical Classification of Economic Activities in the European Community, Rev. 2.1 (NACE Rev. 2.1)
Mapping Cardinality: 1 1

Intermediation service activities for accommodation
type: Concept
Additional Content Note: This class also includes: - timeshare exchange services - reservation services for accommodation
CoreContentNote: This class includes the intermediation of all types of accommodation by bringing clients and service providers together for a fee or commission. These intermediation activities can be carried out on digital platforms or through non-digital channels (phone, post, and so on). The fee or commission can be received from either the client or the provider of the accommodation. Revenue for the intermediation activities can include other sources of income (for example, revenues from the sale of advertising space).
Exclusion Note: This class excludes: - units that provide reservation services alongside additional accommodation advice or expertise, see 79.11 - intermediation or sale of a combination of accommodation, travel and food, i.e. travel agencies and tour operators, see 79.11, 79.12
broader: Intermediation service activities for accommodation
in scheme: Statistical Classification of Economic Activities in the European Community, Rev. 2.1 (NACE Rev. 2.1)
Notation: 55.40
top concept of: Statistical Classification of Economic Activities in the European Community, Rev. 2.1 (NACE Rev. 2.1)

Production of meat and poultry meat products
type: Concept
CoreContentNote: This class includes: - production of preserved meat (e.g. by cooking, drying, salting or smoking) - production of meat products: • sausages, salami, puddings, andouillettes, saveloys, bolognas, pâtés, rillettes, boiled ham
Exclusion Note: This class excludes: - manufacture of prepared meat and poultry dishes, see 10.85 - manufacture of soup containing meat, see 10.89 - wholesale of meat, see 46.32
broader: Processing and preserving of meat and production of meat products
in scheme: Statistical Classification of Economic Activities in the European Community, Rev. 2.1 (NACE Rev. 2.1)
Notation: 10.13
top concept of: Statistical Classification of Economic Activities in the European Community, Rev. 2.1 (NACE Rev. 2.1)

ConceptNoneRandom0.401755562051445
type: ConceptAssociation
description: NACE Rev. 2.1 group 07.1 is mapped to NACE Rev. 2 group 07.1
Type: 1:1
Source Concept: Mining of iron ores
Target Concept: http://data.europa.eu/ux2/nace2/071
in scheme: Statistical Classification of Economic Activities in the European Community, Rev. 2.1 (NACE Rev. 2.1)
top concept of: Statistical Classification of Economic Activities in the European Community, Rev. 2.1 (NACE Rev. 2.1)
Mapping Cardinality: 1 1

ConceptNoneRandom0.148592940265302
type: ConceptAssociation
description: NACE Rev. 2.1 class 24.32 is mapped to NACE Rev. 2 class 24.32
Type: 1:1
Source Concept: Cold rolling of narrow strip
Target Concept: http://data.europa.eu/ux2/nace2/2432
in scheme: Statistical Classification of Economic Activities in the European Community, Rev. 2.1 (NACE Rev. 2.1)
scope note: the content of the NACE Rev 2.1 class is fully covered in the corresponding NACE Rev 2 class
top concept of: Statistical Classification of Economic Activities in the European Community, Rev. 2.1 (NACE Rev. 2.1)
Mapping Cardinality: 1 1

Manufacture of ceramic sanitary fixtures
type: Concept
CoreContentNote: This class includes: - manufacture of ceramic sanitary fixtures (e.g. sinks, washbasins, washbasin pedestals, baths, bidets, water closet pans, flushing cisterns)
Exclusion Note: This class excludes: - manufacture of refractory ceramic goods, see 23.20 - manufacture of ceramic building materials, see 23.3
broader: Manufacture of other porcelain and ceramic products
in scheme: Statistical Classification of Economic Activities in the European Community, Rev. 2.1 (NACE Rev. 2.1)
Notation: 23.42
top concept of: Statistical Classification of Economic Activities in the European Community, Rev. 2.1 (NACE Rev. 2.1)

ConceptNoneRandom0.4188752158732797
type: ConceptAssociation
description: NACE Rev. 2.1 class 78.10 is mapped to NACE Rev. 2 class 78.10
Type: 1:1
Source Concept: Activities of employment placement agencies
Target Concept: http://data.europa.eu/ux2/nace2/7810
in scheme: Statistical Classification of Economic Activities in the European Community, Rev. 2.1 (NACE Rev. 2.1)
scope note: the content of the NACE Rev 2.1 class is fully covered in the corresponding NACE Rev 2 class
top concept of: Statistical Classification of Economic Activities in the European Community, Rev. 2.1 (NACE Rev. 2.1)
Mapping Cardinality: 1 1

ConceptNoneRandom0.0467447684869875
type: ConceptAssociation
description: NACE Rev. 2.1 group 82.4 is mapped to NACE Rev. 2 groups 79.9, 82.9
Type: 42:34
Source Concept: Intermediation service activities for business support service activities n.e.c.
Target Concept: http://data.europa.eu/ux2/nace2/799
Target Concept: http://data.europa.eu/ux2/nace2/829
in scheme: Statistical Classification of Economic Activities in the European Community, Rev. 2.1 (NACE Rev. 2.1)
top concept of: Statistical Classification of Economic Activities in the European Community, Rev. 2.1 (NACE Rev. 2.1)
Mapping Cardinality: n m

Holiday and other short-stay accommodation
type: Concept
broader: Accommodation
in scheme: Statistical Classification of Economic Activities in the European Community, Rev. 2.1 (NACE Rev. 2.1)
Notation: 55.2
top concept of: Statistical Classification of Economic Activities in the European Community, Rev. 2.1 (NACE Rev. 2.1)

Wholesale of motor vehicles, motorcycles and related parts and accessories
type: Concept
Exclusion Note: This group excludes: - activities of wholesalers who do not assume ownership of the goods they trade, see 46.1 - maintenance and repair of motor vehicles, see 95.31 - maintenance and repair of motorcycles, see 95.32
broader: Wholesale trade
in scheme: Statistical Classification of Economic Activities in the European Community, Rev. 2.1 (NACE Rev. 2.1)
Notation: 46.7
top concept of: Statistical Classification of Economic Activities in the European Community, Rev. 2.1 (NACE Rev. 2.1)

Manufacture of basic chemicals, fertilisers and nitrogen compounds, plastics and synthetic rubber in primary forms
type: Concept
CoreContentNote: This group includes the manufacture of basic chemical products, fertilisers and associated nitrogen compounds, as well as plastics and synthetic rubber in primary forms.
broader: Manufacture of chemicals and chemical products
in scheme: Statistical Classification of Economic Activities in the European Community, Rev. 2.1 (NACE Rev. 2.1)
Notation: 20.1
top concept of: Statistical Classification of Economic Activities in the European Community, Rev. 2.1 (NACE Rev. 2.1)

ConceptNoneRandom0.34174550756572286
type: ConceptAssociation
description: NACE Rev. 2.1 division 08 is mapped to NACE Rev. 2 division 08
Type: 1:1
Source Concept: Other mining and quarrying
Target Concept: http://data.europa.eu/ux2/nace2/08
in scheme: Statistical Classification of Economic Activities in the European Community, Rev. 2.1 (NACE Rev. 2.1)
top concept of: Statistical Classification of Economic Activities in the European Community, Rev. 2.1 (NACE Rev. 2.1)
Mapping Cardinality: 1 1

ConceptNoneRandom0.5782246149914587
type: ConceptAssociation
description: NACE Rev. 2.1 class 63.92 is mapped to NACE Rev. 2 class 63.99
Type: 1:1
Source Concept: Other information service activities
Target Concept: http://data.europa.eu/ux2/nace2/6399
in scheme: Statistical Classification of Economic Activities in the European Community, Rev. 2.1 (NACE Rev. 2.1)
scope note: the content of the NACE Rev 2.1 class is fully covered in the corresponding NACE Rev 2 class
top concept of: Statistical Classification of Economic Activities in the European Community, Rev. 2.1 (NACE Rev. 2.1)
Mapping Cardinality: 1 1

Post-harvest crop activities and seed processing for propagation
type: Concept
Additional Content Note: This class also includes: - drying, cleaning, grading and treating of seeds until they are marketed - treatment of genetically modified seeds
CoreContentNote: This class includes post-harvest crop activities on a fee or contract basis: - preparation of crops for primary markets (e.g. cleaning, trimming, grading or disinfecting) - cotton ginning - preparation of tobacco leaves (e.g. sun drying) - preparation of cocoa beans (e.g. peeling) - waxing of fruit - drying of fruit, vegetables, herbs, spices, medicinal herbs and tobacco - sorting, cleaning and cutting of medicinal herbs - grain drying - post-harvest activities aimed at improving the propagation quality of seed (e.g. by the removal of non-seed materials, or damaged or immature seeds, or by reducing the seed moisture to a safe level for storage) - retting of plants bearing vegetable textile fibres (such as jute, flax or coir), not associated with the growing of vegetable textile fibres - artificial ripening of fruits as a service (e.g. banana ripening)
Exclusion Note: This class excludes: - preparation of agricultural products by the producer, see the corresponding classes in groups 01.1, 01.2, 01.3 - growing of seeds, see 01.1, 01.2 - processing of seeds to obtain oil, see 10.41 - stemming and redrying of tobacco, see 12.00 - marketing activities of commission merchants and cooperative associations, see division 46 - wholesale of agricultural raw materials, see 46.2 - research to develop or modify new forms of seeds, see 72.10
broader: Support activities to agriculture and post-harvest crop activities
in scheme: Statistical Classification of Economic Activities in the European Community, Rev. 2.1 (NACE Rev. 2.1)
Notation: 01.63
top concept of: Statistical Classification of Economic Activities in the European Community, Rev. 2.1 (NACE Rev. 2.1)

Activities of brokers and agents for electric power and natural gas
type: Concept
CoreContentNote: This class includes: - activities of brokers or agents, who arrange the sale of electricity via power distribution systems operated by others - activities of gas brokers or agents, who arrange the sale of gaseous fuels via gas distribution systems operated by others - activities of brokers and agents for commodity and distribution capacity exchanges for gaseous fuels - activities of brokers and agents for the operation of electricity distribution and transmission capacity exchanges for electric power
Exclusion Note: This class excludes: - storage and distribution or provision of electric power to the user (through a system of mains) by the producer (own account), see 35.1 - storage and distribution or provision of gaseous fuels to the user (through a system of mains) by the producer (own account), see 35.2 - intermediation service activities for the transport of gaseous fuels, see 52.31
broader: Activities of brokers and agents for electric power and natural gas
in scheme: Statistical Classification of Economic Activities in the European Community, Rev. 2.1 (NACE Rev. 2.1)
Notation: 35.40
top concept of: Statistical Classification of Economic Activities in the European Community, Rev. 2.1 (NACE Rev. 2.1)

ConceptNoneRandom0.9923038441575348
type: ConceptAssociation
description: NACE Rev. 2.1 group 16.1 is mapped to NACE Rev. 2 group 16.1
Type: 1:1
Source Concept: Sawmilling and planing of wood; processing and finishing of wood
Target Concept: http://data.europa.eu/ux2/nace2/161
in scheme: Statistical Classification of Economic Activities in the European Community, Rev. 2.1 (NACE Rev. 2.1)
top concept of: Statistical Classification of Economic Activities in the European Community, Rev. 2.1 (NACE Rev. 2.1)
Mapping Cardinality: 1 1

ConceptNoneRandom0.5906277184253836
type: ConceptAssociation
description: NACE Rev. 2.1 class 26.51 is mapped to NACE Rev. 2 classes 26.30, 26.51
Type: 2:2
Source Concept: Manufacture of instruments and appliances for measuring, testing and navigation
Target Concept: http://data.europa.eu/ux2/nace2/2630
Target Concept: http://data.europa.eu/ux2/nace2/2651
in scheme: Statistical Classification of Economic Activities in the European Community, Rev. 2.1 (NACE Rev. 2.1)
scope note: 26.30: - manufacture of burglar and fire alarm systems, sending signals to a control station 26.51: - manufacture of aircraft engine instruments - manufacture of automotive emissions testing equipment - manufacture of meteorological instruments - manufacture of physical properties testing and inspection equipment - manufacture of polygraph machines - manufacture of radiation detection and monitoring instruments - manufacture of surveying instruments - manufacture of thermometers liquid-in-glass and bimetal types (except medical) - manufacture of humidistats - manufacture of hydronic limit controls - manufacture of flame and burner control - manufacture of spectrometers - manufacture of pneumatic gauges - manufacture of consumption meters, e.g. water, gas, electricity - manufacture of flow meters and counting devices - manufacture of tally counters - manufacture of mine detectors, pulse (signal) generators; metal detectors - manufacture of search, detection, navigation, aeronautical, and nautical equipment, including sonobuoys - manufacture of radar equipment - manufacture of GPS devices - manufacture of burglar and fire alarm systems, sending signals to a control station - manufacture of environmental controls and automatic controls for appliances - manufacture of measuring and recording equipment, e.g. flight recorders - manufacture of motion detectors - manufacture of radars - manufacture of laboratory analytical instruments (e.g. blood analysis equipment) - manufacture of laboratory scales, balances, incubators, and miscellaneous laboratory apparatus for measuring, testing, etc. - manufacture of sensors and sensing equipment
top concept of: Statistical Classification of Economic Activities in the European Community, Rev. 2.1 (NACE Rev. 2.1)
Mapping Cardinality: n m

ConceptNoneRandom0.2529392688994794
type: ConceptAssociation
description: NACE Rev. 2.1 class 66.19 is mapped to NACE Rev. 2 class 66.19
Type: 2:2
Source Concept: Other activities auxiliary to financial services, except insurance and pension funding
Target Concept: http://data.europa.eu/ux2/nace2/6619
in scheme: Statistical Classification of Economic Activities in the European Community, Rev. 2.1 (NACE Rev. 2.1)
scope note: the content of the NACE Rev 2.1 class is fully covered in the corresponding NACE Rev 2 class
top concept of: Statistical Classification of Economic Activities in the European Community, Rev. 2.1 (NACE Rev. 2.1)
Mapping Cardinality: n m

ConceptNoneRandom0.11977158770049334
type: ConceptAssociation
description: NACE Rev. 2.1 class 46.12 is mapped to NACE Rev. 2 classes 46.12, 82.99
Type: 78:65
Source Concept: Activities of agents involved in the wholesale of fuels, ores, metals and industrial chemicals
Target Concept: http://data.europa.eu/ux2/nace2/4612
Target Concept: http://data.europa.eu/ux2/nace2/8299
in scheme: Statistical Classification of Economic Activities in the European Community, Rev. 2.1 (NACE Rev. 2.1)
scope note: 46.12: - activities of agents involved in the wholesale of: • fuels, ores, metals and industrial chemicals, including fertilisers 82.99: - activities of independent auctioneers
top concept of: Statistical Classification of Economic Activities in the European Community, Rev. 2.1 (NACE Rev. 2.1)
Mapping Cardinality: n m

ConceptNoneRandom0.7436418227792313
type: ConceptAssociation
description: NACE Rev. 2.1 class 24.33 is mapped to NACE Rev. 2 class 24.33
Type: 1:1
Source Concept: Cold forming or folding
Target Concept: http://data.europa.eu/ux2/nace2/2433
in scheme: Statistical Classification of Economic Activities in the European Community, Rev. 2.1 (NACE Rev. 2.1)
scope note: the content of the NACE Rev 2.1 class is fully covered in the corresponding NACE Rev 2 class
top concept of: Statistical Classification of Economic Activities in the European Community, Rev. 2.1 (NACE Rev. 2.1)
Mapping Cardinality: 1 1

Other specialised wholesale
type: Concept
CoreContentNote: This group includes: - other specialised wholesale activities not classified in groups 46.2 to 46.7 of this division. - the wholesale of intermediate products, except agricultural, typically not for household use
Exclusion Note: This group excludes: - activities of wholesalers who do not assume ownership of the goods they trade, see 46.1 - wholesale of batteries and accumulators not for motor vehicles, see 46.64 - non-specialised wholesale trade, see 46.90
broader: Wholesale trade
in scheme: Statistical Classification of Economic Activities in the European Community, Rev. 2.1 (NACE Rev. 2.1)
Notation: 46.8
top concept of: Statistical Classification of Economic Activities in the European Community, Rev. 2.1 (NACE Rev. 2.1)

Manufacture of ceramic household and ornamental articles
type: Concept
CoreContentNote: This class includes: - manufacture of ceramic tableware, kitchenware, household articles, toilet articles, statuettes and other ornamental articles of ceramics (e.g. porcelain, china, common pottery, stoneware, earthenware or fine pottery)
Exclusion Note: This class excludes: - manufacture of imitation jewellery, see 32.13 - manufacture of ceramic toys, see 32.40
broader: Manufacture of other porcelain and ceramic products
in scheme: Statistical Classification of Economic Activities in the European Community, Rev. 2.1 (NACE Rev. 2.1)
Notation: 23.41
top concept of: Statistical Classification of Economic Activities in the European Community, Rev. 2.1 (NACE Rev. 2.1)

Rental and leasing of motor vehicles
type: Concept
broader: Rental and leasing activities
in scheme: Statistical Classification of Economic Activities in the European Community, Rev. 2.1 (NACE Rev. 2.1)
Notation: 77.1
top concept of: Statistical Classification of Economic Activities in the European Community, Rev. 2.1 (NACE Rev. 2.1)

Construction of roads and motorways
type: Concept
CoreContentNote: This class includes: - construction of motorways, streets, roads, other vehicular and pedestrian ways - surface work (e.g. paving of roads, motorways or bridges with asphalt, concrete, stone) - construction of airfield runways - construction of rough, unpaved mountain bike pathways or trails
Exclusion Note: This class excludes: - installation of street lighting and electrical signals, see 43.21 - road painting and other marking of streets, see 43.50 - installation of crash barriers, traffic signs, etc., see 43.50 - project management for construction, see 71.1 - engineering activities, see 71.12
broader: Construction of roads and railways
in scheme: Statistical Classification of Economic Activities in the European Community, Rev. 2.1 (NACE Rev. 2.1)
Notation: 42.11
top concept of: Statistical Classification of Economic Activities in the European Community, Rev. 2.1 (NACE Rev. 2.1)

Camping grounds and recreational vehicle parks
type: Concept
broader: Accommodation
in scheme: Statistical Classification of Economic Activities in the European Community, Rev. 2.1 (NACE Rev. 2.1)
Notation: 55.3
top concept of: Statistical Classification of Economic Activities in the European Community, Rev. 2.1 (NACE Rev. 2.1)

Manufacture of pesticides, disinfectants and other agrochemical products
type: Concept
broader: Manufacture of chemicals and chemical products
in scheme: Statistical Classification of Economic Activities in the European Community, Rev. 2.1 (NACE Rev. 2.1)
Notation: 20.2
top concept of: Statistical Classification of Economic Activities in the European Community, Rev. 2.1 (NACE Rev. 2.1)

Activities of extraterritorial organisations and bodies
type: Concept
Additional Content Note: This class also includes: - activities of general government agencies of other countries (e.g. embassies, consulates, military bases, scientific bases)
CoreContentNote: This class includes: - activities of international organisations under international treaties between states, e.g.: • the United Nations (UN) and the specialised agencies of the United Nations system, regional bodies • the International Monetary Fund (IMF), the World Bank • the World Customs Organization (WCO), the Organisation for Economic Co-operation and Development (OECD) • the Organization of the Petroleum Exporting Countries (OPEC), the European Free Trade Association (EFTA) - activities of institutions and bodies of the European Union (EU)
broader: Activities of extraterritorial organisations and bodies
in scheme: Statistical Classification of Economic Activities in the European Community, Rev. 2.1 (NACE Rev. 2.1)
Notation: 99.00
top concept of: Statistical Classification of Economic Activities in the European Community, Rev. 2.1 (NACE Rev. 2.1)

ConceptNoneRandom0.23253624428032493
type: ConceptAssociation
description: NACE Rev. 2.1 division 07 is mapped to NACE Rev. 2 division 07
Type: 1:1
Source Concept: Mining of metal ores
Target Concept: http://data.europa.eu/ux2/nace2/07
in scheme: Statistical Classification of Economic Activities in the European Community, Rev. 2.1 (NACE Rev. 2.1)
top concept of: Statistical Classification of Economic Activities in the European Community, Rev. 2.1 (NACE Rev. 2.1)
Mapping Cardinality: 1 1

ConceptNoneRandom0.07594657253796588
type: ConceptAssociation
description: NACE Rev. 2.1 class 63.91 is mapped to NACE Rev. 2 class 63.12
Type: 78:65
Source Concept: Web search portal activities
Target Concept: http://data.europa.eu/ux2/nace2/6312
in scheme: Statistical Classification of Economic Activities in the European Community, Rev. 2.1 (NACE Rev. 2.1)
scope note: the content of the NACE Rev 2.1 class is fully covered in the corresponding NACE Rev 2 class
top concept of: Statistical Classification of Economic Activities in the European Community, Rev. 2.1 (NACE Rev. 2.1)
Mapping Cardinality: n m

Processing and preserving of meat, except of poultry meat
type: Concept
Additional Content Note: This class also includes: - slaughtering and processing of whales on land or on specialised vessels - production of hides and skins originating from slaughterhouses (e.g. by fellmongery and salting) - rendering and refining of lard and other edible animal fats - processing of animal offal - production of pulled wool
CoreContentNote: This class includes: - operation of slaughterhouses engaged in killing, dressing or packing meat: beef, pork, lamb, rabbit, mutton, camel, etc. - production of fresh, chilled or frozen meat, in carcasses - production of fresh, chilled or frozen meat, in cuts
Exclusion Note: This class excludes: - rendering of edible poultry fats, see 10.12 - production of dried, salted or smoked meat, and meat products, see 10.13
broader: Processing and preserving of meat and production of meat products
in scheme: Statistical Classification of Economic Activities in the European Community, Rev. 2.1 (NACE Rev. 2.1)
Notation: 10.11
top concept of: Statistical Classification of Economic Activities in the European Community, Rev. 2.1 (NACE Rev. 2.1)

ConceptNoneRandom0.040733566736417925
type: ConceptAssociation
description: NACE Rev. 2.1 group 16.2 is mapped to NACE Rev. 2 group 16.2
Type: 5:5
Source Concept: Manufacture of products of wood, cork, straw and plaiting materials
Target Concept: http://data.europa.eu/ux2/nace2/162
in scheme: Statistical Classification of Economic Activities in the European Community, Rev. 2.1 (NACE Rev. 2.1)
top concept of: Statistical Classification of Economic Activities in the European Community, Rev. 2.1 (NACE Rev. 2.1)
Mapping Cardinality: n m

ConceptNoneRandom0.6564603289647338
type: ConceptAssociation
description: NACE Rev. 2.1 class 24.34 is mapped to NACE Rev. 2 class 24.34
Type: 1:1
Source Concept: Cold drawing of wire
Target Concept: http://data.europa.eu/ux2/nace2/2434
in scheme: Statistical Classification of Economic Activities in the European Community, Rev. 2.1 (NACE Rev. 2.1)
scope note: the content of the NACE Rev 2.1 class is fully covered in the corresponding NACE Rev 2 class
top concept of: Statistical Classification of Economic Activities in the European Community, Rev. 2.1 (NACE Rev. 2.1)
Mapping Cardinality: 1 1

ConceptNoneRandom0.5426632100982537
type: ConceptAssociation
description: NACE Rev. 2.1 class 46.11 is mapped to NACE Rev. 2 classes 46.11, 82.99
Type: 78:65
Source Concept: Activities of agents involved in the wholesale of agricultural raw materials, live animals, textile raw materials and semi-finished goods
Target Concept: http://data.europa.eu/ux2/nace2/4611
Target Concept: http://data.europa.eu/ux2/nace2/8299
in scheme: Statistical Classification of Economic Activities in the European Community, Rev. 2.1 (NACE Rev. 2.1)
scope note: 46.11: - activities of agents involved in the wholesale of livestock feed - activities of agents involved in wholesale auctions for fur skin 82.99: - activities of independent auctioneers
top concept of: Statistical Classification of Economic Activities in the European Community, Rev. 2.1 (NACE Rev. 2.1)
Mapping Cardinality: n m

ConceptNoneRandom0.2622127892134283
type: ConceptAssociation
description: NACE Rev. 2.1 class 23.45 is mapped to NACE Rev. 2 class 23.49
Type: 1:1
Source Concept: Manufacture of other ceramic products
Target Concept: http://data.europa.eu/ux2/nace2/2349
in scheme: Statistical Classification of Economic Activities in the European Community, Rev. 2.1 (NACE Rev. 2.1)
scope note: the content of the NACE Rev 2.1 class is fully covered in the corresponding NACE Rev 2 class
top concept of: Statistical Classification of Economic Activities in the European Community, Rev. 2.1 (NACE Rev. 2.1)
Mapping Cardinality: 1 1

ConceptNoneRandom0.460463185708058
type: ConceptAssociation
description: NACE Rev. 2.1 class 22.12 is mapped to NACE Rev. 2 class 22.19
Type: 17:12
Source Concept: Manufacture of other rubber products
Target Concept: http://data.europa.eu/ux2/nace2/2219
in scheme: Statistical Classification of Economic Activities in the European Community, Rev. 2.1 (NACE Rev. 2.1)
scope note: the content of the NACE Rev 2.1 class is fully covered in the corresponding NACE Rev 2 class
top concept of: Statistical Classification of Economic Activities in the European Community, Rev. 2.1 (NACE Rev. 2.1)
Mapping Cardinality: n m

ConceptNoneRandom0.7171831073671981
type: ConceptAssociation
description: NACE Rev. 2.1 class 01.22 is mapped to NACE Rev. 2 class 01.22
Type: 1:1
Source Concept: Growing of tropical and subtropical fruits
Target Concept: http://data.europa.eu/ux2/nace2/0122
in scheme: Statistical Classification of Economic Activities in the European Community, Rev. 2.1 (NACE Rev. 2.1)
scope note: the content of the NACE Rev 2.1 class is fully covered in the corresponding NACE Rev 2 class
top concept of: Statistical Classification of Economic Activities in the European Community, Rev. 2.1 (NACE Rev. 2.1)
Mapping Cardinality: 1 1

ConceptNoneRandom0.780530914135027
type: ConceptAssociation
description: NACE Rev. 2.1 class 25.63 is mapped to NACE Rev. 2 class 25.73
Type: 1:1
Source Concept: Manufacture of tools
Target Concept: http://data.europa.eu/ux2/nace2/2573
in scheme: Statistical Classification of Economic Activities in the European Community, Rev. 2.1 (NACE Rev. 2.1)
scope note: the content of the NACE Rev 2.1 class is fully covered in the corresponding NACE Rev 2 class
top concept of: Statistical Classification of Economic Activities in the European Community, Rev. 2.1 (NACE Rev. 2.1)
Mapping Cardinality: 1 1

Support activities for petroleum and natural gas extraction
type: Concept
Additional Content Note: This class also includes: - firefighting services and fire-prevention services for oilfields and gas fields
CoreContentNote: This class includes: - oil and gas extraction service activities provided on a fee or contract basis: • exploration services in connection with petroleum or gas extraction (e.g. traditional prospecting methods, making geological observations at prospective sites) • directional drilling and redrilling; 'spudding in'; derrick erection in situ, repairing and dismantling; cementing oil and gas well casings; pumping of wells; plugging and abandoning wells, etc. • liquefaction and regasification of natural gas for the purpose of transport, done at the mine site • draining and pumping services on a fee or contract basis • test drilling in connection with petroleum or gas extraction
Exclusion Note: This class excludes: - service activities performed by operators of oilfields or gas fields, see 06.10, 06.20 - specialised repair and maintenance of drilling and extraction machinery and equipment, see 33.12 - specialised offshore installation, repair and maintenance of equipment that forms an integral part of floating platforms, see division 43 - liquefaction and regasification of natural gas for the purpose of land or water transport, not done at the mine site, see 52.21 or 52.22 - geophysical surveying services, on a contract or fee basis, see 71.12
broader: Support activities for petroleum and natural gas extraction
in scheme: Statistical Classification of Economic Activities in the European Community, Rev. 2.1 (NACE Rev. 2.1)
Notation: 09.10
top concept of: Statistical Classification of Economic Activities in the European Community, Rev. 2.1 (NACE Rev. 2.1)

ConceptNoneRandom0.9686850029342338
type: ConceptAssociation
description: NACE Rev. 2.1 group 82.2 is mapped to NACE Rev. 2 group 82.2
Type: 1:1
Source Concept: Activities of call centres
Target Concept: http://data.europa.eu/ux2/nace2/822
in scheme: Statistical Classification of Economic Activities in the European Community, Rev. 2.1 (NACE Rev. 2.1)
top concept of: Statistical Classification of Economic Activities in the European Community, Rev. 2.1 (NACE Rev. 2.1)
Mapping Cardinality: 1 1

Real estate activities on a fee or contract basis
type: Concept
broader: Real estate activities
in scheme: Statistical Classification of Economic Activities in the European Community, Rev. 2.1 (NACE Rev. 2.1)
Notation: 68.3
top concept of: Statistical Classification of Economic Activities in the European Community, Rev. 2.1 (NACE Rev. 2.1)

Wholesale of information and communication equipment
type: Concept
Exclusion Note: This group excludes: - activities of wholesalers who do not assume ownership of the goods they trade, see 46.1
broader: Wholesale trade
in scheme: Statistical Classification of Economic Activities in the European Community, Rev. 2.1 (NACE Rev. 2.1)
Notation: 46.5
top concept of: Statistical Classification of Economic Activities in the European Community, Rev. 2.1 (NACE Rev. 2.1)

Retail sale of motor vehicles
type: Concept
Additional Content Note: This class also includes: - retail sale of off-road motor vehicles - retail sale of trailers for motor vehicles
CoreContentNote: This class includes: - retail sale of new and used motor vehicles, including electric vehicles: • passenger motor vehicles • camping vehicles (e.g. caravans, motorhomes)
Exclusion Note: This class excludes: - retail sale of bicycles and electric bicycles etc., see 47.63 - retail sale of parts and accessories for motor vehicles, see 47.82 - retail sale of motorcycles, motorcycle parts and accessories, see 47.83 - activities of agents for the retail sale of motor vehicles, see 47.9 - on-demand passenger transport service activities by vehicle with a driver, see 49.33 - rental and leasing of motor vehicles without a driver, see 77.1 - maintenance and repair of motor vehicles and motorcycles, see 95.3
broader: Retail sale of motor vehicles, motorcycles and related parts and accessories
in scheme: Statistical Classification of Economic Activities in the European Community, Rev. 2.1 (NACE Rev. 2.1)
Notation: 47.81
top concept of: Statistical Classification of Economic Activities in the European Community, Rev. 2.1 (NACE Rev. 2.1)

Installation of industrial machinery and equipment
type: Concept
broader: Repair, maintenance and installation of machinery and equipment
in scheme: Statistical Classification of Economic Activities in the European Community, Rev. 2.1 (NACE Rev. 2.1)
Notation: 33.2
top concept of: Statistical Classification of Economic Activities in the European Community, Rev. 2.1 (NACE Rev. 2.1)

Construction of railways and underground railways
type: Concept
CoreContentNote: This class includes: - construction of railways, underground railways and subways - construction of electricity overhead lines and conductor rails for railways
Exclusion Note: This class excludes: - installation of lighting and electrical signals, see 43.21 - project management for construction, see 71.1 - engineering activities, see 71.12
broader: Construction of roads and railways
in scheme: Statistical Classification of Economic Activities in the European Community, Rev. 2.1 (NACE Rev. 2.1)
Notation: 42.12
top concept of: Statistical Classification of Economic Activities in the European Community, Rev. 2.1 (NACE Rev. 2.1)

ConceptNoneRandom0.637000019645196
type: ConceptAssociation
description: NACE Rev. 2.1 class 11.03 is mapped to NACE Rev. 2 class 11.03
Type: 1:1
Source Concept: Manufacture of cider and other fruit fermented beverages
Target Concept: http://data.europa.eu/ux2/nace2/1103
in scheme: Statistical Classification of Economic Activities in the European Community, Rev. 2.1 (NACE Rev. 2.1)
scope note: the content of the NACE Rev 2.1 class is fully covered in the corresponding NACE Rev 2 class
top concept of: Statistical Classification of Economic Activities in the European Community, Rev. 2.1 (NACE Rev. 2.1)
Mapping Cardinality: 1 1

ConceptNoneRandom0.17277251134498983
type: ConceptAssociation
description: NACE Rev. 2.1 class 13.20 is mapped to NACE Rev. 2 class 13.20
Type: 4:4
Source Concept: Weaving of textiles
Target Concept: http://data.europa.eu/ux2/nace2/1320
in scheme: Statistical Classification of Economic Activities in the European Community, Rev. 2.1 (NACE Rev. 2.1)
scope note: the content of the NACE Rev 2.1 class is fully covered in the corresponding NACE Rev 2 class
top concept of: Statistical Classification of Economic Activities in the European Community, Rev. 2.1 (NACE Rev. 2.1)
Mapping Cardinality: n m

ConceptNoneRandom0.30384799216653446
type: ConceptAssociation
description: NACE Rev. 2.1 class 11.02 is mapped to NACE Rev. 2 class 11.02
Type: 1:1
Source Concept: Manufacture of wine from grape
Target Concept: http://data.europa.eu/ux2/nace2/1102
in scheme: Statistical Classification of Economic Activities in the European Community, Rev. 2.1 (NACE Rev. 2.1)
scope note: the content of the NACE Rev 2.1 class is fully covered in the corresponding NACE Rev 2 class
top concept of: Statistical Classification of Economic Activities in the European Community, Rev. 2.1 (NACE Rev. 2.1)
Mapping Cardinality: 1 1

Rental and leasing of other personal and household goods
type: Concept
CoreContentNote: This class includes: - rental of all kinds of household or personal goods (except recreational and sports equipment), to households or industries: • textiles, wearing apparel and footwear (e.g. curtains, costumes, wedding dresses and shoes) • furniture, pottery and glass, kitchen and tableware, electrical appliances and housewares • jewellery, musical instruments, scenery and costumes • books, journals and magazines • machinery and equipment used by amateurs (e.g. tools for home repairs) • flowers and plants • electronic equipment for household use - rental of video games, videotapes, discs, records, etc. - rental of gazebos and tensile structures without additional services
Exclusion Note: This class excludes: - providing accommodation services in tents, see 55.30 - provision of online games by the publisher (not only one-time purchases but also subscriptions as well as in-game purchases and in-app purchases), see 58.21 - operation of online gaming / video game sites, independent of publishing the games, see 60.39 - rental of cars, motorcycles, trucks, utility trailers, and recreational vehicles without a driver, see 77.1 - rental of sports and recreational goods, see 77.21 - rental of office furniture, see 77.33 - rental of caravans, see 77.39 - rental of tents for events, see 77.39
broader: Rental and leasing of personal and household goods
in scheme: Statistical Classification of Economic Activities in the European Community, Rev. 2.1 (NACE Rev. 2.1)
Notation: 77.22
top concept of: Statistical Classification of Economic Activities in the European Community, Rev. 2.1 (NACE Rev. 2.1)

Support activities for crop production
type: Concept
Additional Content Note: This class also includes: - provision of agricultural machinery with operators and crew - maintenance of own or leased land, keeping it in good condition without agricultural production
CoreContentNote: This class includes: - crop production activities on a fee or contract basis: • preparation of fields • establishing a crop • treatment of crops • crop spraying, including by air • trimming of fruit trees and vines • transplanting of rice; thinning of beets • harvesting • pest control (including of rabbits) in connection with agriculture - operation of agricultural irrigation equipment
Exclusion Note: This class excludes: - post-harvest crop activities, see 01.63 - drainage of agricultural land, see 43.12 - landscape architecture, see 71.11 - activities of agronomists and agricultural economists, see 74.99 - landscape gardening; planting, see 81.30 - organisation of agricultural shows and fairs, see 82.30
broader: Support activities to agriculture and post-harvest crop activities
in scheme: Statistical Classification of Economic Activities in the European Community, Rev. 2.1 (NACE Rev. 2.1)
Notation: 01.61
top concept of: Statistical Classification of Economic Activities in the European Community, Rev. 2.1 (NACE Rev. 2.1)

ConceptNoneRandom0.23799865870791514
type: ConceptAssociation
description: NACE Rev. 2.1 class 69.20 is mapped to NACE Rev. 2 class 69.20
Type: 1:1
Source Concept: Accounting, bookkeeping and auditing activities; tax consultancy
Target Concept: http://data.europa.eu/ux2/nace2/6920
in scheme: Statistical Classification of Economic Activities in the European Community, Rev. 2.1 (NACE Rev. 2.1)
scope note: the content of the NACE Rev 2.1 class is fully covered in the corresponding NACE Rev 2 class
top concept of: Statistical Classification of Economic Activities in the European Community, Rev. 2.1 (NACE Rev. 2.1)
Mapping Cardinality: 1 1

Programming, broadcasting, news agency and other content distribution activities
type: Concept
CoreContentNote: This division includes the activities of creating content or acquiring the right to distribute content and subsequently broadcasting or distributing that content. Types of produced or distributed content included in this division are radio, television, audio and audiovisual entertainment, news, talk, etc., including programmes that are typically narrowcast in nature (programmes that appeal to a particular segment of the population, such as news, sport, education, youth-oriented programming). The broadcasting or content distribution can be performed using different technologies, over-the-air, via satellite, via a cable network or via the internet broadcasting, streaming or downloads. This division also includes the broadcasting of live podcasts, third-party on-demand distribution of recorded podcasts and downloads, and activities of news agencies, social network sites, blogs and wiki sites, and online gaming / video game sites. Content may be made freely available to users or may be available only on a subscription or fee basis.
Exclusion Note: This division excludes: the operation of cable or satellite television transmission networks (division 61); the production of audio and audiovisual recordings (including recorded podcasts), activities of vlog sites and the distribution of motion pictures, videos or audiovisual works and similar productions to motion picture theatres, television networks and stations, and exhibitors (division 59); wholesale/retail sale of audio and video recordings on physical media (divisions 46 and 47); retail sale outlets of newspapers (division 47); videodisc rental (division 77); activities of independent actors (including influencers appearing in vlogs) and independent bloggers (division 90); publishing of video games and other software (division 58); provision of computing infrastructure and hosting activities, and activities of web search portals (division 63); activities of gambling sites (division 92).
broader: PUBLISHING, BROADCASTING, AND CONTENT PRODUCTION AND DISTRIBUTION ACTIVITIES
in scheme: Statistical Classification of Economic Activities in the European Community, Rev. 2.1 (NACE Rev. 2.1)
Notation: 60
top concept of: Statistical Classification of Economic Activities in the European Community, Rev. 2.1 (NACE Rev. 2.1)

Installation of industrial machinery and equipment
type: Concept
Additional Content Note: This class also includes: - installation of large-scale shelving, warehouses (not as an integral part of building) - installation of stand-alone charging facilities
CoreContentNote: This class includes the specialised installation of machinery. However, the installation of equipment that forms an integral part of buildings or similar structures (for example, installation of escalators, electrical wiring, burglar-alarm systems or air-conditioning systems) is classified as construction. This class includes: - installation of industrial machinery in industrial plant - installation and assembly of industrial process control equipment - installation of other industrial equipment, e.g.: • communication equipment • mainframe and similar computers • irradiation and electromedical equipment, etc. - dismantling large-scale machinery and equipment - activities of millwrights - machine rigging - installation of bowling alley equipment - installation of warehouse machinery and equipment
Exclusion Note: This class excludes: - installation of charging facilities in wall-boxes, see section F - construction of complete warehouses, see 41.00 - installation of elevators, escalators, automated doors, vacuum cleaning systems, etc., see 43.24 - installation of doors, staircases, shopfittings, furniture, etc., see 43.32 - erection of structural steel for warehouse storage shelves, see 43.42 - installation (setting-up) of personal computers, see 62.90
broader: Installation of industrial machinery and equipment
in scheme: Statistical Classification of Economic Activities in the European Community, Rev. 2.1 (NACE Rev. 2.1)
Notation: 33.20
top concept of: Statistical Classification of Economic Activities in the European Community, Rev. 2.1 (NACE Rev. 2.1)

ConceptNoneRandom0.8440879001018925
type: ConceptAssociation
description: NACE Rev. 2.1 group 29.2 is mapped to NACE Rev. 2 group 29.2
Type: 1:1
Source Concept: Manufacture of bodies and coachwork for motor vehicles; manufacture of trailers and semi-trailers
Target Concept: http://data.europa.eu/ux2/nace2/292
in scheme: Statistical Classification of Economic Activities in the European Community, Rev. 2.1 (NACE Rev. 2.1)
top concept of: Statistical Classification of Economic Activities in the European Community, Rev. 2.1 (NACE Rev. 2.1)
Mapping Cardinality: 1 1

ConceptNoneRandom0.40543228308276535
type: ConceptAssociation
description: NACE Rev. 2.1 class 01.21 is mapped to NACE Rev. 2 class 01.21
Type: 1:1
Source Concept: Growing of grapes
Target Concept: http://data.europa.eu/ux2/nace2/0121
in scheme: Statistical Classification of Economic Activities in the European Community, Rev. 2.1 (NACE Rev. 2.1)
scope note: the content of the NACE Rev 2.1 class is fully covered in the corresponding NACE Rev 2 class
top concept of: Statistical Classification of Economic Activities in the European Community, Rev. 2.1 (NACE Rev. 2.1)
Mapping Cardinality: 1 1

ConceptNoneRandom0.2818080043234116
type: ConceptAssociation
description: NACE Rev. 2.1 class 24.31 is mapped to NACE Rev. 2 class 24.31
Type: 1:1
Source Concept: Cold drawing of bars
Target Concept: http://data.europa.eu/ux2/nace2/2431
in scheme: Statistical Classification of Economic Activities in the European Community, Rev. 2.1 (NACE Rev. 2.1)
scope note: the content of the NACE Rev 2.1 class is fully covered in the corresponding NACE Rev 2 class
top concept of: Statistical Classification of Economic Activities in the European Community, Rev. 2.1 (NACE Rev. 2.1)
Mapping Cardinality: 1 1

Hotels and similar accommodation
type: Concept
broader: Accommodation
in scheme: Statistical Classification of Economic Activities in the European Community, Rev. 2.1 (NACE Rev. 2.1)
Notation: 55.1
top concept of: Statistical Classification of Economic Activities in the European Community, Rev. 2.1 (NACE Rev. 2.1)

ConceptNoneRandom0.6573083399762264
type: ConceptAssociation
description: NACE Rev. 2.1 group 82.3 is mapped to NACE Rev. 2 group 82.3
Type: 5:5
Source Concept: Organisation of conventions and trade shows
Target Concept: http://data.europa.eu/ux2/nace2/823
in scheme: Statistical Classification of Economic Activities in the European Community, Rev. 2.1 (NACE Rev. 2.1)
top concept of: Statistical Classification of Economic Activities in the European Community, Rev. 2.1 (NACE Rev. 2.1)
Mapping Cardinality: n m

Construction of bridges and tunnels
type: Concept
CoreContentNote: This class includes: - construction of bridges (e.g. for elevated motorways and railways) - construction of tunnels, including those for motorways and railways
Exclusion Note: This class excludes: - construction of railways, see 42.12 - installation of lighting and electrical signals, see 43.21 - project management for construction, see 71.1 - engineering activities, see 71.12
broader: Construction of roads and railways
in scheme: Statistical Classification of Economic Activities in the European Community, Rev. 2.1 (NACE Rev. 2.1)
Notation: 42.13
top concept of: Statistical Classification of Economic Activities in the European Community, Rev. 2.1 (NACE Rev. 2.1)

Retail sale of motor vehicle parts and accessories
type: Concept
CoreContentNote: This class includes: - retail sale of new and used parts, equipment and accessories for motor vehicles
Exclusion Note: This class excludes: - retail sale of automotive fuel, see 47.30 - retail sale of motor vehicles, see 47.81 - maintenance and repair of motor vehicles and motorcycles, see 95.3
broader: Retail sale of motor vehicles, motorcycles and related parts and accessories
in scheme: Statistical Classification of Economic Activities in the European Community, Rev. 2.1 (NACE Rev. 2.1)
Notation: 47.82
top concept of: Statistical Classification of Economic Activities in the European Community, Rev. 2.1 (NACE Rev. 2.1)

Wholesale of other machinery, equipment and supplies
type: Concept
CoreContentNote: This group includes the wholesale of specialised machinery, equipment and supplies for all kinds of industries and general-purpose machinery, and parts thereof.
Exclusion Note: This group excludes: - activities of wholesalers who do not assume ownership of the goods they trade, see 46.1
broader: Wholesale trade
in scheme: Statistical Classification of Economic Activities in the European Community, Rev. 2.1 (NACE Rev. 2.1)
Notation: 46.6
top concept of: Statistical Classification of Economic Activities in the European Community, Rev. 2.1 (NACE Rev. 2.1)

ConceptNoneRandom0.1546033483952085
type: ConceptAssociation
description: NACE Rev. 2.1 class 11.01 is mapped to NACE Rev. 2 class 11.01
Type: 1:1
Source Concept: Distilling, rectifying and blending of spirits
Target Concept: http://data.europa.eu/ux2/nace2/1101
in scheme: Statistical Classification of Economic Activities in the European Community, Rev. 2.1 (NACE Rev. 2.1)
scope note: the content of the NACE Rev 2.1 class is fully covered in the corresponding NACE Rev 2 class
top concept of: Statistical Classification of Economic Activities in the European Community, Rev. 2.1 (NACE Rev. 2.1)
Mapping Cardinality: 1 1

Rental and leasing of recreational and sports goods
type: Concept
CoreContentNote: This class includes the rental of recreational and sports equipment, for example: - pleasure boats, moveable houseboats, canoes, sailing boats and yachts without an operator - bicycles, including bicycles with electrical assistance - skis
Exclusion Note: This class excludes: - rental of pleasure boats and sailing-boats with crew, see 50.10, 50.30 - provision of short-term accommodation in non-moveable houseboats, see 55.20 - rental of non-moveable houseboats as primary residences, see 68.20 - rental of videotapes and discs, see 77.22 - rental of other personal and household goods, see 77.22 - rental and leasing of water transport equipment for passengers or freight (e.g. boats, ships, hovercraft, without an operator), see 77.34 - rental of leisure and pleasure equipment as an integral part of recreational facilities, see 93.29
broader: Rental and leasing of personal and household goods
in scheme: Statistical Classification of Economic Activities in the European Community, Rev. 2.1 (NACE Rev. 2.1)
Notation: 77.21
top concept of: Statistical Classification of Economic Activities in the European Community, Rev. 2.1 (NACE Rev. 2.1)

ConceptNoneRandom0.3789259319876993
type: ConceptAssociation
description: NACE Rev. 2.1 division 09 is mapped to NACE Rev. 2 division 09
Type: 1:1
Source Concept: Mining support service activities
Target Concept: http://data.europa.eu/ux2/nace2/09
in scheme: Statistical Classification of Economic Activities in the European Community, Rev. 2.1 (NACE Rev. 2.1)
top concept of: Statistical Classification of Economic Activities in the European Community, Rev. 2.1 (NACE Rev. 2.1)
Mapping Cardinality: 1 1

Support activities for animal production
type: Concept
Additional Content Note: This class also includes: - activities of farriers
CoreContentNote: This class includes: - animal production activities on a fee or contract basis: • activities to promote the propagation, growth and output of animals • herd testing services, droving services, agistment services, poultry caponising, coop cleaning, etc. • activities related to artificial insemination • stud services • sheep shearing • farm animal boarding and care
Exclusion Note: This class excludes: - provision of space for animal boarding only, see 68.20 - agricultural research activities, see 72.10 - veterinary activities, see 75.00 - vaccination of animals, see 75.00 - rental of animals (e.g. herds or racehorses), see 77.39 - pet boarding, see 96.99
broader: Support activities to agriculture and post-harvest crop activities
in scheme: Statistical Classification of Economic Activities in the European Community, Rev. 2.1 (NACE Rev. 2.1)
Notation: 01.62
top concept of: Statistical Classification of Economic Activities in the European Community, Rev. 2.1 (NACE Rev. 2.1)

ConceptNoneRandom0.751454078763258
type: ConceptAssociation
description: NACE Rev. 2.1 class 81.30 is mapped to NACE Rev. 2 class 81.30
Type: 1:1
Source Concept: Landscape service activities
Target Concept: http://data.europa.eu/ux2/nace2/8130
in scheme: Statistical Classification of Economic Activities in the European Community, Rev. 2.1 (NACE Rev. 2.1)
scope note: the content of the NACE Rev 2.1 class is fully covered in the corresponding NACE Rev 2 class
top concept of: Statistical Classification of Economic Activities in the European Community, Rev. 2.1 (NACE Rev. 2.1)
Mapping Cardinality: 1 1

Telecommunication
type: Concept
CoreContentNote: This division includes: - activities of providing telecommunication and related service activities, i.e. transmitting voice, data, text, sound and video. The transmission facilities that carry out these activities may be based on a single technology or a combination of technologies. The commonality of activities classified in this division is the transmission of content, without being involved in its creation or alteration. In the case of transmission of television signals this may include complete bundled and programmed channels (produced in division 60) into programme packages - provision of services for machine-to-machine communication - transmission of audio or video data without having acquired the rights to the audio or video content
Exclusion Note: This division excludes: - motion picture, audiovisual, television programme, and sound recording production and post-production activities, including services to convert audio and video content into streaming formats, see division 59 - activities of broadcasting and provision of audio and video streaming or download distribution services, see division 60
broader: TELECOMMUNICATION, COMPUTER PROGRAMMING, CONSULTING, COMPUTING INFRASTRUCTURE AND OTHER INFORMATION SERVICE ACTIVITIES
in scheme: Statistical Classification of Economic Activities in the European Community, Rev. 2.1 (NACE Rev. 2.1)
Notation: 61
top concept of: Statistical Classification of Economic Activities in the European Community, Rev. 2.1 (NACE Rev. 2.1)

ConceptNoneRandom0.1580573776146721
type: ConceptAssociation
description: NACE Rev. 2.1 group 29.3 is mapped to NACE Rev. 2 groups 23.1, 27.9, 28.1, 28.2, 29.3
Type: 18:19
Source Concept: Manufacture of motor vehicle parts and accessories
Target Concept: http://data.europa.eu/ux2/nace2/293
Target Concept: http://data.europa.eu/ux2/nace2/282
Target Concept: http://data.europa.eu/ux2/nace2/231
Target Concept: http://data.europa.eu/ux2/nace2/279
Target Concept: http://data.europa.eu/ux2/nace2/281
in scheme: Statistical Classification of Economic Activities in the European Community, Rev. 2.1 (NACE Rev. 2.1)
top concept of: Statistical Classification of Economic Activities in the European Community, Rev. 2.1 (NACE Rev. 2.1)
Mapping Cardinality: n m